Hospital Service Area,Hospital County,Operating Certificate Number,Permanent Facility Id,Facility Name,Age Group,Zip Code - 3 digits,Gender,Race,Ethnicity,Length of Stay,Type of Admission,Patient Disposition,Discharge Year,CCS Diagnosis Code,CCS Diagnosis Description,CCS Procedure Code,CCS Procedure Description,APR DRG Code,APR DRG Description,APR MDC Code,APR MDC Description,APR Severity of Illness Code,APR Severity of Illness Description,APR Risk of Mortality,APR Medical Surgical Description,Payment Typology 1,Payment Typology 2,Payment Typology 3,Birth Weight,Abortion Edit Indicator,Emergency Department Indicator,Total Charges,Total Costs
New York City,Manhattan,7002054,001464,New York-Presbyterian Hospital - Columbia Presbyterian Center,50 to 69,100,M,White,Spanish/Hispanic,42,Urgent,Home w/ Home Health Services,2022,DIG019,Other specified and unspecified liver disease,HEP011,LIVER TRANSPLANT,001,LIVER TRANSPLANT AND/OR INTESTINAL TRANSPLANT,07,DISEASES AND DISORDERS OF THE HEPATOBILIARY SYSTEM AND PANCREAS,4,Extreme,Extreme,Surgical,Medicare,,,,,N,1253172.72,390206.91
New York City,Manhattan,7002054,001464,New York-Presbyterian Hospital - Columbia Presbyterian Center,50 to 69,,F,Other Race,Not Span/Hispanic,11,Elective,Home or Self Care,2022,NEO017,Gastrointestinal cancers - liver,HEP011,LIVER TRANSPLANT,001,LIVER TRANSPLANT AND/OR INTESTINAL TRANSPLANT,07,DISEASES AND DISORDERS OF THE HEPATOBILIARY SYSTEM AND PANCREAS,2,Moderate,Major,Surgical,Medicare,Medicaid,,,,N,481052.45,146656.91
New York City,Manhattan,7002054,001464,New York-Presbyterian Hospital - Columbia Presbyterian Center,0 to 17,112,F,White,Not Span/Hispanic,17,Emergency,Home or Self Care,2022,MAL002,Digestive congenital anomalies,HEP011,LIVER TRANSPLANT,001,LIVER TRANSPLANT AND/OR INTESTINAL TRANSPLANT,07,DISEASES AND DISORDERS OF THE HEPATOBILIARY SYSTEM AND PANCREAS,4,Extreme,Extreme,Surgical,Medicaid,,,,,Y,576601.88,179368.25
New York City,Manhattan,7002054,001464,New York-Presbyterian Hospital - Columbia Presbyterian Center,50 to 69,104,M,Other Race,Not Span/Hispanic,70,Urgent,Inpatient Rehabilitation Facility,2022,DIG019,Other specified and unspecified liver disease,HEP011,LIVER TRANSPLANT,001,LIVER TRANSPLANT AND/OR INTESTINAL TRANSPLANT,07,DISEASES AND DISORDERS OF THE HEPATOBILIARY SYSTEM AND PANCREAS,4,Extreme,Extreme,Surgical,Private Health Insurance,,,,,N,2456539.62,828642.90
New York City,Manhattan,7002054,001464,New York-Presbyterian Hospital - Columbia Presbyterian Center,70 or Older,OOS,M,White,Not Span/Hispanic,14,Urgent,Home w/ Home Health Services,2022,DIG019,Other specified and unspecified liver disease,HEP011,LIVER TRANSPLANT,001,LIVER TRANSPLANT AND/OR INTESTINAL TRANSPLANT,07,DISEASES AND DISORDERS OF THE HEPATOBILIARY SYSTEM AND PANCREAS,3,Major,Extreme,Surgical,Medicare,,,,,N,744138.98,246318.63
New York City,Manhattan,7002054,001464,New York-Presbyterian Hospital - Columbia Presbyterian Center,50 to 69,OOS,M,White,Not Span/Hispanic,66,Urgent,Home w/ Home Health Services,2022,DIG018,Hepatic failure,HEP011,LIVER TRANSPLANT,001,LIVER TRANSPLANT AND/OR INTESTINAL TRANSPLANT,07,DISEASES AND DISORDERS OF THE HEPATOBILIARY SYSTEM AND PANCREAS,4,Extreme,Extreme,Surgical,Private Health Insurance,Private Health Insurance,,,,N,1883857.77,582456.76
New York City,Manhattan,7002054,001464,New York-Presbyterian Hospital - Columbia Presbyterian Center,50 to 69,113,M,Other Race,Unknown,10,Elective,Home w/ Home Health Services,2022,DIG019,Other specified and unspecified liver disease,HEP011,LIVER TRANSPLANT,001,LIVER TRANSPLANT AND/OR INTESTINAL TRANSPLANT,07,DISEASES AND DISORDERS OF THE HEPATOBILIARY SYSTEM AND PANCREAS,4,Extreme,Extreme,Surgical,Medicaid,,,,,N,477694.22,144141.83
New York City,Manhattan,7002054,001464,New York-Presbyterian Hospital - Columbia Presbyterian Center,70 or Older,137,F,White,Not Span/Hispanic,27,Elective,Inpatient Rehabilitation Facility,2022,DIG018,Hepatic failure,HEP011,LIVER TRANSPLANT,001,LIVER TRANSPLANT AND/OR INTESTINAL TRANSPLANT,07,DISEASES AND DISORDERS OF THE HEPATOBILIARY SYSTEM AND PANCREAS,3,Major,Major,Surgical,Medicare,Blue Cross/Blue Shield,,,,N,796856.04,293139.46
New York City,Manhattan,7002053,001463,NYU Langone Hospitals,50 to 69,112,M,White,Not Span/Hispanic,8,Emergency,Inpatient Rehabilitation Facility,2022,DIG018,Hepatic failure,HEP011,LIVER TRANSPLANT,001,LIVER TRANSPLANT AND/OR INTESTINAL TRANSPLANT,07,DISEASES AND DISORDERS OF THE HEPATOBILIARY SYSTEM AND PANCREAS,3,Major,Major,Surgical,Medicare,Blue Cross/Blue Shield,,,,N,829761.67,305456.57
New York City,Manhattan,7002053,001463,NYU Langone Hospitals,50 to 69,OOS,M,White,Not Span/Hispanic,4,Emergency,Home w/ Home Health Services,2022,INF007,Hepatitis,HEP011,LIVER TRANSPLANT,001,LIVER TRANSPLANT AND/OR INTESTINAL TRANSPLANT,07,DISEASES AND DISORDERS OF THE HEPATOBILIARY SYSTEM AND PANCREAS,3,Major,Major,Surgical,Medicare,Blue Cross/Blue Shield,,,,N,1014574.71,308158.67
New York City,Manhattan,7002053,001463,NYU Langone Hospitals,50 to 69,OOS,M,Other Race,Not Span/Hispanic,24,Emergency,Inpatient Rehabilitation Facility,2022,DIG018,Hepatic failure,HEP011,LIVER TRANSPLANT,001,LIVER TRANSPLANT AND/OR INTESTINAL TRANSPLANT,07,DISEASES AND DISORDERS OF THE HEPATOBILIARY SYSTEM AND PANCREAS,4,Extreme,Extreme,Surgical,Blue Cross/Blue Shield,,,,,Y,1606512.12,442970.60
New York City,Manhattan,7002054,001464,New York-Presbyterian Hospital - Columbia Presbyterian Center,50 to 69,OOS,M,White,Not Span/Hispanic,17,Elective,Home w/ Home Health Services,2022,NEO017,Gastrointestinal cancers - liver,HEP011,LIVER TRANSPLANT,001,LIVER TRANSPLANT AND/OR INTESTINAL TRANSPLANT,07,DISEASES AND DISORDERS OF THE HEPATOBILIARY SYSTEM AND PANCREAS,4,Extreme,Extreme,Surgical,Private Health Insurance,Blue Cross/Blue Shield,Private Health Insurance,,,N,578050.07,157511.52
New York City,Manhattan,7002053,001463,NYU Langone Hospitals,30 to 49,100,M,Other Race,Not Span/Hispanic,8,Emergency,Home w/ Home Health Services,2022,DIG019,Other specified and unspecified liver disease,HEP011,LIVER TRANSPLANT,001,LIVER TRANSPLANT AND/OR INTESTINAL TRANSPLANT,07,DISEASES AND DISORDERS OF THE HEPATOBILIARY SYSTEM AND PANCREAS,3,Major,Extreme,Surgical,Medicaid,,,,,N,1059399.37,324379.06
New York City,Manhattan,7002053,001463,NYU Langone Hospitals,30 to 49,100,F,Black/African American,Unknown,28,Emergency,Home w/ Home Health Services,2022,DIG023,Noninfectious hepatitis,HEP011,LIVER TRANSPLANT,001,LIVER TRANSPLANT AND/OR INTESTINAL TRANSPLANT,07,DISEASES AND DISORDERS OF THE HEPATOBILIARY SYSTEM AND PANCREAS,4,Extreme,Major,Surgical,Blue Cross/Blue Shield,,,,,Y,1493331.75,465879.57
New York City,Manhattan,7002053,001463,NYU Langone Hospitals,50 to 69,OOS,M,Other Race,Not Span/Hispanic,24,Emergency,Inpatient Rehabilitation Facility,2022,DIG019,Other specified and unspecified liver disease,HEP011,LIVER TRANSPLANT,001,LIVER TRANSPLANT AND/OR INTESTINAL TRANSPLANT,07,DISEASES AND DISORDERS OF THE HEPATOBILIARY SYSTEM AND PANCREAS,4,Extreme,Extreme,Surgical,Private Health Insurance,Medicare,,,,N,1691463.77,461990.36
New York City,Manhattan,7002054,001464,New York-Presbyterian Hospital - Columbia Presbyterian Center,50 to 69,114,F,Other Race,Not Span/Hispanic,13,Urgent,Home w/ Home Health Services,2022,DIG023,Noninfectious hepatitis,HEP011,LIVER TRANSPLANT,001,LIVER TRANSPLANT AND/OR INTESTINAL TRANSPLANT,07,DISEASES AND DISORDERS OF THE HEPATOBILIARY SYSTEM AND PANCREAS,4,Extreme,Extreme,Surgical,Private Health Insurance,,,,,N,626037.83,192468.57
New York City,Manhattan,7002054,001464,New York-Presbyterian Hospital - Columbia Presbyterian Center,70 or Older,OOS,M,White,Not Span/Hispanic,7,Urgent,Home or Self Care,2022,NEO017,Gastrointestinal cancers - liver,HEP011,LIVER TRANSPLANT,001,LIVER TRANSPLANT AND/OR INTESTINAL TRANSPLANT,07,DISEASES AND DISORDERS OF THE HEPATOBILIARY SYSTEM AND PANCREAS,1,Minor,Minor,Surgical,Medicare,Private Health Insurance,,,,N,436507.01,121263.04
New York City,Manhattan,7002054,001464,New York-Presbyterian Hospital - Columbia Presbyterian Center,0 to 17,OOS,M,Other Race,Not Span/Hispanic,23,Urgent,Home or Self Care,2022,DIG018,Hepatic failure,HEP011,LIVER TRANSPLANT,001,LIVER TRANSPLANT AND/OR INTESTINAL TRANSPLANT,07,DISEASES AND DISORDERS OF THE HEPATOBILIARY SYSTEM AND PANCREAS,4,Extreme,Moderate,Surgical,Private Health Insurance,,,,,N,1024256.52,348496.26
New York City,Manhattan,7002053,001463,NYU Langone Hospitals,50 to 69,114,M,Black/African American,Not Span/Hispanic,9,Emergency,Home w/ Home Health Services,2022,DIG018,Hepatic failure,HEP011,LIVER TRANSPLANT,001,LIVER TRANSPLANT AND/OR INTESTINAL TRANSPLANT,07,DISEASES AND DISORDERS OF THE HEPATOBILIARY SYSTEM AND PANCREAS,3,Major,Major,Surgical,Medicare,Blue Cross/Blue Shield,,,,N,867500.77,315593.33
New York City,Manhattan,7002054,001464,New York-Presbyterian Hospital - Columbia Presbyterian Center,30 to 49,104,F,Multi-racial,Spanish/Hispanic,14,Elective,Home w/ Home Health Services,2022,INJ036,"Complication of transplanted organs or tissue, initial encounter",HEP011,LIVER TRANSPLANT,001,LIVER TRANSPLANT AND/OR INTESTINAL TRANSPLANT,07,DISEASES AND DISORDERS OF THE HEPATOBILIARY SYSTEM AND PANCREAS,3,Major,Major,Surgical,Medicaid,,,,,N,544539.98,154596.45
New York City,Manhattan,7002054,001464,New York-Presbyterian Hospital - Columbia Presbyterian Center,30 to 49,OOS,M,White,Not Span/Hispanic,12,Elective,Home w/ Home Health Services,2022,DIG019,Other specified and unspecified liver disease,HEP011,LIVER TRANSPLANT,001,LIVER TRANSPLANT AND/OR INTESTINAL TRANSPLANT,07,DISEASES AND DISORDERS OF THE HEPATOBILIARY SYSTEM AND PANCREAS,3,Major,Major,Surgical,Private Health Insurance,,,,,N,481229.14,159258.84
New York City,Manhattan,7002054,001464,New York-Presbyterian Hospital - Columbia Presbyterian Center,50 to 69,100,F,Other Race,Spanish/Hispanic,30,Elective,Home or Self Care,2022,DIG017,Biliary tract disease,HEP011,LIVER TRANSPLANT,001,LIVER TRANSPLANT AND/OR INTESTINAL TRANSPLANT,07,DISEASES AND DISORDERS OF THE HEPATOBILIARY SYSTEM AND PANCREAS,4,Extreme,Major,Surgical,Medicare,Medicaid,,,,N,943716.20,312623.39
New York City,Manhattan,7002054,001464,New York-Presbyterian Hospital - Columbia Presbyterian Center,50 to 69,OOS,M,Other Race,Not Span/Hispanic,26,Urgent,Home or Self Care,2022,NEO017,Gastrointestinal cancers - liver,HEP011,LIVER TRANSPLANT,001,LIVER TRANSPLANT AND/OR INTESTINAL TRANSPLANT,07,DISEASES AND DISORDERS OF THE HEPATOBILIARY SYSTEM AND PANCREAS,4,Extreme,Extreme,Surgical,Medicare,Medicaid,,,,Y,981581.17,366358.96
New York City,Manhattan,7002054,001464,New York-Presbyterian Hospital - Columbia Presbyterian Center,50 to 69,100,F,Other Race,Spanish/Hispanic,17,Elective,Home w/ Home Health Services,2022,DIG019,Other specified and unspecified liver disease,HEP011,LIVER TRANSPLANT,001,LIVER TRANSPLANT AND/OR INTESTINAL TRANSPLANT,07,DISEASES AND DISORDERS OF THE HEPATOBILIARY SYSTEM AND PANCREAS,4,Extreme,Major,Surgical,Medicare,,,,,N,629630.20,181991.97
Long Island,Nassau,2951001,000541,North Shore University Hospital,18 to 29,117,F,Black/African American,Not Span/Hispanic,24,Urgent,Home or Self Care,2022,DIG018,Hepatic failure,HEP011,LIVER TRANSPLANT,001,LIVER TRANSPLANT AND/OR INTESTINAL TRANSPLANT,07,DISEASES AND DISORDERS OF THE HEPATOBILIARY SYSTEM AND PANCREAS,4,Extreme,Major,Surgical,Medicaid,Medicaid,,,,N,1184046.61,210166.02
Long Island,Nassau,2951001,000541,North Shore University Hospital,50 to 69,118,M,Other Race,Spanish/Hispanic,28,Emergency,Home or Self Care,2022,DIG019,Other specified and unspecified liver disease,HEP011,LIVER TRANSPLANT,001,LIVER TRANSPLANT AND/OR INTESTINAL TRANSPLANT,07,DISEASES AND DISORDERS OF THE HEPATOBILIARY SYSTEM AND PANCREAS,3,Major,Major,Surgical,Medicare,Medicare,Medicaid,,,Y,937091.56,175649.04
Long Island,Nassau,2951001,000541,North Shore University Hospital,30 to 49,113,M,White,Not Span/Hispanic,11,Emergency,Home or Self Care,2022,DIG023,Noninfectious hepatitis,HEP011,LIVER TRANSPLANT,001,LIVER TRANSPLANT AND/OR INTESTINAL TRANSPLANT,07,DISEASES AND DISORDERS OF THE HEPATOBILIARY SYSTEM AND PANCREAS,3,Major,Major,Surgical,Blue Cross/Blue Shield,,,,,Y,705476.21,125085.53
Finger Lakes,Monroe,2701005,000413,Strong Memorial Hospital,30 to 49,129,M,White,Not Span/Hispanic,29,Emergency,Home or Self Care,2022,INJ024,"Sprains and strains, initial encounter",HEP011,LIVER TRANSPLANT,001,LIVER TRANSPLANT AND/OR INTESTINAL TRANSPLANT,08,DISEASES AND DISORDERS OF THE MUSCULOSKELETAL SYSTEM AND CONNECTIVE TISSUE,4,Extreme,Extreme,Surgical,Medicaid,,,,,Y,363585.02,167820.36
Finger Lakes,Monroe,2701005,000413,Strong Memorial Hospital,50 to 69,142,M,Other Race,Unknown,38,Urgent,Expired,2022,DIG018,Hepatic failure,HEP011,LIVER TRANSPLANT,001,LIVER TRANSPLANT AND/OR INTESTINAL TRANSPLANT,07,DISEASES AND DISORDERS OF THE HEPATOBILIARY SYSTEM AND PANCREAS,4,Extreme,Extreme,Surgical,Medicare,,,,,N,1025880.61,380907.56
Finger Lakes,Monroe,2701005,000413,Strong Memorial Hospital,50 to 69,130,M,Other Race,Unknown,10,Urgent,Home w/ Home Health Services,2022,DIG018,Hepatic failure,HEP011,LIVER TRANSPLANT,001,LIVER TRANSPLANT AND/OR INTESTINAL TRANSPLANT,07,DISEASES AND DISORDERS OF THE HEPATOBILIARY SYSTEM AND PANCREAS,3,Major,Major,Surgical,Blue Cross/Blue Shield,,,,,N,197247.92,102904.02
Finger Lakes,Monroe,2701005,000413,Strong Memorial Hospital,30 to 49,132,M,Other Race,Unknown,14,Urgent,Home or Self Care,2022,DIG018,Hepatic failure,HEP011,LIVER TRANSPLANT,001,LIVER TRANSPLANT AND/OR INTESTINAL TRANSPLANT,07,DISEASES AND DISORDERS OF THE HEPATOBILIARY SYSTEM AND PANCREAS,4,Extreme,Major,Surgical,Medicaid,,,,,N,242497.48,124425.91
Finger Lakes,Monroe,2701005,000413,Strong Memorial Hospital,50 to 69,144,F,White,Not Span/Hispanic,68,Emergency,Home w/ Home Health Services,2022,DIG018,Hepatic failure,HEP011,LIVER TRANSPLANT,001,LIVER TRANSPLANT AND/OR INTESTINAL TRANSPLANT,07,DISEASES AND DISORDERS OF THE HEPATOBILIARY SYSTEM AND PANCREAS,4,Extreme,Extreme,Surgical,Blue Cross/Blue Shield,,,,,Y,519308.61,216502.13
Finger Lakes,Monroe,2701005,000413,Strong Memorial Hospital,50 to 69,146,M,White,Not Span/Hispanic,9,Urgent,Expired,2022,DIG019,Other specified and unspecified liver disease,HEP011,LIVER TRANSPLANT,001,LIVER TRANSPLANT AND/OR INTESTINAL TRANSPLANT,07,DISEASES AND DISORDERS OF THE HEPATOBILIARY SYSTEM AND PANCREAS,4,Extreme,Extreme,Surgical,Medicare,,,,,N,309652.19,141100.48
New York City,Manhattan,7002053,001463,NYU Langone Hospitals,50 to 69,112,M,Other Race,Not Span/Hispanic,10,Emergency,Inpatient Rehabilitation Facility,2022,INF007,Hepatitis,HEP011,LIVER TRANSPLANT,001,LIVER TRANSPLANT AND/OR INTESTINAL TRANSPLANT,07,DISEASES AND DISORDERS OF THE HEPATOBILIARY SYSTEM AND PANCREAS,4,Extreme,Extreme,Surgical,Medicaid,,,,,N,1087891.20,340451.82
New York City,Manhattan,7002053,001463,NYU Langone Hospitals,50 to 69,OOS,M,Other Race,Spanish/Hispanic,21,Emergency,Home w/ Home Health Services,2022,NEO017,Gastrointestinal cancers - liver,HEP011,LIVER TRANSPLANT,001,LIVER TRANSPLANT AND/OR INTESTINAL TRANSPLANT,07,DISEASES AND DISORDERS OF THE HEPATOBILIARY SYSTEM AND PANCREAS,4,Extreme,Extreme,Surgical,Medicare,Private Health Insurance,,,,N,1689158.52,451663.63
New York City,Manhattan,7002054,001464,New York-Presbyterian Hospital - Columbia Presbyterian Center,0 to 17,109,M,White,Not Span/Hispanic,62,Emergency,Home or Self Care,2022,PNL013,Other specified and unspecified perinatal conditions,HEP011,LIVER TRANSPLANT,001,LIVER TRANSPLANT AND/OR INTESTINAL TRANSPLANT,23,FACTORS INFLUENCING HEALTH STATUS AND OTHER CONTACTS WITH HEALTH SERVICES,4,Extreme,Extreme,Surgical,Medicaid,,,03400,,Y,2561175.63,1026885.95
New York City,Manhattan,7002054,001464,New York-Presbyterian Hospital - Columbia Presbyterian Center,50 to 69,OOS,F,Other Race,Spanish/Hispanic,14,Urgent,Home w/ Home Health Services,2022,DIG019,Other specified and unspecified liver disease,HEP011,LIVER TRANSPLANT,001,LIVER TRANSPLANT AND/OR INTESTINAL TRANSPLANT,07,DISEASES AND DISORDERS OF THE HEPATOBILIARY SYSTEM AND PANCREAS,4,Extreme,Extreme,Surgical,Medicaid,,,,,N,516394.82,147366.95
New York City,Manhattan,7002053,001463,NYU Langone Hospitals,30 to 49,OOS,M,Other Race,Not Span/Hispanic,20,Emergency,Home or Self Care,2022,DIG019,Other specified and unspecified liver disease,HEP011,LIVER TRANSPLANT,001,LIVER TRANSPLANT AND/OR INTESTINAL TRANSPLANT,07,DISEASES AND DISORDERS OF THE HEPATOBILIARY SYSTEM AND PANCREAS,3,Major,Major,Surgical,Private Health Insurance,,,,,N,1322259.16,409768.45
New York City,Manhattan,7002053,001463,NYU Langone Hospitals,50 to 69,OOS,F,Black/African American,Not Span/Hispanic,20,Emergency,Inpatient Rehabilitation Facility,2022,DIG018,Hepatic failure,HEP011,LIVER TRANSPLANT,001,LIVER TRANSPLANT AND/OR INTESTINAL TRANSPLANT,07,DISEASES AND DISORDERS OF THE HEPATOBILIARY SYSTEM AND PANCREAS,3,Major,Extreme,Surgical,Blue Cross/Blue Shield,Private Health Insurance,,,,N,1271891.30,401100.14
New York City,Manhattan,7002054,001464,New York-Presbyterian Hospital - Columbia Presbyterian Center,0 to 17,112,M,White,Not Span/Hispanic,11,Elective,Home or Self Care,2022,DIG019,Other specified and unspecified liver disease,HEP011,LIVER TRANSPLANT,001,LIVER TRANSPLANT AND/OR INTESTINAL TRANSPLANT,07,DISEASES AND DISORDERS OF THE HEPATOBILIARY SYSTEM AND PANCREAS,3,Major,Major,Surgical,Medicaid,,,,,N,443000.75,136669.95
New York City,Manhattan,7002054,001464,New York-Presbyterian Hospital - Columbia Presbyterian Center,50 to 69,128,M,White,Not Span/Hispanic,19,Urgent,Home or Self Care,2022,DIG019,Other specified and unspecified liver disease,HEP011,LIVER TRANSPLANT,001,LIVER TRANSPLANT AND/OR INTESTINAL TRANSPLANT,07,DISEASES AND DISORDERS OF THE HEPATOBILIARY SYSTEM AND PANCREAS,4,Extreme,Extreme,Surgical,Blue Cross/Blue Shield,,,,,N,586384.57,157638.08
Finger Lakes,Monroe,2701005,000413,Strong Memorial Hospital,50 to 69,137,M,Other Race,Unknown,32,Urgent,Home or Self Care,2022,DIG019,Other specified and unspecified liver disease,HEP011,LIVER TRANSPLANT,001,LIVER TRANSPLANT AND/OR INTESTINAL TRANSPLANT,07,DISEASES AND DISORDERS OF THE HEPATOBILIARY SYSTEM AND PANCREAS,4,Extreme,Extreme,Surgical,Medicare,Blue Cross/Blue Shield,,,,N,379214.23,177025.38
Long Island,Nassau,2951001,000541,North Shore University Hospital,30 to 49,116,M,Other Race,Spanish/Hispanic,19,Emergency,Home w/ Home Health Services,2022,DIG018,Hepatic failure,HEP011,LIVER TRANSPLANT,001,LIVER TRANSPLANT AND/OR INTESTINAL TRANSPLANT,07,DISEASES AND DISORDERS OF THE HEPATOBILIARY SYSTEM AND PANCREAS,4,Extreme,Major,Surgical,Medicaid,Medicaid,,,,Y,790046.54,139597.17
Long Island,Nassau,2951001,000541,North Shore University Hospital,30 to 49,117,M,White,Not Span/Hispanic,17,Urgent,Home or Self Care,2022,DIG018,Hepatic failure,HEP011,LIVER TRANSPLANT,001,LIVER TRANSPLANT AND/OR INTESTINAL TRANSPLANT,07,DISEASES AND DISORDERS OF THE HEPATOBILIARY SYSTEM AND PANCREAS,4,Extreme,Major,Surgical,Private Health Insurance,Blue Cross/Blue Shield,,,,N,734034.94,127949.79
Finger Lakes,Monroe,2701005,000413,Strong Memorial Hospital,30 to 49,142,M,Other Race,Unknown,7,Urgent,Home or Self Care,2022,DIG018,Hepatic failure,HEP011,LIVER TRANSPLANT,001,LIVER TRANSPLANT AND/OR INTESTINAL TRANSPLANT,07,DISEASES AND DISORDERS OF THE HEPATOBILIARY SYSTEM AND PANCREAS,3,Major,Major,Surgical,Medicaid,,,,,N,197128.13,103589.71
Finger Lakes,Monroe,2701005,000413,Strong Memorial Hospital,50 to 69,140,F,Other Race,Unknown,10,Elective,Home or Self Care,2022,DIG018,Hepatic failure,HEP011,LIVER TRANSPLANT,001,LIVER TRANSPLANT AND/OR INTESTINAL TRANSPLANT,07,DISEASES AND DISORDERS OF THE HEPATOBILIARY SYSTEM AND PANCREAS,3,Major,Major,Surgical,Private Health Insurance,,,,,N,214716.41,109437.69
Finger Lakes,Monroe,2701005,000413,Strong Memorial Hospital,50 to 69,144,M,White,Not Span/Hispanic,8,Urgent,Home w/ Home Health Services,2022,DIG018,Hepatic failure,HEP011,LIVER TRANSPLANT,001,LIVER TRANSPLANT AND/OR INTESTINAL TRANSPLANT,07,DISEASES AND DISORDERS OF THE HEPATOBILIARY SYSTEM AND PANCREAS,4,Extreme,Major,Surgical,Private Health Insurance,,,,,N,162208.28,85783.33
New York City,Manhattan,7002054,001464,New York-Presbyterian Hospital - Columbia Presbyterian Center,50 to 69,104,M,Other Race,Unknown,27,Emergency,Home w/ Home Health Services,2022,DIG019,Other specified and unspecified liver disease,HEP011,LIVER TRANSPLANT,001,LIVER TRANSPLANT AND/OR INTESTINAL TRANSPLANT,07,DISEASES AND DISORDERS OF THE HEPATOBILIARY SYSTEM AND PANCREAS,4,Extreme,Extreme,Surgical,Medicaid,,,,,Y,795913.79,232280.97
New York City,Manhattan,7002054,001464,New York-Presbyterian Hospital - Columbia Presbyterian Center,18 to 29,128,M,White,Not Span/Hispanic,25,Elective,Home or Self Care,2022,INJ036,"Complication of transplanted organs or tissue, initial encounter",HEP011,LIVER TRANSPLANT,001,LIVER TRANSPLANT AND/OR INTESTINAL TRANSPLANT,07,DISEASES AND DISORDERS OF THE HEPATOBILIARY SYSTEM AND PANCREAS,3,Major,Major,Surgical,Medicaid,,,,,Y,651415.80,174665.03
New York City,Manhattan,7002054,001464,New York-Presbyterian Hospital - Columbia Presbyterian Center,0 to 17,114,M,Black/African American,Not Span/Hispanic,13,Emergency,Home w/ Home Health Services,2022,DIG017,Biliary tract disease,HEP011,LIVER TRANSPLANT,001,LIVER TRANSPLANT AND/OR INTESTINAL TRANSPLANT,07,DISEASES AND DISORDERS OF THE HEPATOBILIARY SYSTEM AND PANCREAS,4,Extreme,Major,Surgical,Private Health Insurance,Blue Cross/Blue Shield,,,,Y,604188.22,188128.19
New York City,Manhattan,7002054,001464,New York-Presbyterian Hospital - Columbia Presbyterian Center,0 to 17,114,M,Black/African American,Not Span/Hispanic,120 +,Urgent,Home or Self Care,2022,DIG024,Postprocedural or postoperative digestive system complication,GIS023,GI TRANSPLANT,001,LIVER TRANSPLANT AND/OR INTESTINAL TRANSPLANT,06,DISEASES AND DISORDERS OF THE DIGESTIVE SYSTEM,4,Extreme,Major,Surgical,Medicaid,,,,,N,2964913.64,1051819.65
New York City,Manhattan,7002054,001464,New York-Presbyterian Hospital - Columbia Presbyterian Center,30 to 49,OOS,F,White,Not Span/Hispanic,23,Elective,Home or Self Care,2022,MAL002,Digestive congenital anomalies,HEP011,LIVER TRANSPLANT,001,LIVER TRANSPLANT AND/OR INTESTINAL TRANSPLANT,07,DISEASES AND DISORDERS OF THE HEPATOBILIARY SYSTEM AND PANCREAS,4,Extreme,Major,Surgical,Medicare,Private Health Insurance,,,,N,719322.94,207222.15
Finger Lakes,Monroe,2701005,000413,Strong Memorial Hospital,30 to 49,145,M,Other Race,Spanish/Hispanic,9,Urgent,Home w/ Home Health Services,2022,DIG018,Hepatic failure,HEP011,LIVER TRANSPLANT,001,LIVER TRANSPLANT AND/OR INTESTINAL TRANSPLANT,07,DISEASES AND DISORDERS OF THE HEPATOBILIARY SYSTEM AND PANCREAS,2,Moderate,Major,Surgical,Medicaid,,,,,N,205086.72,108609.49
Finger Lakes,Monroe,2701005,000413,Strong Memorial Hospital,30 to 49,148,M,Other Race,Not Span/Hispanic,41,Urgent,Inpatient Rehabilitation Facility,2022,DIG019,Other specified and unspecified liver disease,HEP011,LIVER TRANSPLANT,001,LIVER TRANSPLANT AND/OR INTESTINAL TRANSPLANT,07,DISEASES AND DISORDERS OF THE HEPATOBILIARY SYSTEM AND PANCREAS,4,Extreme,Extreme,Surgical,Medicaid,,,,,N,558560.15,242941.09
Finger Lakes,Monroe,2701005,000413,Strong Memorial Hospital,18 to 29,141,M,White,Not Span/Hispanic,24,Urgent,Expired,2022,DIG018,Hepatic failure,HEP011,LIVER TRANSPLANT,001,LIVER TRANSPLANT AND/OR INTESTINAL TRANSPLANT,07,DISEASES AND DISORDERS OF THE HEPATOBILIARY SYSTEM AND PANCREAS,4,Extreme,Extreme,Surgical,Blue Cross/Blue Shield,,,,,N,717637.92,287011.45
Finger Lakes,Monroe,2701005,000413,Strong Memorial Hospital,50 to 69,131,M,White,Not Span/Hispanic,9,Urgent,Inpatient Rehabilitation Facility,2022,DIG018,Hepatic failure,HEP011,LIVER TRANSPLANT,001,LIVER TRANSPLANT AND/OR INTESTINAL TRANSPLANT,07,DISEASES AND DISORDERS OF THE HEPATOBILIARY SYSTEM AND PANCREAS,4,Extreme,Extreme,Surgical,Medicare,Private Health Insurance,,,,N,234750.62,118537.47