Hospital Service Area,Hospital County,Operating Certificate Number,Permanent Facility Id,Facility Name,Age Group,Zip Code - 3 digits,Gender,Race,Ethnicity,Length of Stay,Type of Admission,Patient Disposition,Discharge Year,CCS Diagnosis Code,CCS Diagnosis Description,CCS Procedure Code,CCS Procedure Description,APR DRG Code,APR DRG Description,APR MDC Code,APR MDC Description,APR Severity of Illness Code,APR Severity of Illness Description,APR Risk of Mortality,APR Medical Surgical Description,Payment Typology 1,Payment Typology 2,Payment Typology 3,Birth Weight,Abortion Edit Indicator,Emergency Department Indicator,Total Charges,Total Costs
New York City,Manhattan,7002054,001464,New York-Presbyterian Hospital - Columbia Presbyterian Center,50 to 69,100,F,Black/African American,Not Span/Hispanic,5,Emergency,Home or Self Care,2022,EAR003,Diseases of inner ear and related conditions,,,111,VERTIGO AND OTHER LABYRINTH DISORDERS,03,"DISEASES AND DISORDERS OF THE EAR, NOSE, MOUTH AND THROAT",1,Minor,Minor,Medical,Medicare,,,,,Y,71215.15,15186.51
New York City,Manhattan,7002054,001464,New York-Presbyterian Hospital - Columbia Presbyterian Center,70 or Older,109,F,Other Race,Unknown,1,Emergency,Home or Self Care,2022,EAR003,Diseases of inner ear and related conditions,,,111,VERTIGO AND OTHER LABYRINTH DISORDERS,03,"DISEASES AND DISORDERS OF THE EAR, NOSE, MOUTH AND THROAT",1,Minor,Minor,Medical,Medicare,,,,,Y,28834.89,5684.53
New York City,Manhattan,7002054,001464,New York-Presbyterian Hospital - Columbia Presbyterian Center,70 or Older,100,F,White,Not Span/Hispanic,3,Emergency,Home w/ Home Health Services,2022,SYM015,General sensation/perception signs and symptoms,,,111,VERTIGO AND OTHER LABYRINTH DISORDERS,03,"DISEASES AND DISORDERS OF THE EAR, NOSE, MOUTH AND THROAT",2,Moderate,Major,Medical,Medicare,Private Health Insurance,,,,Y,60240.64,12690.76
New York City,Manhattan,7002001,001438,Bellevue Hospital Center,50 to 69,100,M,Other Race,Spanish/Hispanic,1,Emergency,Home or Self Care,2022,SYM015,General sensation/perception signs and symptoms,ADM015,ADMINISTRATION OF ANTIBIOTICS,111,VERTIGO AND OTHER LABYRINTH DISORDERS,03,"DISEASES AND DISORDERS OF THE EAR, NOSE, MOUTH AND THROAT",1,Minor,Minor,Medical,Medicare,Medicaid,,,,Y,11131.70,6401.66
New York City,Manhattan,7002054,001464,New York-Presbyterian Hospital - Columbia Presbyterian Center,50 to 69,100,F,White,Spanish/Hispanic,2,Urgent,Home or Self Care,2022,SYM015,General sensation/perception signs and symptoms,,,111,VERTIGO AND OTHER LABYRINTH DISORDERS,03,"DISEASES AND DISORDERS OF THE EAR, NOSE, MOUTH AND THROAT",1,Minor,Minor,Medical,Medicaid,,,,,Y,52745.03,10898.68
New York City,Manhattan,7002001,001438,Bellevue Hospital Center,50 to 69,112,M,Other Race,Spanish/Hispanic,1,Emergency,Left Against Medical Advice,2022,SYM015,General sensation/perception signs and symptoms,ADM021,"ADMINISTRATION OF THERAPEUTIC SUBSTANCES, NEC",111,VERTIGO AND OTHER LABYRINTH DISORDERS,03,"DISEASES AND DISORDERS OF THE EAR, NOSE, MOUTH AND THROAT",3,Major,Major,Medical,Medicare,Medicaid,,,,Y,17365.19,9986.44
New York City,Manhattan,7002053,001463,NYU Langone Hospitals,0 to 17,114,F,Other Race,Not Span/Hispanic,2,Emergency,Home or Self Care,2022,SYM015,General sensation/perception signs and symptoms,MAM011,ELECTROENCEPHALOGRAM (EEG),111,VERTIGO AND OTHER LABYRINTH DISORDERS,03,"DISEASES AND DISORDERS OF THE EAR, NOSE, MOUTH AND THROAT",1,Minor,Minor,Medical,Medicaid,,,,,Y,73379.30,10386.88
New York City,Manhattan,7002053,001463,NYU Langone Hospitals,70 or Older,100,F,White,Not Span/Hispanic,4,Emergency,Home or Self Care,2022,EAR003,Diseases of inner ear and related conditions,,,111,VERTIGO AND OTHER LABYRINTH DISORDERS,03,"DISEASES AND DISORDERS OF THE EAR, NOSE, MOUTH AND THROAT",3,Major,Moderate,Medical,Medicare,Medicare,,,,Y,107459.41,27672.17
New York City,Manhattan,7002054,001464,New York-Presbyterian Hospital - Columbia Presbyterian Center,50 to 69,104,F,Other Race,Spanish/Hispanic,1,Emergency,Home or Self Care,2022,SYM015,General sensation/perception signs and symptoms,ADM021,"ADMINISTRATION OF THERAPEUTIC SUBSTANCES, NEC",111,VERTIGO AND OTHER LABYRINTH DISORDERS,03,"DISEASES AND DISORDERS OF THE EAR, NOSE, MOUTH AND THROAT",1,Minor,Minor,Medical,Private Health Insurance,,,,,Y,27721.83,
New York City,Manhattan,7002001,001438,Bellevue Hospital Center,0 to 17,112,F,Other Race,Spanish/Hispanic,1,Elective,Home or Self Care,2022,SYM015,General sensation/perception signs and symptoms,MAM011,ELECTROENCEPHALOGRAM (EEG),111,VERTIGO AND OTHER LABYRINTH DISORDERS,03,"DISEASES AND DISORDERS OF THE EAR, NOSE, MOUTH AND THROAT",1,Minor,Minor,Medical,Medicaid,,,,,N,6751.72,3882.81
New York City,Manhattan,7002053,001463,NYU Langone Hospitals,70 or Older,100,F,Black/African American,Not Span/Hispanic,3,Emergency,Home w/ Home Health Services,2022,SYM015,General sensation/perception signs and symptoms,,,111,VERTIGO AND OTHER LABYRINTH DISORDERS,03,"DISEASES AND DISORDERS OF THE EAR, NOSE, MOUTH AND THROAT",2,Moderate,Major,Medical,Medicare,,,,,Y,62055.01,17524.94
New York City,Manhattan,7002001,001438,Bellevue Hospital Center,50 to 69,114,M,Other Race,Unknown,1,Emergency,Home or Self Care,2022,EAR003,Diseases of inner ear and related conditions,ADM021,"ADMINISTRATION OF THERAPEUTIC SUBSTANCES, NEC",111,VERTIGO AND OTHER LABYRINTH DISORDERS,03,"DISEASES AND DISORDERS OF THE EAR, NOSE, MOUTH AND THROAT",2,Moderate,Minor,Medical,Private Health Insurance,,,,,Y,15596.42,8969.25
New York City,Manhattan,7002053,001463,NYU Langone Hospitals,50 to 69,112,F,Black/African American,Not Span/Hispanic,2,Emergency,Home or Self Care,2022,EAR003,Diseases of inner ear and related conditions,,,111,VERTIGO AND OTHER LABYRINTH DISORDERS,03,"DISEASES AND DISORDERS OF THE EAR, NOSE, MOUTH AND THROAT",2,Moderate,Moderate,Medical,Private Health Insurance,,,,,Y,66023.15,12710.20
New York City,Manhattan,7002001,001438,Bellevue Hospital Center,30 to 49,112,M,Other Race,Unknown,1,Emergency,Home or Self Care,2022,EAR003,Diseases of inner ear and related conditions,ADM021,"ADMINISTRATION OF THERAPEUTIC SUBSTANCES, NEC",111,VERTIGO AND OTHER LABYRINTH DISORDERS,03,"DISEASES AND DISORDERS OF THE EAR, NOSE, MOUTH AND THROAT",1,Minor,Minor,Medical,Medicaid,,,,,Y,12879.49,7406.79
New York City,Manhattan,7002054,001464,New York-Presbyterian Hospital - Columbia Presbyterian Center,70 or Older,100,F,White,Not Span/Hispanic,1,Emergency,Home or Self Care,2022,EAR003,Diseases of inner ear and related conditions,ADM021,"ADMINISTRATION OF THERAPEUTIC SUBSTANCES, NEC",111,VERTIGO AND OTHER LABYRINTH DISORDERS,03,"DISEASES AND DISORDERS OF THE EAR, NOSE, MOUTH AND THROAT",2,Moderate,Minor,Medical,Medicaid,,,,,Y,25791.58,5251.53
Long Island,Nassau,2951001,000541,North Shore University Hospital,50 to 69,117,M,White,Not Span/Hispanic,2,Emergency,Home or Self Care,2022,EAR003,Diseases of inner ear and related conditions,IMG001,CARDIAC AND CORONARY FLUOROSCOPY,111,VERTIGO AND OTHER LABYRINTH DISORDERS,03,"DISEASES AND DISORDERS OF THE EAR, NOSE, MOUTH AND THROAT",1,Minor,Minor,Medical,Private Health Insurance,Medicare,,,,Y,64366.75,10252.30
Long Island,Nassau,2951001,000541,North Shore University Hospital,70 or Older,117,F,White,Not Span/Hispanic,1,Emergency,Home or Self Care,2022,SYM015,General sensation/perception signs and symptoms,,,111,VERTIGO AND OTHER LABYRINTH DISORDERS,03,"DISEASES AND DISORDERS OF THE EAR, NOSE, MOUTH AND THROAT",1,Minor,Minor,Medical,Medicare,Private Health Insurance,,,,Y,29998.47,3571.75
Long Island,Nassau,2951001,000541,North Shore University Hospital,50 to 69,110,M,Other Race,Spanish/Hispanic,1,Emergency,Home or Self Care,2022,SYM015,General sensation/perception signs and symptoms,,,111,VERTIGO AND OTHER LABYRINTH DISORDERS,03,"DISEASES AND DISORDERS OF THE EAR, NOSE, MOUTH AND THROAT",1,Minor,Minor,Medical,Medicare,Medicare,,,,Y,34022.42,4108.99
Finger Lakes,Monroe,2701005,000413,Strong Memorial Hospital,50 to 69,146,M,White,Spanish/Hispanic,3,Emergency,Home or Self Care,2022,EAR003,Diseases of inner ear and related conditions,,,111,VERTIGO AND OTHER LABYRINTH DISORDERS,03,"DISEASES AND DISORDERS OF THE EAR, NOSE, MOUTH AND THROAT",2,Moderate,Minor,Medical,Medicaid,,,,,Y,14532.96,5921.72
New York City,Manhattan,7002054,001464,New York-Presbyterian Hospital - Columbia Presbyterian Center,70 or Older,100,M,Black/African American,Spanish/Hispanic,10,Emergency,Skilled Nursing Home,2022,SYM015,General sensation/perception signs and symptoms,ESA001,HEMODIALYSIS,111,VERTIGO AND OTHER LABYRINTH DISORDERS,03,"DISEASES AND DISORDERS OF THE EAR, NOSE, MOUTH AND THROAT",3,Major,Moderate,Medical,Medicare,,,,,Y,148416.67,33714.51
New York City,Manhattan,7002054,001464,New York-Presbyterian Hospital - Columbia Presbyterian Center,50 to 69,104,F,Other Race,Spanish/Hispanic,3,Emergency,Home w/ Home Health Services,2022,EAR003,Diseases of inner ear and related conditions,,,111,VERTIGO AND OTHER LABYRINTH DISORDERS,03,"DISEASES AND DISORDERS OF THE EAR, NOSE, MOUTH AND THROAT",2,Moderate,Minor,Medical,Medicare,Medicaid,,,,Y,49143.71,10301.39
New York City,Manhattan,7002054,001464,New York-Presbyterian Hospital - Columbia Presbyterian Center,70 or Older,OOS,F,White,Not Span/Hispanic,10,Emergency,Inpatient Rehabilitation Facility,2022,SYM015,General sensation/perception signs and symptoms,CNS002,LUMBAR PUNCTURE,111,VERTIGO AND OTHER LABYRINTH DISORDERS,03,"DISEASES AND DISORDERS OF THE EAR, NOSE, MOUTH AND THROAT",1,Minor,Minor,Medical,Medicare,Private Health Insurance,,,,Y,142341.25,29555.25
New York City,Manhattan,7002001,001438,Bellevue Hospital Center,70 or Older,100,F,White,Unknown,1,Emergency,Home or Self Care,2022,EAR003,Diseases of inner ear and related conditions,IMG006,COMPUTERIZED TOMOGRAPHY (CT) WITH CONTRAST,111,VERTIGO AND OTHER LABYRINTH DISORDERS,03,"DISEASES AND DISORDERS OF THE EAR, NOSE, MOUTH AND THROAT",1,Minor,Minor,Medical,Medicare,Medicaid,,,,Y,17538.60,10086.17
New York City,Manhattan,7002001,001438,Bellevue Hospital Center,50 to 69,113,M,Multi-racial,Spanish/Hispanic,1,Emergency,Home or Self Care,2022,SYM015,General sensation/perception signs and symptoms,IMG005,MAGNETIC RESONANCE IMAGING (MRI),111,VERTIGO AND OTHER LABYRINTH DISORDERS,03,"DISEASES AND DISORDERS OF THE EAR, NOSE, MOUTH AND THROAT",1,Minor,Minor,Medical,Medicaid,,,,,Y,18067.40,10390.27
Capital/Adirond,Warren,5601000,001005,Glens Falls Hospital,50 to 69,128,M,White,Not Span/Hispanic,10,Emergency,Home or Self Care,2022,SYM015,General sensation/perception signs and symptoms,,,111,VERTIGO AND OTHER LABYRINTH DISORDERS,03,"DISEASES AND DISORDERS OF THE EAR, NOSE, MOUTH AND THROAT",2,Moderate,Minor,Medical,Medicaid,,,,,Y,45242.98,18092.83
Hudson Valley,Dutchess,1302001,000181,Vassar Brothers Medical Center,30 to 49,125,M,Other Race,Not Span/Hispanic,3,Emergency,Home or Self Care,2022,SYM015,General sensation/perception signs and symptoms,,,111,VERTIGO AND OTHER LABYRINTH DISORDERS,03,"DISEASES AND DISORDERS OF THE EAR, NOSE, MOUTH AND THROAT",1,Minor,Minor,Medical,Blue Cross/Blue Shield,,,,,Y,24701.44,6354.59
New York City,Manhattan,7002001,001438,Bellevue Hospital Center,70 or Older,100,M,Other Race,Unknown,3,Emergency,Home or Self Care,2022,SYM015,General sensation/perception signs and symptoms,ADM020,"ADMINISTRATION OF DIAGNOSTIC SUBSTANCES, NEC",111,VERTIGO AND OTHER LABYRINTH DISORDERS,03,"DISEASES AND DISORDERS OF THE EAR, NOSE, MOUTH AND THROAT",3,Major,Extreme,Medical,Medicare,Medicaid,,,,Y,24521.73,14102.05
New York City,Manhattan,7002001,001438,Bellevue Hospital Center,50 to 69,113,M,Other Race,Unknown,3,Emergency,Home or Self Care,2022,EAR003,Diseases of inner ear and related conditions,ADM021,"ADMINISTRATION OF THERAPEUTIC SUBSTANCES, NEC",111,VERTIGO AND OTHER LABYRINTH DISORDERS,03,"DISEASES AND DISORDERS OF THE EAR, NOSE, MOUTH AND THROAT",2,Moderate,Moderate,Medical,Medicaid,,,,,Y,27424.96,15771.66
New York City,Manhattan,7002001,001438,Bellevue Hospital Center,30 to 49,112,M,Other Race,Spanish/Hispanic,3,Emergency,Home or Self Care,2022,SYM015,General sensation/perception signs and symptoms,ADM021,"ADMINISTRATION OF THERAPEUTIC SUBSTANCES, NEC",111,VERTIGO AND OTHER LABYRINTH DISORDERS,03,"DISEASES AND DISORDERS OF THE EAR, NOSE, MOUTH AND THROAT",1,Minor,Minor,Medical,Medicaid,,,,,Y,33098.80,19034.59
New York City,Manhattan,7002001,001438,Bellevue Hospital Center,70 or Older,113,F,Other Race,Unknown,2,Emergency,Home or Self Care,2022,EAR003,Diseases of inner ear and related conditions,ADM021,"ADMINISTRATION OF THERAPEUTIC SUBSTANCES, NEC",111,VERTIGO AND OTHER LABYRINTH DISORDERS,03,"DISEASES AND DISORDERS OF THE EAR, NOSE, MOUTH AND THROAT",2,Moderate,Moderate,Medical,Self-Pay,,,,,Y,19003.79,10928.78
New York City,Manhattan,7002054,001464,New York-Presbyterian Hospital - Columbia Presbyterian Center,70 or Older,100,F,White,Spanish/Hispanic,4,Emergency,Home or Self Care,2022,EAR003,Diseases of inner ear and related conditions,ADM015,ADMINISTRATION OF ANTIBIOTICS,111,VERTIGO AND OTHER LABYRINTH DISORDERS,03,"DISEASES AND DISORDERS OF THE EAR, NOSE, MOUTH AND THROAT",2,Moderate,Minor,Medical,Medicare,,,,,Y,62751.45,13097.14
New York City,Manhattan,7002001,001438,Bellevue Hospital Center,70 or Older,100,F,Other Race,Unknown,8,Emergency,Home or Self Care,2022,EAR003,Diseases of inner ear and related conditions,ADM021,"ADMINISTRATION OF THERAPEUTIC SUBSTANCES, NEC",111,VERTIGO AND OTHER LABYRINTH DISORDERS,03,"DISEASES AND DISORDERS OF THE EAR, NOSE, MOUTH AND THROAT",2,Moderate,Minor,Medical,Medicare,Medicaid,,,,Y,53145.86,30563.33
New York City,Manhattan,7002001,001438,Bellevue Hospital Center,70 or Older,114,F,Other Race,Unknown,4,Urgent,Home or Self Care,2022,SYM015,General sensation/perception signs and symptoms,IMG007,COMPUTERIZED TOMOGRAPHY (CT) WITHOUT CONTRAST,111,VERTIGO AND OTHER LABYRINTH DISORDERS,03,"DISEASES AND DISORDERS OF THE EAR, NOSE, MOUTH AND THROAT",2,Moderate,Moderate,Medical,Medicare,Medicaid,,,,N,28895.43,16617.30
Finger Lakes,Monroe,2701005,000413,Strong Memorial Hospital,70 or Older,145,M,Black/African American,Not Span/Hispanic,3,Emergency,Home or Self Care,2022,EAR003,Diseases of inner ear and related conditions,,,111,VERTIGO AND OTHER LABYRINTH DISORDERS,03,"DISEASES AND DISORDERS OF THE EAR, NOSE, MOUTH AND THROAT",2,Moderate,Major,Medical,Medicare,,,,,Y,15307.11,5821.10
New York City,Manhattan,7002001,001438,Bellevue Hospital Center,70 or Older,100,M,White,Unknown,17,Emergency,Skilled Nursing Home,2022,EAR003,Diseases of inner ear and related conditions,IMG007,COMPUTERIZED TOMOGRAPHY (CT) WITHOUT CONTRAST,111,VERTIGO AND OTHER LABYRINTH DISORDERS,03,"DISEASES AND DISORDERS OF THE EAR, NOSE, MOUTH AND THROAT",3,Major,Major,Medical,Medicare,,,,,Y,123158.10,70826.25
Long Island,Nassau,2951001,000541,North Shore University Hospital,70 or Older,113,F,Other Race,Spanish/Hispanic,6,Emergency,Home or Self Care,2022,EAR003,Diseases of inner ear and related conditions,,,111,VERTIGO AND OTHER LABYRINTH DISORDERS,03,"DISEASES AND DISORDERS OF THE EAR, NOSE, MOUTH AND THROAT",2,Moderate,Moderate,Medical,Medicare,Blue Cross/Blue Shield,,,,Y,94029.08,13551.85
Long Island,Nassau,2951001,000541,North Shore University Hospital,30 to 49,110,F,White,Not Span/Hispanic,5,Emergency,Home or Self Care,2022,EAR003,Diseases of inner ear and related conditions,,,111,VERTIGO AND OTHER LABYRINTH DISORDERS,03,"DISEASES AND DISORDERS OF THE EAR, NOSE, MOUTH AND THROAT",1,Minor,Minor,Medical,Private Health Insurance,,,,,Y,76695.73,12183.15
Long Island,Nassau,2951001,000541,North Shore University Hospital,70 or Older,113,F,Other Race,Not Span/Hispanic,3,Emergency,Home or Self Care,2022,SYM015,General sensation/perception signs and symptoms,,,111,VERTIGO AND OTHER LABYRINTH DISORDERS,03,"DISEASES AND DISORDERS OF THE EAR, NOSE, MOUTH AND THROAT",1,Minor,Minor,Medical,Medicare,Blue Cross/Blue Shield,,,,Y,47763.42,7459.96
Long Island,Nassau,2951001,000541,North Shore University Hospital,50 to 69,113,M,White,Not Span/Hispanic,1,Emergency,Home or Self Care,2022,SYM015,General sensation/perception signs and symptoms,,,111,VERTIGO AND OTHER LABYRINTH DISORDERS,03,"DISEASES AND DISORDERS OF THE EAR, NOSE, MOUTH AND THROAT",1,Minor,Minor,Medical,Medicaid,Medicaid,,,,Y,26592.66,3261.43
Long Island,Nassau,2951001,000541,North Shore University Hospital,30 to 49,115,F,Black/African American,Not Span/Hispanic,3,Emergency,Home or Self Care,2022,EAR003,Diseases of inner ear and related conditions,,,111,VERTIGO AND OTHER LABYRINTH DISORDERS,03,"DISEASES AND DISORDERS OF THE EAR, NOSE, MOUTH AND THROAT",1,Minor,Moderate,Medical,Private Health Insurance,,,,,Y,54371.37,8243.85
Long Island,Nassau,2951001,000541,North Shore University Hospital,50 to 69,114,F,Other Race,Unknown,1,Emergency,Home or Self Care,2022,EAR003,Diseases of inner ear and related conditions,,,111,VERTIGO AND OTHER LABYRINTH DISORDERS,03,"DISEASES AND DISORDERS OF THE EAR, NOSE, MOUTH AND THROAT",2,Moderate,Minor,Medical,Private Health Insurance,,,,,Y,37130.58,4266.16
Long Island,Nassau,2951001,000541,North Shore University Hospital,50 to 69,110,M,Other Race,Not Span/Hispanic,1,Emergency,Home or Self Care,2022,SYM015,General sensation/perception signs and symptoms,,,111,VERTIGO AND OTHER LABYRINTH DISORDERS,03,"DISEASES AND DISORDERS OF THE EAR, NOSE, MOUTH AND THROAT",1,Minor,Minor,Medical,Private Health Insurance,,,,,Y,37208.82,4729.78
Long Island,Nassau,2951001,000541,North Shore University Hospital,70 or Older,114,F,Other Race,Not Span/Hispanic,12,Emergency,Home w/ Home Health Services,2022,SYM015,General sensation/perception signs and symptoms,OTR004,ISOLATION PROCEDURES,111,VERTIGO AND OTHER LABYRINTH DISORDERS,03,"DISEASES AND DISORDERS OF THE EAR, NOSE, MOUTH AND THROAT",3,Major,Major,Medical,Medicaid,Medicaid,,,,Y,162920.13,26150.37
Long Island,Nassau,2951001,000541,North Shore University Hospital,70 or Older,110,F,White,Not Span/Hispanic,2,Emergency,Home or Self Care,2022,SYM015,General sensation/perception signs and symptoms,,,111,VERTIGO AND OTHER LABYRINTH DISORDERS,03,"DISEASES AND DISORDERS OF THE EAR, NOSE, MOUTH AND THROAT",1,Minor,Minor,Medical,Medicare,Blue Cross/Blue Shield,,,,Y,44628.74,6047.96
New York City,Manhattan,7002001,001438,Bellevue Hospital Center,70 or Older,112,F,Black/African American,Unknown,6,Emergency,Home or Self Care,2022,SYM015,General sensation/perception signs and symptoms,ADM021,"ADMINISTRATION OF THERAPEUTIC SUBSTANCES, NEC",111,VERTIGO AND OTHER LABYRINTH DISORDERS,03,"DISEASES AND DISORDERS OF THE EAR, NOSE, MOUTH AND THROAT",2,Moderate,Moderate,Medical,Medicare,,,,,Y,53719.26,30893.09
Hudson Valley,Dutchess,1302001,000181,Vassar Brothers Medical Center,50 to 69,126,F,White,Not Span/Hispanic,21,Emergency,Skilled Nursing Home,2022,EAR003,Diseases of inner ear and related conditions,FRS015,"FEMALE REPRODUCTIVE SYSTEM PROCEDURES, NEC",111,VERTIGO AND OTHER LABYRINTH DISORDERS,03,"DISEASES AND DISORDERS OF THE EAR, NOSE, MOUTH AND THROAT",4,Extreme,Major,Medical,Private Health Insurance,Self-Pay,,,,Y,147799.81,52576.86
New York City,Manhattan,7002001,001438,Bellevue Hospital Center,70 or Older,111,M,Other Race,Spanish/Hispanic,3,Emergency,Home or Self Care,2022,EAR003,Diseases of inner ear and related conditions,IMG007,COMPUTERIZED TOMOGRAPHY (CT) WITHOUT CONTRAST,111,VERTIGO AND OTHER LABYRINTH DISORDERS,03,"DISEASES AND DISORDERS OF THE EAR, NOSE, MOUTH AND THROAT",2,Moderate,Minor,Medical,Medicare,,,,,Y,30867.63,17751.48
New York City,Manhattan,7002054,001464,New York-Presbyterian Hospital - Columbia Presbyterian Center,50 to 69,104,M,Other Race,Spanish/Hispanic,2,Emergency,Home or Self Care,2022,EAR003,Diseases of inner ear and related conditions,,,111,VERTIGO AND OTHER LABYRINTH DISORDERS,03,"DISEASES AND DISORDERS OF THE EAR, NOSE, MOUTH AND THROAT",1,Minor,Minor,Medical,Medicaid,,,,,Y,48462.32,
New York City,Manhattan,7002054,001464,New York-Presbyterian Hospital - Columbia Presbyterian Center,50 to 69,104,F,Other Race,Spanish/Hispanic,3,Emergency,Home or Self Care,2022,EAR003,Diseases of inner ear and related conditions,ADM021,"ADMINISTRATION OF THERAPEUTIC SUBSTANCES, NEC",111,VERTIGO AND OTHER LABYRINTH DISORDERS,03,"DISEASES AND DISORDERS OF THE EAR, NOSE, MOUTH AND THROAT",2,Moderate,Minor,Medical,Self-Pay,,,,,Y,110987.66,43007.72
New York City,Manhattan,7002054,001464,New York-Presbyterian Hospital - Columbia Presbyterian Center,70 or Older,100,F,Other Race,Spanish/Hispanic,2,Emergency,Home w/ Home Health Services,2022,EAR003,Diseases of inner ear and related conditions,,,111,VERTIGO AND OTHER LABYRINTH DISORDERS,03,"DISEASES AND DISORDERS OF THE EAR, NOSE, MOUTH AND THROAT",2,Moderate,Minor,Medical,Medicare,,,,,Y,33351.83,7212.12
New York City,Manhattan,7002054,001464,New York-Presbyterian Hospital - Columbia Presbyterian Center,70 or Older,100,F,Black/African American,Not Span/Hispanic,2,Emergency,Home or Self Care,2022,SYM015,General sensation/perception signs and symptoms,IMG006,COMPUTERIZED TOMOGRAPHY (CT) WITH CONTRAST,111,VERTIGO AND OTHER LABYRINTH DISORDERS,03,"DISEASES AND DISORDERS OF THE EAR, NOSE, MOUTH AND THROAT",2,Moderate,Moderate,Medical,Medicare,Medicaid,,,,Y,38176.91,8174.21
New York City,Manhattan,7002001,001438,Bellevue Hospital Center,70 or Older,111,M,Other Race,Spanish/Hispanic,3,Emergency,Home or Self Care,2022,EAR003,Diseases of inner ear and related conditions,ADM021,"ADMINISTRATION OF THERAPEUTIC SUBSTANCES, NEC",111,VERTIGO AND OTHER LABYRINTH DISORDERS,03,"DISEASES AND DISORDERS OF THE EAR, NOSE, MOUTH AND THROAT",1,Minor,Minor,Medical,Medicare,,,,,Y,26045.12,14978.13
Finger Lakes,Monroe,2701005,000413,Strong Memorial Hospital,70 or Older,146,F,White,Not Span/Hispanic,6,Emergency,Home w/ Home Health Services,2022,EAR003,Diseases of inner ear and related conditions,,,111,VERTIGO AND OTHER LABYRINTH DISORDERS,03,"DISEASES AND DISORDERS OF THE EAR, NOSE, MOUTH AND THROAT",2,Moderate,Major,Medical,Medicare,Federal/State/Local/VA,,,,Y,24173.53,10544.37
Finger Lakes,Monroe,2701005,000413,Strong Memorial Hospital,50 to 69,146,M,Other Race,Not Span/Hispanic,3,Emergency,Home or Self Care,2022,EAR003,Diseases of inner ear and related conditions,,,111,VERTIGO AND OTHER LABYRINTH DISORDERS,03,"DISEASES AND DISORDERS OF THE EAR, NOSE, MOUTH AND THROAT",2,Moderate,Moderate,Medical,Medicaid,,,,,Y,17662.99,6378.78
New York City,Manhattan,7002054,001464,New York-Presbyterian Hospital - Columbia Presbyterian Center,70 or Older,100,F,White,Not Span/Hispanic,2,Emergency,Home w/ Home Health Services,2022,SYM015,General sensation/perception signs and symptoms,,,111,VERTIGO AND OTHER LABYRINTH DISORDERS,03,"DISEASES AND DISORDERS OF THE EAR, NOSE, MOUTH AND THROAT",2,Moderate,Moderate,Medical,Medicare,Private Health Insurance,,,,Y,29121.23,6344.57
New York City,Manhattan,7002001,001438,Bellevue Hospital Center,70 or Older,100,F,Other Race,Spanish/Hispanic,3,Emergency,Home w/ Home Health Services,2022,EAR003,Diseases of inner ear and related conditions,IMG009,PLAIN RADIOGRAPHY,111,VERTIGO AND OTHER LABYRINTH DISORDERS,03,"DISEASES AND DISORDERS OF THE EAR, NOSE, MOUTH AND THROAT",2,Moderate,Minor,Medical,Medicare,Medicaid,,,,Y,25845.26,14863.20
New York City,Manhattan,7002054,001464,New York-Presbyterian Hospital - Columbia Presbyterian Center,50 to 69,100,M,Other Race,Unknown,5,Emergency,Home or Self Care,2022,EAR003,Diseases of inner ear and related conditions,,,111,VERTIGO AND OTHER LABYRINTH DISORDERS,03,"DISEASES AND DISORDERS OF THE EAR, NOSE, MOUTH AND THROAT",2,Moderate,Minor,Medical,Medicaid,,,,,Y,85377.17,20011.63