Hospital Service Area,Hospital County,Operating Certificate Number,Permanent Facility Id,Facility Name,Age Group,Zip Code - 3 digits,Gender,Race,Ethnicity,Length of Stay,Type of Admission,Patient Disposition,Discharge Year,CCS Diagnosis Code,CCS Diagnosis Description,CCS Procedure Code,CCS Procedure Description,APR DRG Code,APR DRG Description,APR MDC Code,APR MDC Description,APR Severity of Illness Code,APR Severity of Illness Description,APR Risk of Mortality,APR Medical Surgical Description,Payment Typology 1,Payment Typology 2,Payment Typology 3,Birth Weight,Abortion Edit Indicator,Emergency Department Indicator,Total Charges,Total Costs
New York City,Manhattan,7002054,001464,New York-Presbyterian Hospital - Columbia Presbyterian Center,0 to 17,105,F,White,Not Span/Hispanic,14,Emergency,Home w/ Home Health Services,2022,INF012,COVID-19,ESA003,MECHANICAL VENTILATION,132,BPD AND OTHER CHRONIC RESPIRATORY DISEASES ARISING IN PERINATAL PERIOD,04,DISEASES AND DISORDERS OF THE RESPIRATORY SYSTEM,4,Extreme,Major,Medical,Blue Cross/Blue Shield,,,,,Y,390866.23,167826.63
New York City,Manhattan,7002054,001464,New York-Presbyterian Hospital - Columbia Presbyterian Center,0 to 17,117,M,White,Not Span/Hispanic,8,Emergency,Home or Self Care,2022,RSP005,Acute bronchitis,,,132,BPD AND OTHER CHRONIC RESPIRATORY DISEASES ARISING IN PERINATAL PERIOD,04,DISEASES AND DISORDERS OF THE RESPIRATORY SYSTEM,3,Major,Moderate,Medical,Medicaid,,,,,Y,115115.55,25061.00
New York City,Manhattan,7002054,001464,New York-Presbyterian Hospital - Columbia Presbyterian Center,0 to 17,OOS,F,White,Spanish/Hispanic,2,Emergency,Home w/ Home Health Services,2022,RSP010,Aspiration pneumonitis,ESA003,MECHANICAL VENTILATION,132,BPD AND OTHER CHRONIC RESPIRATORY DISEASES ARISING IN PERINATAL PERIOD,04,DISEASES AND DISORDERS OF THE RESPIRATORY SYSTEM,4,Extreme,Major,Medical,Private Health Insurance,,,,,Y,72144.24,30256.81
New York City,Manhattan,7002054,001464,New York-Presbyterian Hospital - Columbia Presbyterian Center,0 to 17,112,M,Other Race,Not Span/Hispanic,2,Emergency,Skilled Nursing Home,2022,INF012,COVID-19,OTR004,ISOLATION PROCEDURES,132,BPD AND OTHER CHRONIC RESPIRATORY DISEASES ARISING IN PERINATAL PERIOD,04,DISEASES AND DISORDERS OF THE RESPIRATORY SYSTEM,3,Major,Major,Medical,Medicaid,,,,,Y,43568.15,9219.88
Finger Lakes,Monroe,2701005,000413,Strong Memorial Hospital,0 to 17,146,M,Multi-racial,Not Span/Hispanic,3,Urgent,Home or Self Care,2022,INF012,COVID-19,ADM019,POTENTIAL COVID-19 THERAPIES,132,BPD AND OTHER CHRONIC RESPIRATORY DISEASES ARISING IN PERINATAL PERIOD,04,DISEASES AND DISORDERS OF THE RESPIRATORY SYSTEM,4,Extreme,Major,Medical,Medicaid,,,,,N,8246.61,4442.37
Finger Lakes,Monroe,2701005,000413,Strong Memorial Hospital,0 to 17,148,M,White,Unknown,4,Urgent,Home or Self Care,2022,RSP005,Acute bronchitis,,,132,BPD AND OTHER CHRONIC RESPIRATORY DISEASES ARISING IN PERINATAL PERIOD,04,DISEASES AND DISORDERS OF THE RESPIRATORY SYSTEM,4,Extreme,Major,Medical,Medicaid,,,03400,,N,14031.57,7168.87
Finger Lakes,Monroe,2701005,000413,Strong Memorial Hospital,0 to 17,145,F,White,Not Span/Hispanic,3,Emergency,Home or Self Care,2022,INF012,COVID-19,ADM017,ADMINISTRATION OF NUTRITIONAL AND ELECTROLYTIC SUBSTANCES,132,BPD AND OTHER CHRONIC RESPIRATORY DISEASES ARISING IN PERINATAL PERIOD,04,DISEASES AND DISORDERS OF THE RESPIRATORY SYSTEM,4,Extreme,Extreme,Medical,Medicaid,,,,,Y,33308.00,12829.75
New York City,Manhattan,7002053,001463,NYU Langone Hospitals,0 to 17,112,F,Other Race,Not Span/Hispanic,2,Emergency,Home w/ Home Health Services,2022,RSP012,Respiratory failure; insufficiency; arrest,ADM021,"ADMINISTRATION OF THERAPEUTIC SUBSTANCES, NEC",132,BPD AND OTHER CHRONIC RESPIRATORY DISEASES ARISING IN PERINATAL PERIOD,04,DISEASES AND DISORDERS OF THE RESPIRATORY SYSTEM,4,Extreme,Major,Medical,Medicaid,,,,,Y,53796.80,11570.90
Finger Lakes,Monroe,2701005,000413,Strong Memorial Hospital,0 to 17,146,M,Black/African American,Not Span/Hispanic,2,Emergency,Home or Self Care,2022,RSP005,Acute bronchitis,,,132,BPD AND OTHER CHRONIC RESPIRATORY DISEASES ARISING IN PERINATAL PERIOD,04,DISEASES AND DISORDERS OF THE RESPIRATORY SYSTEM,3,Major,Moderate,Medical,Medicaid,,,,,Y,7896.38,3359.54
Finger Lakes,Monroe,2701005,000413,Strong Memorial Hospital,0 to 17,146,M,White,Not Span/Hispanic,2,Emergency,Home or Self Care,2022,RSP010,Aspiration pneumonitis,ADM017,ADMINISTRATION OF NUTRITIONAL AND ELECTROLYTIC SUBSTANCES,132,BPD AND OTHER CHRONIC RESPIRATORY DISEASES ARISING IN PERINATAL PERIOD,04,DISEASES AND DISORDERS OF THE RESPIRATORY SYSTEM,3,Major,Moderate,Medical,Medicaid,,,,,Y,7260.55,3291.56
Finger Lakes,Monroe,2701005,000413,Strong Memorial Hospital,0 to 17,149,F,Other Race,Unknown,120 +,Urgent,Home w/ Home Health Services,2022,RSP010,Aspiration pneumonitis,ESA004,NON-INVASIVE VENTILATION,132,BPD AND OTHER CHRONIC RESPIRATORY DISEASES ARISING IN PERINATAL PERIOD,04,DISEASES AND DISORDERS OF THE RESPIRATORY SYSTEM,4,Extreme,Major,Medical,Medicaid,,,UNKN,,N,1262286.79,403427.13
Finger Lakes,Monroe,2701005,000413,Strong Memorial Hospital,0 to 17,146,M,Multi-racial,Not Span/Hispanic,2,Emergency,Home or Self Care,2022,RSP009,Asthma,,,132,BPD AND OTHER CHRONIC RESPIRATORY DISEASES ARISING IN PERINATAL PERIOD,04,DISEASES AND DISORDERS OF THE RESPIRATORY SYSTEM,2,Moderate,Minor,Medical,Medicaid,,,,,Y,17863.21,6786.06
Finger Lakes,Monroe,2701005,000413,Strong Memorial Hospital,0 to 17,146,F,Other Race,Spanish/Hispanic,1,Emergency,Home w/ Home Health Services,2022,RSP005,Acute bronchitis,,,132,BPD AND OTHER CHRONIC RESPIRATORY DISEASES ARISING IN PERINATAL PERIOD,04,DISEASES AND DISORDERS OF THE RESPIRATORY SYSTEM,3,Major,Moderate,Medical,Medicaid,,,00700,,Y,6833.59,2432.93
Finger Lakes,Monroe,2701005,000413,Strong Memorial Hospital,0 to 17,146,M,Black/African American,Not Span/Hispanic,3,Emergency,Home or Self Care,2022,INF012,COVID-19,ADM019,POTENTIAL COVID-19 THERAPIES,132,BPD AND OTHER CHRONIC RESPIRATORY DISEASES ARISING IN PERINATAL PERIOD,04,DISEASES AND DISORDERS OF THE RESPIRATORY SYSTEM,4,Extreme,Major,Medical,Medicaid,,,,,Y,18534.59,7751.08
Long Island,Nassau,2951001,000541,North Shore University Hospital,0 to 17,110,M,Other Race,Spanish/Hispanic,47,Urgent,Skilled Nursing Home,2022,PNL006,Respiratory perinatal condition,ESA004,NON-INVASIVE VENTILATION,132,BPD AND OTHER CHRONIC RESPIRATORY DISEASES ARISING IN PERINATAL PERIOD,04,DISEASES AND DISORDERS OF THE RESPIRATORY SYSTEM,3,Major,Moderate,Medical,Medicaid,Medicaid,,,,N,891719.32,125614.82
Hudson Valley,Dutchess,1302001,000181,Vassar Brothers Medical Center,0 to 17,126,F,Other Race,Unknown,59,Urgent,Short-term Hospital,2022,PNL006,Respiratory perinatal condition,ADM010,VACCINATIONS,132,BPD AND OTHER CHRONIC RESPIRATORY DISEASES ARISING IN PERINATAL PERIOD,04,DISEASES AND DISORDERS OF THE RESPIRATORY SYSTEM,3,Major,Minor,Medical,"Managed Care, Unspecified",,,,,N,317859.19,129002.21
Finger Lakes,Monroe,2701005,000413,Strong Memorial Hospital,0 to 17,149,F,White,Not Span/Hispanic,2,Urgent,Home or Self Care,2022,RSP002,Pneumonia (except that caused by tuberculosis),ADM017,ADMINISTRATION OF NUTRITIONAL AND ELECTROLYTIC SUBSTANCES,132,BPD AND OTHER CHRONIC RESPIRATORY DISEASES ARISING IN PERINATAL PERIOD,04,DISEASES AND DISORDERS OF THE RESPIRATORY SYSTEM,4,Extreme,Moderate,Medical,Medicaid,,,,,N,4631.14,2530.87
Finger Lakes,Monroe,2701005,000413,Strong Memorial Hospital,0 to 17,140,F,Multi-racial,Not Span/Hispanic,5,Emergency,Home or Self Care,2022,RSP005,Acute bronchitis,,,132,BPD AND OTHER CHRONIC RESPIRATORY DISEASES ARISING IN PERINATAL PERIOD,04,DISEASES AND DISORDERS OF THE RESPIRATORY SYSTEM,2,Moderate,Minor,Medical,Medicaid,,,,,Y,12768.65,6727.41
Finger Lakes,Monroe,2701005,000413,Strong Memorial Hospital,0 to 17,144,F,Other Race,Not Span/Hispanic,1,Emergency,Home or Self Care,2022,INF012,COVID-19,ADM019,POTENTIAL COVID-19 THERAPIES,132,BPD AND OTHER CHRONIC RESPIRATORY DISEASES ARISING IN PERINATAL PERIOD,04,DISEASES AND DISORDERS OF THE RESPIRATORY SYSTEM,3,Major,Moderate,Medical,Medicaid,,,,,Y,6695.69,2723.57
New York City,Manhattan,7002054,001464,New York-Presbyterian Hospital - Columbia Presbyterian Center,0 to 17,OOS,M,White,Not Span/Hispanic,1,Elective,Home or Self Care,2022,RSP012,Respiratory failure; insufficiency; arrest,ESA003,MECHANICAL VENTILATION,132,BPD AND OTHER CHRONIC RESPIRATORY DISEASES ARISING IN PERINATAL PERIOD,04,DISEASES AND DISORDERS OF THE RESPIRATORY SYSTEM,4,Extreme,Major,Medical,Medicaid,,,,,N,24890.19,12324.78
Finger Lakes,Monroe,2701005,000413,Strong Memorial Hospital,0 to 17,146,F,Other Race,Unknown,3,Emergency,Home or Self Care,2022,RSP005,Acute bronchitis,,,132,BPD AND OTHER CHRONIC RESPIRATORY DISEASES ARISING IN PERINATAL PERIOD,04,DISEASES AND DISORDERS OF THE RESPIRATORY SYSTEM,2,Moderate,Moderate,Medical,Medicaid,,,,,Y,9026.22,4395.02
Finger Lakes,Monroe,2701005,000413,Strong Memorial Hospital,0 to 17,146,M,Other Race,Unknown,20,Urgent,Home w/ Home Health Services,2022,PNL006,Respiratory perinatal condition,IMG004,FLUOROSCOPY OF NON-CIRCULATORY ORGANS,132,BPD AND OTHER CHRONIC RESPIRATORY DISEASES ARISING IN PERINATAL PERIOD,04,DISEASES AND DISORDERS OF THE RESPIRATORY SYSTEM,3,Major,Major,Medical,Medicaid,,,03000,,N,148257.91,58333.94
Finger Lakes,Monroe,2701005,000413,Strong Memorial Hospital,0 to 17,144,M,Multi-racial,Not Span/Hispanic,1,Emergency,Home or Self Care,2022,RSP002,Pneumonia (except that caused by tuberculosis),,,132,BPD AND OTHER CHRONIC RESPIRATORY DISEASES ARISING IN PERINATAL PERIOD,04,DISEASES AND DISORDERS OF THE RESPIRATORY SYSTEM,3,Major,Minor,Medical,Medicaid,,,,,Y,5589.31,2147.73
New York City,Manhattan,7002053,001463,NYU Langone Hospitals,0 to 17,113,F,White,Not Span/Hispanic,6,Emergency,Home or Self Care,2022,RSP005,Acute bronchitis,OTR004,ISOLATION PROCEDURES,132,BPD AND OTHER CHRONIC RESPIRATORY DISEASES ARISING IN PERINATAL PERIOD,04,DISEASES AND DISORDERS OF THE RESPIRATORY SYSTEM,3,Major,Moderate,Medical,Medicaid,,,,,Y,77470.60,23957.57
New York City,Manhattan,7002054,001464,New York-Presbyterian Hospital - Columbia Presbyterian Center,0 to 17,112,F,Multi-racial,Not Span/Hispanic,8,Emergency,Skilled Nursing Home,2022,RSP012,Respiratory failure; insufficiency; arrest,ESA004,NON-INVASIVE VENTILATION,132,BPD AND OTHER CHRONIC RESPIRATORY DISEASES ARISING IN PERINATAL PERIOD,04,DISEASES AND DISORDERS OF THE RESPIRATORY SYSTEM,4,Extreme,Major,Medical,Medicaid,,,,,Y,234561.19,107997.12
Finger Lakes,Monroe,2701005,000413,Strong Memorial Hospital,0 to 17,145,F,White,Not Span/Hispanic,1,Emergency,Home or Self Care,2022,RSP012,Respiratory failure; insufficiency; arrest,ESA003,MECHANICAL VENTILATION,132,BPD AND OTHER CHRONIC RESPIRATORY DISEASES ARISING IN PERINATAL PERIOD,04,DISEASES AND DISORDERS OF THE RESPIRATORY SYSTEM,4,Extreme,Major,Medical,Medicaid,,,,,Y,14885.00,5183.28
Finger Lakes,Monroe,2701005,000413,Strong Memorial Hospital,0 to 17,146,M,Other Race,Spanish/Hispanic,4,Emergency,Home or Self Care,2022,RSP005,Acute bronchitis,,,132,BPD AND OTHER CHRONIC RESPIRATORY DISEASES ARISING IN PERINATAL PERIOD,04,DISEASES AND DISORDERS OF THE RESPIRATORY SYSTEM,3,Major,Moderate,Medical,Medicaid,,,00700,,Y,10829.27,5546.70
New York City,Manhattan,7002054,001464,New York-Presbyterian Hospital - Columbia Presbyterian Center,0 to 17,117,M,White,Not Span/Hispanic,2,Emergency,Home or Self Care,2022,RSP005,Acute bronchitis,ADM017,ADMINISTRATION OF NUTRITIONAL AND ELECTROLYTIC SUBSTANCES,132,BPD AND OTHER CHRONIC RESPIRATORY DISEASES ARISING IN PERINATAL PERIOD,04,DISEASES AND DISORDERS OF THE RESPIRATORY SYSTEM,3,Major,Moderate,Medical,Medicaid,,,,,Y,36996.82,13161.00
New York City,Manhattan,7002054,001464,New York-Presbyterian Hospital - Columbia Presbyterian Center,0 to 17,112,F,Black/African American,Not Span/Hispanic,9,Emergency,Home w/ Home Health Services,2022,RSP002,Pneumonia (except that caused by tuberculosis),ADM021,"ADMINISTRATION OF THERAPEUTIC SUBSTANCES, NEC",132,BPD AND OTHER CHRONIC RESPIRATORY DISEASES ARISING IN PERINATAL PERIOD,04,DISEASES AND DISORDERS OF THE RESPIRATORY SYSTEM,3,Major,Major,Medical,Medicaid,,,,,Y,198101.12,93815.88
Finger Lakes,Monroe,2701005,000413,Strong Memorial Hospital,0 to 17,145,M,Multi-racial,Spanish/Hispanic,2,Emergency,Home w/ Home Health Services,2022,RSP002,Pneumonia (except that caused by tuberculosis),ADM017,ADMINISTRATION OF NUTRITIONAL AND ELECTROLYTIC SUBSTANCES,132,BPD AND OTHER CHRONIC RESPIRATORY DISEASES ARISING IN PERINATAL PERIOD,04,DISEASES AND DISORDERS OF THE RESPIRATORY SYSTEM,3,Major,Moderate,Medical,Medicaid,,,00900,,Y,8869.17,3809.66
Finger Lakes,Monroe,2701005,000413,Strong Memorial Hospital,0 to 17,145,M,White,Not Span/Hispanic,6,Emergency,Home or Self Care,2022,RSP002,Pneumonia (except that caused by tuberculosis),ESA004,NON-INVASIVE VENTILATION,132,BPD AND OTHER CHRONIC RESPIRATORY DISEASES ARISING IN PERINATAL PERIOD,04,DISEASES AND DISORDERS OF THE RESPIRATORY SYSTEM,4,Extreme,Major,Medical,Medicaid,,,,,Y,17216.95,8553.67
Finger Lakes,Monroe,2701005,000413,Strong Memorial Hospital,0 to 17,146,F,Other Race,Not Span/Hispanic,11,Emergency,Home w/ Home Health Services,2022,RSP012,Respiratory failure; insufficiency; arrest,ENT001,LARYNGOSCOPY (DIAGNOSTIC),132,BPD AND OTHER CHRONIC RESPIRATORY DISEASES ARISING IN PERINATAL PERIOD,04,DISEASES AND DISORDERS OF THE RESPIRATORY SYSTEM,4,Extreme,Major,Medical,Medicaid,,,00500,,Y,33939.96,16616.49
New York City,Manhattan,7002054,001464,New York-Presbyterian Hospital - Columbia Presbyterian Center,0 to 17,112,M,Black/African American,Not Span/Hispanic,3,Emergency,Home or Self Care,2022,INF012,COVID-19,ADM015,ADMINISTRATION OF ANTIBIOTICS,132,BPD AND OTHER CHRONIC RESPIRATORY DISEASES ARISING IN PERINATAL PERIOD,04,DISEASES AND DISORDERS OF THE RESPIRATORY SYSTEM,4,Extreme,Extreme,Medical,Private Health Insurance,,,,,Y,64207.31,18355.14
New York City,Manhattan,7002054,001464,New York-Presbyterian Hospital - Columbia Presbyterian Center,0 to 17,107,M,White,Not Span/Hispanic,1,Emergency,Home or Self Care,2022,RSP009,Asthma,ADM021,"ADMINISTRATION OF THERAPEUTIC SUBSTANCES, NEC",132,BPD AND OTHER CHRONIC RESPIRATORY DISEASES ARISING IN PERINATAL PERIOD,04,DISEASES AND DISORDERS OF THE RESPIRATORY SYSTEM,2,Moderate,Minor,Medical,Medicaid,,,,,Y,20985.00,4317.12
New York City,Manhattan,7002054,001464,New York-Presbyterian Hospital - Columbia Presbyterian Center,0 to 17,107,M,White,Not Span/Hispanic,3,Emergency,Home or Self Care,2022,RSP012,Respiratory failure; insufficiency; arrest,ESA004,NON-INVASIVE VENTILATION,132,BPD AND OTHER CHRONIC RESPIRATORY DISEASES ARISING IN PERINATAL PERIOD,04,DISEASES AND DISORDERS OF THE RESPIRATORY SYSTEM,3,Major,Moderate,Medical,Medicaid,,,,,Y,97181.17,42106.05
Finger Lakes,Monroe,2701005,000413,Strong Memorial Hospital,0 to 17,146,M,Other Race,Spanish/Hispanic,3,Emergency,Home w/ Home Health Services,2022,RSP005,Acute bronchitis,,,132,BPD AND OTHER CHRONIC RESPIRATORY DISEASES ARISING IN PERINATAL PERIOD,04,DISEASES AND DISORDERS OF THE RESPIRATORY SYSTEM,2,Moderate,Minor,Medical,Medicaid,,,00800,,Y,9506.59,4732.01
Finger Lakes,Monroe,2701005,000413,Strong Memorial Hospital,0 to 17,146,M,Other Race,Spanish/Hispanic,1,Emergency,Home or Self Care,2022,RSP005,Acute bronchitis,,,132,BPD AND OTHER CHRONIC RESPIRATORY DISEASES ARISING IN PERINATAL PERIOD,04,DISEASES AND DISORDERS OF THE RESPIRATORY SYSTEM,2,Moderate,Moderate,Medical,Medicaid,,,,,Y,5594.36,2224.69
Finger Lakes,Monroe,2701005,000413,Strong Memorial Hospital,0 to 17,146,F,White,Not Span/Hispanic,3,Emergency,Home or Self Care,2022,INF012,COVID-19,ESA003,MECHANICAL VENTILATION,132,BPD AND OTHER CHRONIC RESPIRATORY DISEASES ARISING IN PERINATAL PERIOD,04,DISEASES AND DISORDERS OF THE RESPIRATORY SYSTEM,4,Extreme,Major,Medical,Medicaid,,,,,Y,21830.03,8444.57
Finger Lakes,Monroe,2701005,000413,Strong Memorial Hospital,0 to 17,146,F,Black/African American,Not Span/Hispanic,3,Emergency,Home or Self Care,2022,INF012,COVID-19,ADM019,POTENTIAL COVID-19 THERAPIES,132,BPD AND OTHER CHRONIC RESPIRATORY DISEASES ARISING IN PERINATAL PERIOD,04,DISEASES AND DISORDERS OF THE RESPIRATORY SYSTEM,2,Moderate,Moderate,Medical,Blue Cross/Blue Shield,Medicaid,,,,Y,12112.88,5669.33
New York City,Manhattan,7002053,001463,NYU Langone Hospitals,0 to 17,112,M,Black/African American,Not Span/Hispanic,7,Emergency,Home or Self Care,2022,RSP005,Acute bronchitis,ESA004,NON-INVASIVE VENTILATION,132,BPD AND OTHER CHRONIC RESPIRATORY DISEASES ARISING IN PERINATAL PERIOD,04,DISEASES AND DISORDERS OF THE RESPIRATORY SYSTEM,4,Extreme,Major,Medical,Private Health Insurance,Medicaid,,,,Y,102881.78,29804.98
New York City,Manhattan,7002001,001438,Bellevue Hospital Center,0 to 17,112,M,Other Race,Unknown,3,Urgent,Critical Access Hospital,2022,PNL006,Respiratory perinatal condition,ESA003,MECHANICAL VENTILATION,132,BPD AND OTHER CHRONIC RESPIRATORY DISEASES ARISING IN PERINATAL PERIOD,04,DISEASES AND DISORDERS OF THE RESPIRATORY SYSTEM,4,Extreme,Major,Medical,Medicaid,,,,,N,48036.76,27625.17
Finger Lakes,Monroe,2701005,000413,Strong Memorial Hospital,0 to 17,145,M,White,Not Span/Hispanic,1,Elective,Home or Self Care,2022,SYM013,Respiratory signs and symptoms,RES001,BRONCHOSCOPY (DIAGNOSTIC),132,BPD AND OTHER CHRONIC RESPIRATORY DISEASES ARISING IN PERINATAL PERIOD,04,DISEASES AND DISORDERS OF THE RESPIRATORY SYSTEM,2,Moderate,Minor,Medical,Medicaid,,,,,N,16766.97,7524.07
Finger Lakes,Monroe,2701005,000413,Strong Memorial Hospital,0 to 17,144,F,White,Not Span/Hispanic,4,Emergency,Home or Self Care,2022,RSP002,Pneumonia (except that caused by tuberculosis),,,132,BPD AND OTHER CHRONIC RESPIRATORY DISEASES ARISING IN PERINATAL PERIOD,04,DISEASES AND DISORDERS OF THE RESPIRATORY SYSTEM,4,Extreme,Major,Medical,Medicaid,,,,,Y,13320.18,6192.44
New York City,Manhattan,7002054,001464,New York-Presbyterian Hospital - Columbia Presbyterian Center,0 to 17,125,F,White,Not Span/Hispanic,2,Emergency,Home w/ Home Health Services,2022,INF012,COVID-19,OTR004,ISOLATION PROCEDURES,132,BPD AND OTHER CHRONIC RESPIRATORY DISEASES ARISING IN PERINATAL PERIOD,04,DISEASES AND DISORDERS OF THE RESPIRATORY SYSTEM,4,Extreme,Major,Medical,Medicaid,,,UNKN,,Y,54124.61,20110.05
New York City,Manhattan,7002053,001463,NYU Langone Hospitals,0 to 17,,M,Multi-racial,Spanish/Hispanic,2,Elective,Home or Self Care,2022,FAC010,Other aftercare encounter,RES010,TRACHEOSTOMY,132,BPD AND OTHER CHRONIC RESPIRATORY DISEASES ARISING IN PERINATAL PERIOD,04,DISEASES AND DISORDERS OF THE RESPIRATORY SYSTEM,3,Major,Moderate,Medical,Blue Cross/Blue Shield,Medicaid,,,,N,54304.08,12400.68
Finger Lakes,Monroe,2701005,000413,Strong Memorial Hospital,0 to 17,145,F,White,Not Span/Hispanic,5,Emergency,Home or Self Care,2022,RSP005,Acute bronchitis,,,132,BPD AND OTHER CHRONIC RESPIRATORY DISEASES ARISING IN PERINATAL PERIOD,04,DISEASES AND DISORDERS OF THE RESPIRATORY SYSTEM,2,Moderate,Minor,Medical,Medicaid,,,00900,,Y,27182.61,12071.45
Finger Lakes,Monroe,2701005,000413,Strong Memorial Hospital,0 to 17,145,F,White,Not Span/Hispanic,4,Emergency,Home or Self Care,2022,RSP005,Acute bronchitis,,,132,BPD AND OTHER CHRONIC RESPIRATORY DISEASES ARISING IN PERINATAL PERIOD,04,DISEASES AND DISORDERS OF THE RESPIRATORY SYSTEM,2,Moderate,Minor,Medical,Medicaid,,,00700,,Y,22972.72,11810.35
Finger Lakes,Monroe,2701005,000413,Strong Memorial Hospital,0 to 17,144,M,White,Not Span/Hispanic,2,Emergency,Home or Self Care,2022,INF012,COVID-19,ADM019,POTENTIAL COVID-19 THERAPIES,132,BPD AND OTHER CHRONIC RESPIRATORY DISEASES ARISING IN PERINATAL PERIOD,04,DISEASES AND DISORDERS OF THE RESPIRATORY SYSTEM,3,Major,Moderate,Medical,Medicaid,,,,,Y,13875.95,6165.84
New York City,Manhattan,7002054,001464,New York-Presbyterian Hospital - Columbia Presbyterian Center,0 to 17,OOS,F,White,Not Span/Hispanic,3,Emergency,Home or Self Care,2022,RSP012,Respiratory failure; insufficiency; arrest,ESA003,MECHANICAL VENTILATION,132,BPD AND OTHER CHRONIC RESPIRATORY DISEASES ARISING IN PERINATAL PERIOD,04,DISEASES AND DISORDERS OF THE RESPIRATORY SYSTEM,4,Extreme,Major,Medical,Private Health Insurance,,,,,Y,91942.53,35443.97
Finger Lakes,Monroe,2701005,000413,Strong Memorial Hospital,0 to 17,145,M,Black/African American,Not Span/Hispanic,3,Emergency,Home or Self Care,2022,INJ020,"Effect of foreign body entering opening, initial encounter",,,132,BPD AND OTHER CHRONIC RESPIRATORY DISEASES ARISING IN PERINATAL PERIOD,04,DISEASES AND DISORDERS OF THE RESPIRATORY SYSTEM,2,Moderate,Minor,Medical,Medicaid,,,03500,,Y,10927.20,5027.24
Finger Lakes,Monroe,2701005,000413,Strong Memorial Hospital,0 to 17,145,M,White,Not Span/Hispanic,3,Emergency,Home or Self Care,2022,RSP002,Pneumonia (except that caused by tuberculosis),ADM017,ADMINISTRATION OF NUTRITIONAL AND ELECTROLYTIC SUBSTANCES,132,BPD AND OTHER CHRONIC RESPIRATORY DISEASES ARISING IN PERINATAL PERIOD,04,DISEASES AND DISORDERS OF THE RESPIRATORY SYSTEM,4,Extreme,Moderate,Medical,Medicaid,,,,,Y,8989.98,4396.52
Finger Lakes,Monroe,2701005,000413,Strong Memorial Hospital,0 to 17,131,F,White,Not Span/Hispanic,2,Emergency,Home or Self Care,2022,RSP009,Asthma,,,132,BPD AND OTHER CHRONIC RESPIRATORY DISEASES ARISING IN PERINATAL PERIOD,04,DISEASES AND DISORDERS OF THE RESPIRATORY SYSTEM,2,Moderate,Minor,Medical,Medicaid,,,,,Y,7240.05,3320.87
New York City,Manhattan,7002054,001464,New York-Presbyterian Hospital - Columbia Presbyterian Center,0 to 17,112,M,Other Race,Spanish/Hispanic,5,Emergency,Home or Self Care,2022,RSP005,Acute bronchitis,ADM017,ADMINISTRATION OF NUTRITIONAL AND ELECTROLYTIC SUBSTANCES,132,BPD AND OTHER CHRONIC RESPIRATORY DISEASES ARISING IN PERINATAL PERIOD,04,DISEASES AND DISORDERS OF THE RESPIRATORY SYSTEM,3,Major,Moderate,Medical,Medicaid,,,00900,,Y,93901.08,23384.56
New York City,Manhattan,7002054,001464,New York-Presbyterian Hospital - Columbia Presbyterian Center,0 to 17,113,M,Other Race,Not Span/Hispanic,4,Emergency,Home or Self Care,2022,RSP012,Respiratory failure; insufficiency; arrest,ESA004,NON-INVASIVE VENTILATION,132,BPD AND OTHER CHRONIC RESPIRATORY DISEASES ARISING IN PERINATAL PERIOD,04,DISEASES AND DISORDERS OF THE RESPIRATORY SYSTEM,3,Major,Moderate,Medical,Medicaid,,,,,Y,121226.41,54413.04
New York City,Manhattan,7002053,001463,NYU Langone Hospitals,0 to 17,,M,Other Race,Spanish/Hispanic,10,Emergency,Home or Self Care,2022,RSP012,Respiratory failure; insufficiency; arrest,ESA004,NON-INVASIVE VENTILATION,132,BPD AND OTHER CHRONIC RESPIRATORY DISEASES ARISING IN PERINATAL PERIOD,04,DISEASES AND DISORDERS OF THE RESPIRATORY SYSTEM,4,Extreme,Major,Medical,Medicaid,,,,,Y,175801.42,51813.59
Finger Lakes,Monroe,2701005,000413,Strong Memorial Hospital,0 to 17,146,F,Other Race,Spanish/Hispanic,5,Emergency,Home or Self Care,2022,RSP002,Pneumonia (except that caused by tuberculosis),,,132,BPD AND OTHER CHRONIC RESPIRATORY DISEASES ARISING IN PERINATAL PERIOD,04,DISEASES AND DISORDERS OF THE RESPIRATORY SYSTEM,3,Major,Major,Medical,Medicaid,,,,,Y,13698.08,7039.13
Finger Lakes,Monroe,2701005,000413,Strong Memorial Hospital,0 to 17,144,M,White,Unknown,1,Urgent,Home or Self Care,2022,RSP009,Asthma,,,132,BPD AND OTHER CHRONIC RESPIRATORY DISEASES ARISING IN PERINATAL PERIOD,04,DISEASES AND DISORDERS OF THE RESPIRATORY SYSTEM,3,Major,Moderate,Medical,Medicaid,,,,,N,2492.18,1311.20
Finger Lakes,Monroe,2701005,000413,Strong Memorial Hospital,0 to 17,146,M,Multi-racial,Not Span/Hispanic,1,Emergency,Home or Self Care,2022,RSP005,Acute bronchitis,,,132,BPD AND OTHER CHRONIC RESPIRATORY DISEASES ARISING IN PERINATAL PERIOD,04,DISEASES AND DISORDERS OF THE RESPIRATORY SYSTEM,2,Moderate,Minor,Medical,Medicaid,,,,,Y,11906.77,4574.99