Hospital Service Area,Hospital County,Operating Certificate Number,Permanent Facility Id,Facility Name,Age Group,Zip Code - 3 digits,Gender,Race,Ethnicity,Length of Stay,Type of Admission,Patient Disposition,Discharge Year,CCS Diagnosis Code,CCS Diagnosis Description,CCS Procedure Code,CCS Procedure Description,APR DRG Code,APR DRG Description,APR MDC Code,APR MDC Description,APR Severity of Illness Code,APR Severity of Illness Description,APR Risk of Mortality,APR Medical Surgical Description,Payment Typology 1,Payment Typology 2,Payment Typology 3,Birth Weight,Abortion Edit Indicator,Emergency Department Indicator,Total Charges,Total Costs
New York City,Manhattan,7002054,001464,New York-Presbyterian Hospital - Columbia Presbyterian Center,50 to 69,104,F,Other Race,Not Span/Hispanic,10,Emergency,Home w/ Home Health Services,2022,RSP016,Other specified and unspecified lower respiratory disease,ADM017,ADMINISTRATION OF NUTRITIONAL AND ELECTROLYTIC SUBSTANCES,143,"OTHER RESPIRATORY DIAGNOSES EXCEPT SIGNS, SYMPTOMS AND MISCELLANEOUS DIAGNOSES",04,DISEASES AND DISORDERS OF THE RESPIRATORY SYSTEM,2,Moderate,Minor,Medical,Private Health Insurance,,,,,Y,204697.92,90307.49
New York City,Manhattan,7002054,001464,New York-Presbyterian Hospital - Columbia Presbyterian Center,50 to 69,104,M,Other Race,Spanish/Hispanic,21,Emergency,Inpatient Rehabilitation Facility,2022,INJ036,"Complication of transplanted organs or tissue, initial encounter",ESA004,NON-INVASIVE VENTILATION,143,"OTHER RESPIRATORY DIAGNOSES EXCEPT SIGNS, SYMPTOMS AND MISCELLANEOUS DIAGNOSES",04,DISEASES AND DISORDERS OF THE RESPIRATORY SYSTEM,4,Extreme,Major,Medical,Medicaid,,,,,Y,499922.40,165361.52
New York City,Manhattan,7002054,001464,New York-Presbyterian Hospital - Columbia Presbyterian Center,50 to 69,103,F,White,Not Span/Hispanic,3,Emergency,Home or Self Care,2022,INJ036,"Complication of transplanted organs or tissue, initial encounter",ADM019,POTENTIAL COVID-19 THERAPIES,143,"OTHER RESPIRATORY DIAGNOSES EXCEPT SIGNS, SYMPTOMS AND MISCELLANEOUS DIAGNOSES",04,DISEASES AND DISORDERS OF THE RESPIRATORY SYSTEM,3,Major,Moderate,Medical,Medicare,Blue Cross/Blue Shield,,,,Y,72319.40,29448.38
New York City,Manhattan,7002054,001464,New York-Presbyterian Hospital - Columbia Presbyterian Center,50 to 69,117,M,Black/African American,Not Span/Hispanic,4,Emergency,Home or Self Care,2022,INJ036,"Complication of transplanted organs or tissue, initial encounter",,,143,"OTHER RESPIRATORY DIAGNOSES EXCEPT SIGNS, SYMPTOMS AND MISCELLANEOUS DIAGNOSES",04,DISEASES AND DISORDERS OF THE RESPIRATORY SYSTEM,4,Extreme,Major,Medical,Medicare,Private Health Insurance,,,,Y,86203.96,31713.41
New York City,Manhattan,7002001,001438,Bellevue Hospital Center,50 to 69,114,M,White,Unknown,13,Emergency,Home w/ Home Health Services,2022,RSP017,Postprocedural or postoperative respiratory system complication,ADM017,ADMINISTRATION OF NUTRITIONAL AND ELECTROLYTIC SUBSTANCES,143,"OTHER RESPIRATORY DIAGNOSES EXCEPT SIGNS, SYMPTOMS AND MISCELLANEOUS DIAGNOSES",04,DISEASES AND DISORDERS OF THE RESPIRATORY SYSTEM,3,Major,Major,Medical,Medicaid,,,,,Y,120193.70,69121.47
New York City,Manhattan,7002054,001464,New York-Presbyterian Hospital - Columbia Presbyterian Center,50 to 69,107,M,White,Not Span/Hispanic,2,Urgent,Home or Self Care,2022,INJ036,"Complication of transplanted organs or tissue, initial encounter",RES005,CHEST TUBE PLACEMENT AND THERAPEUTIC THORACENTESIS,143,"OTHER RESPIRATORY DIAGNOSES EXCEPT SIGNS, SYMPTOMS AND MISCELLANEOUS DIAGNOSES",04,DISEASES AND DISORDERS OF THE RESPIRATORY SYSTEM,3,Major,Moderate,Medical,Medicare,Private Health Insurance,,,,N,59898.99,15382.75
New York City,Manhattan,7002054,001464,New York-Presbyterian Hospital - Columbia Presbyterian Center,30 to 49,104,M,Black/African American,Not Span/Hispanic,2,Emergency,Home or Self Care,2022,INJ036,"Complication of transplanted organs or tissue, initial encounter",OTR004,ISOLATION PROCEDURES,143,"OTHER RESPIRATORY DIAGNOSES EXCEPT SIGNS, SYMPTOMS AND MISCELLANEOUS DIAGNOSES",04,DISEASES AND DISORDERS OF THE RESPIRATORY SYSTEM,3,Major,Major,Medical,Medicare,Medicaid,,,,Y,45631.00,11872.48
New York City,Manhattan,7002054,001464,New York-Presbyterian Hospital - Columbia Presbyterian Center,0 to 17,109,F,White,Not Span/Hispanic,1,Emergency,Home or Self Care,2022,PNL006,Respiratory perinatal condition,,,143,"OTHER RESPIRATORY DIAGNOSES EXCEPT SIGNS, SYMPTOMS AND MISCELLANEOUS DIAGNOSES",04,DISEASES AND DISORDERS OF THE RESPIRATORY SYSTEM,1,Minor,Minor,Medical,Self-Pay,,,03400,,Y,20941.43,5971.01
New York City,Manhattan,7002054,001464,New York-Presbyterian Hospital - Columbia Presbyterian Center,30 to 49,112,F,Black/African American,Unknown,10,Urgent,Home or Self Care,2022,INJ036,"Complication of transplanted organs or tissue, initial encounter",ADM019,POTENTIAL COVID-19 THERAPIES,143,"OTHER RESPIRATORY DIAGNOSES EXCEPT SIGNS, SYMPTOMS AND MISCELLANEOUS DIAGNOSES",04,DISEASES AND DISORDERS OF THE RESPIRATORY SYSTEM,4,Extreme,Major,Medical,Medicaid,,,,,N,181989.35,43849.12
New York City,Manhattan,7002054,001464,New York-Presbyterian Hospital - Columbia Presbyterian Center,50 to 69,100,F,White,Not Span/Hispanic,28,Urgent,Inpatient Rehabilitation Facility,2022,INJ036,"Complication of transplanted organs or tissue, initial encounter",ADM021,"ADMINISTRATION OF THERAPEUTIC SUBSTANCES, NEC",143,"OTHER RESPIRATORY DIAGNOSES EXCEPT SIGNS, SYMPTOMS AND MISCELLANEOUS DIAGNOSES",04,DISEASES AND DISORDERS OF THE RESPIRATORY SYSTEM,4,Extreme,Extreme,Medical,Private Health Insurance,,,,,N,715208.78,298676.24
New York City,Manhattan,7002054,001464,New York-Presbyterian Hospital - Columbia Presbyterian Center,70 or Older,100,F,Other Race,Not Span/Hispanic,20,Urgent,Home or Self Care,2022,INJ036,"Complication of transplanted organs or tissue, initial encounter",ADM003,ADMINISTRATION OF ALBUMIN AND GLOBULIN,143,"OTHER RESPIRATORY DIAGNOSES EXCEPT SIGNS, SYMPTOMS AND MISCELLANEOUS DIAGNOSES",04,DISEASES AND DISORDERS OF THE RESPIRATORY SYSTEM,4,Extreme,Major,Medical,Medicare,,,,,N,427265.19,123110.26
New York City,Manhattan,7002054,001464,New York-Presbyterian Hospital - Columbia Presbyterian Center,70 or Older,114,M,White,Not Span/Hispanic,17,Emergency,Expired,2022,INJ036,"Complication of transplanted organs or tissue, initial encounter",OTR004,ISOLATION PROCEDURES,143,"OTHER RESPIRATORY DIAGNOSES EXCEPT SIGNS, SYMPTOMS AND MISCELLANEOUS DIAGNOSES",04,DISEASES AND DISORDERS OF THE RESPIRATORY SYSTEM,4,Extreme,Extreme,Medical,Medicare,Private Health Insurance,,,,Y,368918.54,161147.84
New York City,Manhattan,7002054,001464,New York-Presbyterian Hospital - Columbia Presbyterian Center,70 or Older,115,F,White,Not Span/Hispanic,11,Emergency,Home or Self Care,2022,INJ036,"Complication of transplanted organs or tissue, initial encounter",ADM017,ADMINISTRATION OF NUTRITIONAL AND ELECTROLYTIC SUBSTANCES,143,"OTHER RESPIRATORY DIAGNOSES EXCEPT SIGNS, SYMPTOMS AND MISCELLANEOUS DIAGNOSES",04,DISEASES AND DISORDERS OF THE RESPIRATORY SYSTEM,3,Major,Major,Medical,Medicare,Private Health Insurance,,,,Y,185062.55,43929.23
New York City,Manhattan,7002054,001464,New York-Presbyterian Hospital - Columbia Presbyterian Center,70 or Older,115,M,Other Race,Not Span/Hispanic,18,Emergency,Expired,2022,RSP011,"Pleurisy, pleural effusion and pulmonary collapse",EST001,PHERESIS THERAPY,143,"OTHER RESPIRATORY DIAGNOSES EXCEPT SIGNS, SYMPTOMS AND MISCELLANEOUS DIAGNOSES",04,DISEASES AND DISORDERS OF THE RESPIRATORY SYSTEM,4,Extreme,Major,Medical,Medicare,Private Health Insurance,,,,Y,366914.04,88320.70
New York City,Manhattan,7002054,001464,New York-Presbyterian Hospital - Columbia Presbyterian Center,50 to 69,OOS,M,White,Not Span/Hispanic,13,Urgent,Home or Self Care,2022,RSP017,Postprocedural or postoperative respiratory system complication,RES009,BRONCHOSCOPIC EXCISION AND FULGURATION,143,"OTHER RESPIRATORY DIAGNOSES EXCEPT SIGNS, SYMPTOMS AND MISCELLANEOUS DIAGNOSES",04,DISEASES AND DISORDERS OF THE RESPIRATORY SYSTEM,2,Moderate,Moderate,Medical,Medicare,Private Health Insurance,,,,N,273124.82,65863.78
New York City,Manhattan,7002054,001464,New York-Presbyterian Hospital - Columbia Presbyterian Center,70 or Older,124,M,White,Not Span/Hispanic,3,Emergency,Home or Self Care,2022,INJ036,"Complication of transplanted organs or tissue, initial encounter",ADM019,POTENTIAL COVID-19 THERAPIES,143,"OTHER RESPIRATORY DIAGNOSES EXCEPT SIGNS, SYMPTOMS AND MISCELLANEOUS DIAGNOSES",04,DISEASES AND DISORDERS OF THE RESPIRATORY SYSTEM,3,Major,Major,Medical,Medicare,Blue Cross/Blue Shield,,,,Y,61472.50,21543.08
New York City,Manhattan,7002054,001464,New York-Presbyterian Hospital - Columbia Presbyterian Center,50 to 69,100,M,Other Race,Spanish/Hispanic,1,Emergency,Home or Self Care,2022,MAL008,Musculoskeletal congenital conditions,,,143,"OTHER RESPIRATORY DIAGNOSES EXCEPT SIGNS, SYMPTOMS AND MISCELLANEOUS DIAGNOSES",04,DISEASES AND DISORDERS OF THE RESPIRATORY SYSTEM,2,Moderate,Minor,Medical,Medicare,Medicaid,,,,Y,22363.20,4968.00
New York City,Manhattan,7002054,001464,New York-Presbyterian Hospital - Columbia Presbyterian Center,0 to 17,112,M,White,Not Span/Hispanic,3,Emergency,Home or Self Care,2022,RSP014,Pneumothorax,RES005,CHEST TUBE PLACEMENT AND THERAPEUTIC THORACENTESIS,143,"OTHER RESPIRATORY DIAGNOSES EXCEPT SIGNS, SYMPTOMS AND MISCELLANEOUS DIAGNOSES",04,DISEASES AND DISORDERS OF THE RESPIRATORY SYSTEM,2,Moderate,Moderate,Medical,Medicaid,,,,,Y,69151.21,30939.41
New York City,Manhattan,7002054,001464,New York-Presbyterian Hospital - Columbia Presbyterian Center,30 to 49,,M,White,Unknown,11,Urgent,Home or Self Care,2022,INJ036,"Complication of transplanted organs or tissue, initial encounter",ADM021,"ADMINISTRATION OF THERAPEUTIC SUBSTANCES, NEC",143,"OTHER RESPIRATORY DIAGNOSES EXCEPT SIGNS, SYMPTOMS AND MISCELLANEOUS DIAGNOSES",04,DISEASES AND DISORDERS OF THE RESPIRATORY SYSTEM,4,Extreme,Extreme,Medical,Private Health Insurance,,,,,N,180834.23,39979.81
New York City,Manhattan,7002054,001464,New York-Presbyterian Hospital - Columbia Presbyterian Center,30 to 49,111,F,Other Race,Unknown,6,Emergency,Home or Self Care,2022,INJ036,"Complication of transplanted organs or tissue, initial encounter",RES001,BRONCHOSCOPY (DIAGNOSTIC),143,"OTHER RESPIRATORY DIAGNOSES EXCEPT SIGNS, SYMPTOMS AND MISCELLANEOUS DIAGNOSES",04,DISEASES AND DISORDERS OF THE RESPIRATORY SYSTEM,3,Major,Moderate,Medical,Medicare,Medicaid,,,,Y,128851.55,28395.18
New York City,Manhattan,7002054,001464,New York-Presbyterian Hospital - Columbia Presbyterian Center,70 or Older,109,M,White,Not Span/Hispanic,6,Emergency,Home or Self Care,2022,RSP014,Pneumothorax,RES005,CHEST TUBE PLACEMENT AND THERAPEUTIC THORACENTESIS,143,"OTHER RESPIRATORY DIAGNOSES EXCEPT SIGNS, SYMPTOMS AND MISCELLANEOUS DIAGNOSES",04,DISEASES AND DISORDERS OF THE RESPIRATORY SYSTEM,2,Moderate,Moderate,Medical,Medicare,Private Health Insurance,,,,Y,126769.71,59471.93
New York City,Manhattan,7002054,001464,New York-Presbyterian Hospital - Columbia Presbyterian Center,0 to 17,109,F,White,Not Span/Hispanic,5,Emergency,Home or Self Care,2022,RSP015,Mediastinal disorders,ADM017,ADMINISTRATION OF NUTRITIONAL AND ELECTROLYTIC SUBSTANCES,143,"OTHER RESPIRATORY DIAGNOSES EXCEPT SIGNS, SYMPTOMS AND MISCELLANEOUS DIAGNOSES",04,DISEASES AND DISORDERS OF THE RESPIRATORY SYSTEM,1,Minor,Minor,Medical,Medicaid,,,,,Y,131300.27,54277.16
New York City,Manhattan,7002054,001464,New York-Presbyterian Hospital - Columbia Presbyterian Center,50 to 69,114,F,Black/African American,Not Span/Hispanic,9,Emergency,Expired,2022,INJ036,"Complication of transplanted organs or tissue, initial encounter",ADM019,POTENTIAL COVID-19 THERAPIES,143,"OTHER RESPIRATORY DIAGNOSES EXCEPT SIGNS, SYMPTOMS AND MISCELLANEOUS DIAGNOSES",04,DISEASES AND DISORDERS OF THE RESPIRATORY SYSTEM,4,Extreme,Extreme,Medical,Medicare,,,,,Y,399556.66,148922.62
New York City,Manhattan,7002053,001463,NYU Langone Hospitals,50 to 69,125,M,White,Not Span/Hispanic,3,Emergency,Home or Self Care,2022,INJ036,"Complication of transplanted organs or tissue, initial encounter",RES001,BRONCHOSCOPY (DIAGNOSTIC),143,"OTHER RESPIRATORY DIAGNOSES EXCEPT SIGNS, SYMPTOMS AND MISCELLANEOUS DIAGNOSES",04,DISEASES AND DISORDERS OF THE RESPIRATORY SYSTEM,3,Major,Moderate,Medical,Medicare,Private Health Insurance,,,,N,226278.36,26669.08
New York City,Manhattan,7002053,001463,NYU Langone Hospitals,0 to 17,112,M,White,Not Span/Hispanic,2,Emergency,Home or Self Care,2022,INJ020,"Effect of foreign body entering opening, initial encounter",RES004,BRONCHOSCOPY (THERAPEUTIC),143,"OTHER RESPIRATORY DIAGNOSES EXCEPT SIGNS, SYMPTOMS AND MISCELLANEOUS DIAGNOSES",04,DISEASES AND DISORDERS OF THE RESPIRATORY SYSTEM,3,Major,Moderate,Medical,Medicaid,,,,,Y,72502.96,12965.48
New York City,Manhattan,7002054,001464,New York-Presbyterian Hospital - Columbia Presbyterian Center,70 or Older,OOS,M,White,Not Span/Hispanic,31,Elective,Home w/ Home Health Services,2022,INJ036,"Complication of transplanted organs or tissue, initial encounter",ESA003,MECHANICAL VENTILATION,143,"OTHER RESPIRATORY DIAGNOSES EXCEPT SIGNS, SYMPTOMS AND MISCELLANEOUS DIAGNOSES",04,DISEASES AND DISORDERS OF THE RESPIRATORY SYSTEM,4,Extreme,Major,Medical,Medicare,Private Health Insurance,,,,N,580606.47,167133.53
New York City,Manhattan,7002054,001464,New York-Presbyterian Hospital - Columbia Presbyterian Center,50 to 69,119,F,White,Spanish/Hispanic,18,Urgent,Home w/ Home Health Services,2022,INJ036,"Complication of transplanted organs or tissue, initial encounter",GIS002,COLONOSCOPY AND PROCTOSCOPY WITH BIOPSY,143,"OTHER RESPIRATORY DIAGNOSES EXCEPT SIGNS, SYMPTOMS AND MISCELLANEOUS DIAGNOSES",04,DISEASES AND DISORDERS OF THE RESPIRATORY SYSTEM,3,Major,Moderate,Medical,Blue Cross/Blue Shield,Medicare,,,,N,452456.41,131654.46
New York City,Manhattan,7002054,001464,New York-Presbyterian Hospital - Columbia Presbyterian Center,30 to 49,,M,Multi-racial,Unknown,15,Urgent,Home or Self Care,2022,INJ036,"Complication of transplanted organs or tissue, initial encounter",GIS025,OTHER GI SYSTEM DEVICE PROCEDURES,143,"OTHER RESPIRATORY DIAGNOSES EXCEPT SIGNS, SYMPTOMS AND MISCELLANEOUS DIAGNOSES",04,DISEASES AND DISORDERS OF THE RESPIRATORY SYSTEM,3,Major,Major,Medical,Private Health Insurance,,,,,N,342128.49,101472.97
Finger Lakes,Monroe,2701005,000413,Strong Memorial Hospital,0 to 17,146,M,White,Unknown,1,Emergency,Home or Self Care,2022,RSP014,Pneumothorax,,,143,"OTHER RESPIRATORY DIAGNOSES EXCEPT SIGNS, SYMPTOMS AND MISCELLANEOUS DIAGNOSES",04,DISEASES AND DISORDERS OF THE RESPIRATORY SYSTEM,2,Moderate,Minor,Medical,Blue Cross/Blue Shield,,,,,Y,5452.72,2145.56
Finger Lakes,Monroe,2701005,000413,Strong Memorial Hospital,30 to 49,144,M,White,Not Span/Hispanic,2,Emergency,Home or Self Care,2022,RSP017,Postprocedural or postoperative respiratory system complication,,,143,"OTHER RESPIRATORY DIAGNOSES EXCEPT SIGNS, SYMPTOMS AND MISCELLANEOUS DIAGNOSES",04,DISEASES AND DISORDERS OF THE RESPIRATORY SYSTEM,2,Moderate,Minor,Medical,Private Health Insurance,,,,,Y,11724.70,4522.98
Finger Lakes,Monroe,2701005,000413,Strong Memorial Hospital,50 to 69,146,F,White,Not Span/Hispanic,5,Emergency,Home or Self Care,2022,RSP011,"Pleurisy, pleural effusion and pulmonary collapse",RES005,CHEST TUBE PLACEMENT AND THERAPEUTIC THORACENTESIS,143,"OTHER RESPIRATORY DIAGNOSES EXCEPT SIGNS, SYMPTOMS AND MISCELLANEOUS DIAGNOSES",04,DISEASES AND DISORDERS OF THE RESPIRATORY SYSTEM,2,Moderate,Minor,Medical,Blue Cross/Blue Shield,,,,,Y,33133.04,12101.01
Finger Lakes,Monroe,2701005,000413,Strong Memorial Hospital,50 to 69,146,M,White,Not Span/Hispanic,1,Emergency,Expired,2022,RSP017,Postprocedural or postoperative respiratory system complication,ESA003,MECHANICAL VENTILATION,143,"OTHER RESPIRATORY DIAGNOSES EXCEPT SIGNS, SYMPTOMS AND MISCELLANEOUS DIAGNOSES",04,DISEASES AND DISORDERS OF THE RESPIRATORY SYSTEM,4,Extreme,Extreme,Medical,Medicaid,,,,,Y,28332.67,7571.97
Finger Lakes,Monroe,2701005,000413,Strong Memorial Hospital,70 or Older,144,M,White,Not Span/Hispanic,2,Elective,Home or Self Care,2022,RSP011,"Pleurisy, pleural effusion and pulmonary collapse",RES005,CHEST TUBE PLACEMENT AND THERAPEUTIC THORACENTESIS,143,"OTHER RESPIRATORY DIAGNOSES EXCEPT SIGNS, SYMPTOMS AND MISCELLANEOUS DIAGNOSES",04,DISEASES AND DISORDERS OF THE RESPIRATORY SYSTEM,2,Moderate,Minor,Medical,Medicare,,,,,N,17275.78,5844.05
Finger Lakes,Monroe,2701005,000413,Strong Memorial Hospital,18 to 29,,M,White,Not Span/Hispanic,3,Urgent,Home or Self Care,2022,RSP014,Pneumothorax,,,143,"OTHER RESPIRATORY DIAGNOSES EXCEPT SIGNS, SYMPTOMS AND MISCELLANEOUS DIAGNOSES",04,DISEASES AND DISORDERS OF THE RESPIRATORY SYSTEM,4,Extreme,Extreme,Medical,Medicaid,,,,,N,7278.61,4012.88
Finger Lakes,Monroe,2701005,000413,Strong Memorial Hospital,0 to 17,144,F,White,Not Span/Hispanic,3,Emergency,Home or Self Care,2022,RSP014,Pneumothorax,RES005,CHEST TUBE PLACEMENT AND THERAPEUTIC THORACENTESIS,143,"OTHER RESPIRATORY DIAGNOSES EXCEPT SIGNS, SYMPTOMS AND MISCELLANEOUS DIAGNOSES",04,DISEASES AND DISORDERS OF THE RESPIRATORY SYSTEM,2,Moderate,Moderate,Medical,Blue Cross/Blue Shield,,,,,Y,25177.19,11606.59
Finger Lakes,Monroe,2701005,000413,Strong Memorial Hospital,0 to 17,146,F,Black/African American,Not Span/Hispanic,1,Emergency,Home or Self Care,2022,RSP017,Postprocedural or postoperative respiratory system complication,RES001,BRONCHOSCOPY (DIAGNOSTIC),143,"OTHER RESPIRATORY DIAGNOSES EXCEPT SIGNS, SYMPTOMS AND MISCELLANEOUS DIAGNOSES",04,DISEASES AND DISORDERS OF THE RESPIRATORY SYSTEM,3,Major,Moderate,Medical,Medicaid,,,,,Y,16001.87,5767.84
Finger Lakes,Monroe,2701005,000413,Strong Memorial Hospital,70 or Older,145,F,White,Not Span/Hispanic,2,Elective,Home or Self Care,2022,RSP017,Postprocedural or postoperative respiratory system complication,RES002,"LUNG, PLEURA, OR DIAPHRAGM BIOPSY (NON-ENDOSCOPIC)",143,"OTHER RESPIRATORY DIAGNOSES EXCEPT SIGNS, SYMPTOMS AND MISCELLANEOUS DIAGNOSES",04,DISEASES AND DISORDERS OF THE RESPIRATORY SYSTEM,2,Moderate,Minor,Medical,Medicare,Private Health Insurance,,,,N,24902.20,9254.25
Finger Lakes,Monroe,2701005,000413,Strong Memorial Hospital,50 to 69,130,M,White,Not Span/Hispanic,26,Emergency,Home or Self Care,2022,RSP011,"Pleurisy, pleural effusion and pulmonary collapse",RES005,CHEST TUBE PLACEMENT AND THERAPEUTIC THORACENTESIS,143,"OTHER RESPIRATORY DIAGNOSES EXCEPT SIGNS, SYMPTOMS AND MISCELLANEOUS DIAGNOSES",04,DISEASES AND DISORDERS OF THE RESPIRATORY SYSTEM,4,Extreme,Extreme,Medical,Medicaid,,,,,Y,131538.21,53348.20
Finger Lakes,Monroe,2701005,000413,Strong Memorial Hospital,18 to 29,146,M,White,Not Span/Hispanic,3,Emergency,Home w/ Home Health Services,2022,RSP014,Pneumothorax,RES005,CHEST TUBE PLACEMENT AND THERAPEUTIC THORACENTESIS,143,"OTHER RESPIRATORY DIAGNOSES EXCEPT SIGNS, SYMPTOMS AND MISCELLANEOUS DIAGNOSES",04,DISEASES AND DISORDERS OF THE RESPIRATORY SYSTEM,2,Moderate,Moderate,Medical,Medicaid,,,,,Y,16926.38,6298.43
Finger Lakes,Monroe,2701005,000413,Strong Memorial Hospital,18 to 29,130,M,White,Not Span/Hispanic,4,Urgent,Home or Self Care,2022,RSP014,Pneumothorax,RES005,CHEST TUBE PLACEMENT AND THERAPEUTIC THORACENTESIS,143,"OTHER RESPIRATORY DIAGNOSES EXCEPT SIGNS, SYMPTOMS AND MISCELLANEOUS DIAGNOSES",04,DISEASES AND DISORDERS OF THE RESPIRATORY SYSTEM,1,Minor,Minor,Medical,Medicaid,,,,,N,16596.41,6900.53
Finger Lakes,Monroe,2701005,000413,Strong Memorial Hospital,0 to 17,144,M,White,Not Span/Hispanic,1,Emergency,Home or Self Care,2022,RSP014,Pneumothorax,ENT001,LARYNGOSCOPY (DIAGNOSTIC),143,"OTHER RESPIRATORY DIAGNOSES EXCEPT SIGNS, SYMPTOMS AND MISCELLANEOUS DIAGNOSES",04,DISEASES AND DISORDERS OF THE RESPIRATORY SYSTEM,2,Moderate,Minor,Medical,Medicaid,,,,,Y,9423.46,2992.77
New York City,Manhattan,7002053,001463,NYU Langone Hospitals,18 to 29,100,F,White,Unknown,2,Emergency,Home or Self Care,2022,RSP014,Pneumothorax,RES005,CHEST TUBE PLACEMENT AND THERAPEUTIC THORACENTESIS,143,"OTHER RESPIRATORY DIAGNOSES EXCEPT SIGNS, SYMPTOMS AND MISCELLANEOUS DIAGNOSES",04,DISEASES AND DISORDERS OF THE RESPIRATORY SYSTEM,1,Minor,Minor,Medical,Private Health Insurance,,,,,Y,39091.64,11460.87
New York City,Manhattan,7002053,001463,NYU Langone Hospitals,50 to 69,OOS,M,White,Not Span/Hispanic,4,Emergency,Home w/ Home Health Services,2022,INJ036,"Complication of transplanted organs or tissue, initial encounter",RES001,BRONCHOSCOPY (DIAGNOSTIC),143,"OTHER RESPIRATORY DIAGNOSES EXCEPT SIGNS, SYMPTOMS AND MISCELLANEOUS DIAGNOSES",04,DISEASES AND DISORDERS OF THE RESPIRATORY SYSTEM,4,Extreme,Extreme,Medical,Private Health Insurance,,,,,Y,156384.19,28567.62
New York City,Manhattan,7002053,001463,NYU Langone Hospitals,50 to 69,112,M,Other Race,Not Span/Hispanic,3,Elective,Home w/ Home Health Services,2022,INJ036,"Complication of transplanted organs or tissue, initial encounter",RES005,CHEST TUBE PLACEMENT AND THERAPEUTIC THORACENTESIS,143,"OTHER RESPIRATORY DIAGNOSES EXCEPT SIGNS, SYMPTOMS AND MISCELLANEOUS DIAGNOSES",04,DISEASES AND DISORDERS OF THE RESPIRATORY SYSTEM,3,Major,Major,Medical,Medicare,,,,,N,100442.28,26063.47
New York City,Manhattan,7002053,001463,NYU Langone Hospitals,70 or Older,100,F,Other Race,Spanish/Hispanic,1,Elective,Home or Self Care,2022,RSP017,Postprocedural or postoperative respiratory system complication,RES002,"LUNG, PLEURA, OR DIAPHRAGM BIOPSY (NON-ENDOSCOPIC)",143,"OTHER RESPIRATORY DIAGNOSES EXCEPT SIGNS, SYMPTOMS AND MISCELLANEOUS DIAGNOSES",04,DISEASES AND DISORDERS OF THE RESPIRATORY SYSTEM,1,Minor,Minor,Medical,Medicare,Blue Cross/Blue Shield,,,,N,44791.88,9271.80
New York City,Manhattan,7002053,001463,NYU Langone Hospitals,70 or Older,112,M,White,Not Span/Hispanic,11,Emergency,Home or Self Care,2022,INJ036,"Complication of transplanted organs or tissue, initial encounter",,,143,"OTHER RESPIRATORY DIAGNOSES EXCEPT SIGNS, SYMPTOMS AND MISCELLANEOUS DIAGNOSES",04,DISEASES AND DISORDERS OF THE RESPIRATORY SYSTEM,4,Extreme,Extreme,Medical,Medicare,Medicare,,,,Y,177434.63,59495.60
New York City,Manhattan,7002053,001463,NYU Langone Hospitals,70 or Older,112,M,White,Not Span/Hispanic,2,Emergency,Home w/ Home Health Services,2022,RSP011,"Pleurisy, pleural effusion and pulmonary collapse",OTR004,ISOLATION PROCEDURES,143,"OTHER RESPIRATORY DIAGNOSES EXCEPT SIGNS, SYMPTOMS AND MISCELLANEOUS DIAGNOSES",04,DISEASES AND DISORDERS OF THE RESPIRATORY SYSTEM,3,Major,Major,Medical,Medicare,,,,,Y,51934.39,13146.25
New York City,Manhattan,7002054,001464,New York-Presbyterian Hospital - Columbia Presbyterian Center,50 to 69,OOS,M,White,Not Span/Hispanic,46,Elective,Home or Self Care,2022,INJ036,"Complication of transplanted organs or tissue, initial encounter",RES001,BRONCHOSCOPY (DIAGNOSTIC),143,"OTHER RESPIRATORY DIAGNOSES EXCEPT SIGNS, SYMPTOMS AND MISCELLANEOUS DIAGNOSES",04,DISEASES AND DISORDERS OF THE RESPIRATORY SYSTEM,4,Extreme,Extreme,Medical,Blue Cross/Blue Shield,,,,,N,957444.59,382061.09
New York City,Manhattan,7002054,001464,New York-Presbyterian Hospital - Columbia Presbyterian Center,50 to 69,OOS,M,Other Race,Spanish/Hispanic,15,Emergency,Home w/ Home Health Services,2022,INJ036,"Complication of transplanted organs or tissue, initial encounter",GIS025,OTHER GI SYSTEM DEVICE PROCEDURES,143,"OTHER RESPIRATORY DIAGNOSES EXCEPT SIGNS, SYMPTOMS AND MISCELLANEOUS DIAGNOSES",04,DISEASES AND DISORDERS OF THE RESPIRATORY SYSTEM,3,Major,Major,Medical,Private Health Insurance,,,,,Y,282829.98,67169.67
New York City,Manhattan,7002054,001464,New York-Presbyterian Hospital - Columbia Presbyterian Center,0 to 17,116,M,Black/African American,Not Span/Hispanic,2,Emergency,Home or Self Care,2022,RSP011,"Pleurisy, pleural effusion and pulmonary collapse",ADM021,"ADMINISTRATION OF THERAPEUTIC SUBSTANCES, NEC",143,"OTHER RESPIRATORY DIAGNOSES EXCEPT SIGNS, SYMPTOMS AND MISCELLANEOUS DIAGNOSES",04,DISEASES AND DISORDERS OF THE RESPIRATORY SYSTEM,2,Moderate,Minor,Medical,Medicaid,,,,,Y,35842.37,9107.05