Hospital Service Area,Hospital County,Operating Certificate Number,Permanent Facility Id,Facility Name,Age Group,Zip Code - 3 digits,Gender,Race,Ethnicity,Length of Stay,Type of Admission,Patient Disposition,Discharge Year,CCS Diagnosis Code,CCS Diagnosis Description,CCS Procedure Code,CCS Procedure Description,APR DRG Code,APR DRG Description,APR MDC Code,APR MDC Description,APR Severity of Illness Code,APR Severity of Illness Description,APR Risk of Mortality,APR Medical Surgical Description,Payment Typology 1,Payment Typology 2,Payment Typology 3,Birth Weight,Abortion Edit Indicator,Emergency Department Indicator,Total Charges,Total Costs
New York City,Manhattan,7002054,001464,New York-Presbyterian Hospital - Columbia Presbyterian Center,18 to 29,113,F,Other Race,Spanish/Hispanic,3,Emergency,Home or Self Care,2022,SYM013,Respiratory signs and symptoms,,,145,ACUTE BRONCHITIS AND RELATED SYMPTOMS,04,DISEASES AND DISORDERS OF THE RESPIRATORY SYSTEM,2,Moderate,Minor,Medical,Medicaid,,,,,Y,64232.10,13574.35
New York City,Manhattan,7002054,001464,New York-Presbyterian Hospital - Columbia Presbyterian Center,0 to 17,100,M,Other Race,Not Span/Hispanic,1,Emergency,Home or Self Care,2022,SYM013,Respiratory signs and symptoms,ADM015,ADMINISTRATION OF ANTIBIOTICS,145,ACUTE BRONCHITIS AND RELATED SYMPTOMS,04,DISEASES AND DISORDERS OF THE RESPIRATORY SYSTEM,3,Major,Moderate,Medical,Private Health Insurance,,,,,Y,25100.46,6549.78
New York City,Manhattan,7002054,001464,New York-Presbyterian Hospital - Columbia Presbyterian Center,50 to 69,100,M,Black/African American,Not Span/Hispanic,1,Emergency,Home or Self Care,2022,SYM013,Respiratory signs and symptoms,,,145,ACUTE BRONCHITIS AND RELATED SYMPTOMS,04,DISEASES AND DISORDERS OF THE RESPIRATORY SYSTEM,2,Moderate,Major,Medical,Medicaid,,,,,Y,26860.79,5604.15
Finger Lakes,Monroe,2701005,000413,Strong Memorial Hospital,50 to 69,145,M,White,Not Span/Hispanic,2,Emergency,Home or Self Care,2022,SYM013,Respiratory signs and symptoms,,,145,ACUTE BRONCHITIS AND RELATED SYMPTOMS,04,DISEASES AND DISORDERS OF THE RESPIRATORY SYSTEM,3,Major,Major,Medical,Medicaid,,,,,Y,11635.92,4623.33
New York City,Manhattan,7002053,001463,NYU Langone Hospitals,70 or Older,117,M,White,Not Span/Hispanic,1,Emergency,Home or Self Care,2022,SYM013,Respiratory signs and symptoms,RES001,BRONCHOSCOPY (DIAGNOSTIC),145,ACUTE BRONCHITIS AND RELATED SYMPTOMS,04,DISEASES AND DISORDERS OF THE RESPIRATORY SYSTEM,2,Moderate,Moderate,Medical,Medicare,Blue Cross/Blue Shield,,,,Y,48583.05,9475.47
New York City,Manhattan,7002001,001438,Bellevue Hospital Center,50 to 69,112,M,Other Race,Spanish/Hispanic,5,Emergency,Home or Self Care,2022,SYM013,Respiratory signs and symptoms,ADM021,"ADMINISTRATION OF THERAPEUTIC SUBSTANCES, NEC",145,ACUTE BRONCHITIS AND RELATED SYMPTOMS,04,DISEASES AND DISORDERS OF THE RESPIRATORY SYSTEM,2,Moderate,Moderate,Medical,Medicaid,,,,,Y,34964.56,20107.56
New York City,Manhattan,7002054,001464,New York-Presbyterian Hospital - Columbia Presbyterian Center,50 to 69,100,F,Other Race,Spanish/Hispanic,2,Emergency,Home w/ Home Health Services,2022,SYM013,Respiratory signs and symptoms,,,145,ACUTE BRONCHITIS AND RELATED SYMPTOMS,04,DISEASES AND DISORDERS OF THE RESPIRATORY SYSTEM,3,Major,Major,Medical,Medicaid,,,,,Y,45877.66,10069.13
New York City,Manhattan,7002054,001464,New York-Presbyterian Hospital - Columbia Presbyterian Center,30 to 49,OOS,M,White,Not Span/Hispanic,4,Urgent,Home or Self Care,2022,SYM013,Respiratory signs and symptoms,,,145,ACUTE BRONCHITIS AND RELATED SYMPTOMS,04,DISEASES AND DISORDERS OF THE RESPIRATORY SYSTEM,3,Major,Major,Medical,Private Health Insurance,,,,,N,106036.92,43640.47
New York City,Manhattan,7002054,001464,New York-Presbyterian Hospital - Columbia Presbyterian Center,70 or Older,100,F,Other Race,Spanish/Hispanic,7,Emergency,Home w/ Home Health Services,2022,SYM013,Respiratory signs and symptoms,ADM005,ADMINISTRATION OF THROMBOLYTICS AND PLATELET INHIBITORS,145,ACUTE BRONCHITIS AND RELATED SYMPTOMS,04,DISEASES AND DISORDERS OF THE RESPIRATORY SYSTEM,3,Major,Major,Medical,Medicare,Medicaid,,,,Y,174756.45,60993.55
New York City,Manhattan,7002053,001463,NYU Langone Hospitals,0 to 17,112,F,Other Race,Not Span/Hispanic,2,Emergency,Home w/ Home Health Services,2022,RSP006,Other specified upper respiratory infections,ADM019,POTENTIAL COVID-19 THERAPIES,145,ACUTE BRONCHITIS AND RELATED SYMPTOMS,04,DISEASES AND DISORDERS OF THE RESPIRATORY SYSTEM,4,Extreme,Major,Medical,Medicaid,,,,,Y,48656.00,11758.22
New York City,Manhattan,7002001,001438,Bellevue Hospital Center,70 or Older,100,F,Other Race,Spanish/Hispanic,1,Emergency,Home or Self Care,2022,SYM013,Respiratory signs and symptoms,ADM021,"ADMINISTRATION OF THERAPEUTIC SUBSTANCES, NEC",145,ACUTE BRONCHITIS AND RELATED SYMPTOMS,04,DISEASES AND DISORDERS OF THE RESPIRATORY SYSTEM,2,Moderate,Minor,Medical,Medicare,Medicare,Medicaid,,,Y,9858.64,5669.55
Finger Lakes,Monroe,2701005,000413,Strong Memorial Hospital,50 to 69,144,M,White,Not Span/Hispanic,8,Emergency,Home or Self Care,2022,SYM013,Respiratory signs and symptoms,,,145,ACUTE BRONCHITIS AND RELATED SYMPTOMS,04,DISEASES AND DISORDERS OF THE RESPIRATORY SYSTEM,4,Extreme,Extreme,Medical,Private Health Insurance,,,,,Y,45523.92,18144.82
Finger Lakes,Monroe,2701005,000413,Strong Memorial Hospital,50 to 69,144,M,White,Not Span/Hispanic,2,Emergency,Home or Self Care,2022,SYM013,Respiratory signs and symptoms,,,145,ACUTE BRONCHITIS AND RELATED SYMPTOMS,04,DISEASES AND DISORDERS OF THE RESPIRATORY SYSTEM,2,Moderate,Moderate,Medical,Blue Cross/Blue Shield,,,,,Y,12638.31,4841.65
New York City,Manhattan,7002053,001463,NYU Langone Hospitals,70 or Older,119,F,White,Not Span/Hispanic,3,Emergency,Home or Self Care,2022,SYM013,Respiratory signs and symptoms,MAM005,MEASUREMENT DURING CARDIAC CATHETERIZATION,145,ACUTE BRONCHITIS AND RELATED SYMPTOMS,04,DISEASES AND DISORDERS OF THE RESPIRATORY SYSTEM,3,Major,Major,Medical,Medicare,Medicare,,,,Y,79630.91,20219.12
New York City,Manhattan,7002053,001463,NYU Langone Hospitals,70 or Older,112,F,White,Not Span/Hispanic,2,Emergency,Home w/ Home Health Services,2022,SYM013,Respiratory signs and symptoms,IMG008,ULTRASONOGRAPHY,145,ACUTE BRONCHITIS AND RELATED SYMPTOMS,04,DISEASES AND DISORDERS OF THE RESPIRATORY SYSTEM,3,Major,Major,Medical,Medicare,Blue Cross/Blue Shield,,,,Y,45629.84,12870.20
New York City,Manhattan,7002053,001463,NYU Langone Hospitals,0 to 17,112,M,White,Not Span/Hispanic,2,Elective,Home or Self Care,2022,RSP005,Acute bronchitis,RES001,BRONCHOSCOPY (DIAGNOSTIC),145,ACUTE BRONCHITIS AND RELATED SYMPTOMS,04,DISEASES AND DISORDERS OF THE RESPIRATORY SYSTEM,2,Moderate,Minor,Medical,Medicaid,,,,,N,61651.28,11353.85
New York City,Manhattan,7002054,001464,New York-Presbyterian Hospital - Columbia Presbyterian Center,50 to 69,OOS,F,White,Not Span/Hispanic,1,Emergency,Home or Self Care,2022,SYM013,Respiratory signs and symptoms,,,145,ACUTE BRONCHITIS AND RELATED SYMPTOMS,04,DISEASES AND DISORDERS OF THE RESPIRATORY SYSTEM,1,Minor,Minor,Medical,Private Health Insurance,,,,,Y,23135.54,4817.84
Long Island,Nassau,2951001,000541,North Shore University Hospital,50 to 69,113,M,Other Race,Not Span/Hispanic,1,Emergency,Home or Self Care,2022,SYM013,Respiratory signs and symptoms,,,145,ACUTE BRONCHITIS AND RELATED SYMPTOMS,04,DISEASES AND DISORDERS OF THE RESPIRATORY SYSTEM,1,Minor,Minor,Medical,Medicare,Medicare,Medicaid,,,Y,34548.55,6008.06
Long Island,Nassau,2951001,000541,North Shore University Hospital,70 or Older,113,F,White,Not Span/Hispanic,1,Urgent,Home or Self Care,2022,SYM013,Respiratory signs and symptoms,MAM005,MEASUREMENT DURING CARDIAC CATHETERIZATION,145,ACUTE BRONCHITIS AND RELATED SYMPTOMS,04,DISEASES AND DISORDERS OF THE RESPIRATORY SYSTEM,2,Moderate,Minor,Medical,Medicare,Blue Cross/Blue Shield,,,,N,34110.36,6216.41
Long Island,Nassau,2951001,000541,North Shore University Hospital,70 or Older,115,M,White,Not Span/Hispanic,9,Emergency,Home w/ Home Health Services,2022,RSP005,Acute bronchitis,ENT003,ENT DIAGNOSTIC PROCEDURES (NON-ENDOSCOPIC),145,ACUTE BRONCHITIS AND RELATED SYMPTOMS,04,DISEASES AND DISORDERS OF THE RESPIRATORY SYSTEM,2,Moderate,Major,Medical,Medicare,Private Health Insurance,,,,Y,147477.35,22985.44
New York City,Manhattan,7002001,001438,Bellevue Hospital Center,0 to 17,104,F,Other Race,Unknown,3,Emergency,Home w/ Home Health Services,2022,RSP006,Other specified upper respiratory infections,ADM015,ADMINISTRATION OF ANTIBIOTICS,145,ACUTE BRONCHITIS AND RELATED SYMPTOMS,04,DISEASES AND DISORDERS OF THE RESPIRATORY SYSTEM,4,Extreme,Moderate,Medical,Medicaid,,,,,Y,40345.80,23202.22
Long Island,Nassau,2951001,000541,North Shore University Hospital,70 or Older,110,F,White,Not Span/Hispanic,1,Emergency,Home or Self Care,2022,SYM013,Respiratory signs and symptoms,,,145,ACUTE BRONCHITIS AND RELATED SYMPTOMS,04,DISEASES AND DISORDERS OF THE RESPIRATORY SYSTEM,1,Minor,Minor,Medical,Medicare,Blue Cross/Blue Shield,,,,Y,23310.05,3281.08
Long Island,Nassau,2951001,000541,North Shore University Hospital,50 to 69,113,M,White,Not Span/Hispanic,1,Emergency,Left Against Medical Advice,2022,SYM013,Respiratory signs and symptoms,,,145,ACUTE BRONCHITIS AND RELATED SYMPTOMS,04,DISEASES AND DISORDERS OF THE RESPIRATORY SYSTEM,1,Minor,Moderate,Medical,Medicare,Private Health Insurance,,,,Y,29371.32,3776.95
Long Island,Nassau,2951001,000541,North Shore University Hospital,70 or Older,117,F,White,Not Span/Hispanic,4,Emergency,Skilled Nursing Home,2022,SYM013,Respiratory signs and symptoms,,,145,ACUTE BRONCHITIS AND RELATED SYMPTOMS,04,DISEASES AND DISORDERS OF THE RESPIRATORY SYSTEM,1,Minor,Minor,Medical,Medicare,Private Health Insurance,,,,Y,56367.56,9577.88
Long Island,Nassau,2951001,000541,North Shore University Hospital,30 to 49,110,F,White,Not Span/Hispanic,1,Emergency,Left Against Medical Advice,2022,SYM013,Respiratory signs and symptoms,,,145,ACUTE BRONCHITIS AND RELATED SYMPTOMS,04,DISEASES AND DISORDERS OF THE RESPIRATORY SYSTEM,3,Major,Moderate,Medical,Medicare,Medicaid,,,,Y,19739.44,5752.07
Finger Lakes,Monroe,2701005,000413,Strong Memorial Hospital,70 or Older,,F,White,Unknown,19,Urgent,Home or Self Care,2022,SYM013,Respiratory signs and symptoms,SKB001,SKIN BIOPSY AND DIAGNOSTIC DRAINAGE,145,ACUTE BRONCHITIS AND RELATED SYMPTOMS,04,DISEASES AND DISORDERS OF THE RESPIRATORY SYSTEM,4,Extreme,Extreme,Medical,Medicare,Federal/State/Local/VA,,,,N,102396.08,43906.22
New York City,Manhattan,7002001,001438,Bellevue Hospital Center,30 to 49,112,F,White,Unknown,1,Emergency,Home or Self Care,2022,SYM013,Respiratory signs and symptoms,IMG006,COMPUTERIZED TOMOGRAPHY (CT) WITH CONTRAST,145,ACUTE BRONCHITIS AND RELATED SYMPTOMS,04,DISEASES AND DISORDERS OF THE RESPIRATORY SYSTEM,1,Minor,Minor,Medical,Private Health Insurance,,,,,Y,13075.57,7519.55
New York City,Manhattan,7002053,001463,NYU Langone Hospitals,0 to 17,112,F,Other Race,Spanish/Hispanic,2,Emergency,Home or Self Care,2022,RSP006,Other specified upper respiratory infections,ESA003,MECHANICAL VENTILATION,145,ACUTE BRONCHITIS AND RELATED SYMPTOMS,04,DISEASES AND DISORDERS OF THE RESPIRATORY SYSTEM,3,Major,Major,Medical,Medicaid,,,,,Y,135126.93,15248.34
New York City,Manhattan,7002053,001463,NYU Langone Hospitals,0 to 17,112,F,White,Not Span/Hispanic,3,Elective,Home or Self Care,2022,RSP005,Acute bronchitis,RES001,BRONCHOSCOPY (DIAGNOSTIC),145,ACUTE BRONCHITIS AND RELATED SYMPTOMS,04,DISEASES AND DISORDERS OF THE RESPIRATORY SYSTEM,2,Moderate,Minor,Medical,Medicaid,,,,,N,72028.45,14838.75
New York City,Manhattan,7002054,001464,New York-Presbyterian Hospital - Columbia Presbyterian Center,0 to 17,OOS,M,White,Not Span/Hispanic,3,Emergency,Home or Self Care,2022,RSP006,Other specified upper respiratory infections,,,145,ACUTE BRONCHITIS AND RELATED SYMPTOMS,04,DISEASES AND DISORDERS OF THE RESPIRATORY SYSTEM,4,Extreme,Major,Medical,Private Health Insurance,Medicaid,,03000,,Y,105884.03,43879.20
New York City,Manhattan,7002054,001464,New York-Presbyterian Hospital - Columbia Presbyterian Center,30 to 49,100,M,Black/African American,Unknown,8,Emergency,Home or Self Care,2022,SYM013,Respiratory signs and symptoms,RES001,BRONCHOSCOPY (DIAGNOSTIC),145,ACUTE BRONCHITIS AND RELATED SYMPTOMS,04,DISEASES AND DISORDERS OF THE RESPIRATORY SYSTEM,3,Major,Major,Medical,Medicaid,,,,,Y,162215.93,34473.29
New York City,Manhattan,7002054,001464,New York-Presbyterian Hospital - Columbia Presbyterian Center,50 to 69,114,M,Other Race,Spanish/Hispanic,5,Emergency,Home or Self Care,2022,SYM013,Respiratory signs and symptoms,RES014,"RESPIRATORY SYSTEM PROCEDURES, NEC",145,ACUTE BRONCHITIS AND RELATED SYMPTOMS,04,DISEASES AND DISORDERS OF THE RESPIRATORY SYSTEM,2,Moderate,Minor,Medical,Medicaid,,,,,Y,101112.14,24799.57
Capital/Adirond,Warren,5601000,001005,Glens Falls Hospital,70 or Older,128,F,White,Not Span/Hispanic,4,Emergency,Home or Self Care,2022,RSP005,Acute bronchitis,,,145,ACUTE BRONCHITIS AND RELATED SYMPTOMS,04,DISEASES AND DISORDERS OF THE RESPIRATORY SYSTEM,2,Moderate,Minor,Medical,Medicare,Private Health Insurance,,,,Y,23054.12,5750.97
Capital/Adirond,Warren,5601000,001005,Glens Falls Hospital,50 to 69,128,F,White,Not Span/Hispanic,1,Emergency,Home or Self Care,2022,SYM013,Respiratory signs and symptoms,,,145,ACUTE BRONCHITIS AND RELATED SYMPTOMS,04,DISEASES AND DISORDERS OF THE RESPIRATORY SYSTEM,2,Moderate,Moderate,Medical,Private Health Insurance,,,,,Y,10517.55,2792.33
New York City,Manhattan,7002054,001464,New York-Presbyterian Hospital - Columbia Presbyterian Center,70 or Older,109,F,White,Not Span/Hispanic,2,Emergency,Home or Self Care,2022,SYM013,Respiratory signs and symptoms,IMG008,ULTRASONOGRAPHY,145,ACUTE BRONCHITIS AND RELATED SYMPTOMS,04,DISEASES AND DISORDERS OF THE RESPIRATORY SYSTEM,1,Minor,Minor,Medical,Medicare,Private Health Insurance,,,,Y,38285.23,7948.91
New York City,Manhattan,7002054,001464,New York-Presbyterian Hospital - Columbia Presbyterian Center,30 to 49,117,F,White,Not Span/Hispanic,3,Emergency,Home w/ Home Health Services,2022,SYM013,Respiratory signs and symptoms,,,145,ACUTE BRONCHITIS AND RELATED SYMPTOMS,04,DISEASES AND DISORDERS OF THE RESPIRATORY SYSTEM,3,Major,Major,Medical,Medicare,,,,,Y,49277.93,10071.87
Finger Lakes,Monroe,2701005,000413,Strong Memorial Hospital,18 to 29,146,F,White,Not Span/Hispanic,2,Emergency,Home or Self Care,2022,SYM013,Respiratory signs and symptoms,,,145,ACUTE BRONCHITIS AND RELATED SYMPTOMS,04,DISEASES AND DISORDERS OF THE RESPIRATORY SYSTEM,2,Moderate,Minor,Medical,Private Health Insurance,,,,,Y,11942.17,4335.94
New York City,Manhattan,7002001,001438,Bellevue Hospital Center,70 or Older,114,F,White,Unknown,6,Emergency,Home or Self Care,2022,RSP005,Acute bronchitis,IMG008,ULTRASONOGRAPHY,145,ACUTE BRONCHITIS AND RELATED SYMPTOMS,04,DISEASES AND DISORDERS OF THE RESPIRATORY SYSTEM,2,Moderate,Major,Medical,Medicare,Medicaid,,,,Y,50210.85,28875.46
Long Island,Nassau,2951001,000541,North Shore University Hospital,70 or Older,113,F,White,Not Span/Hispanic,1,Emergency,Home w/ Home Health Services,2022,SYM013,Respiratory signs and symptoms,,,145,ACUTE BRONCHITIS AND RELATED SYMPTOMS,04,DISEASES AND DISORDERS OF THE RESPIRATORY SYSTEM,1,Minor,Moderate,Medical,Medicare,Medicaid,,,,Y,29336.52,3627.44
Long Island,Nassau,2951001,000541,North Shore University Hospital,30 to 49,113,F,White,Not Span/Hispanic,1,Emergency,Home or Self Care,2022,SYM013,Respiratory signs and symptoms,IMG008,ULTRASONOGRAPHY,145,ACUTE BRONCHITIS AND RELATED SYMPTOMS,04,DISEASES AND DISORDERS OF THE RESPIRATORY SYSTEM,1,Minor,Minor,Medical,Blue Cross/Blue Shield,,,,,Y,26579.67,3852.45
New York City,Manhattan,7002001,001438,Bellevue Hospital Center,50 to 69,112,M,Other Race,Spanish/Hispanic,3,Emergency,Home or Self Care,2022,SYM013,Respiratory signs and symptoms,ADM021,"ADMINISTRATION OF THERAPEUTIC SUBSTANCES, NEC",145,ACUTE BRONCHITIS AND RELATED SYMPTOMS,04,DISEASES AND DISORDERS OF THE RESPIRATORY SYSTEM,3,Major,Moderate,Medical,Medicaid,,,,,Y,22578.10,12984.30
New York City,Manhattan,7002001,001438,Bellevue Hospital Center,50 to 69,112,F,Other Race,Spanish/Hispanic,2,Emergency,Home or Self Care,2022,SYM013,Respiratory signs and symptoms,ADM021,"ADMINISTRATION OF THERAPEUTIC SUBSTANCES, NEC",145,ACUTE BRONCHITIS AND RELATED SYMPTOMS,04,DISEASES AND DISORDERS OF THE RESPIRATORY SYSTEM,2,Moderate,Minor,Medical,Medicare,,,,,Y,20130.19,11576.55
Hudson Valley,Dutchess,1302001,000181,Vassar Brothers Medical Center,70 or Older,126,M,White,Not Span/Hispanic,6,Emergency,Home or Self Care,2022,RSP005,Acute bronchitis,RES001,BRONCHOSCOPY (DIAGNOSTIC),145,ACUTE BRONCHITIS AND RELATED SYMPTOMS,04,DISEASES AND DISORDERS OF THE RESPIRATORY SYSTEM,2,Moderate,Moderate,Medical,Medicare,,,,,Y,37305.39,10453.52
New York City,Manhattan,7002054,001464,New York-Presbyterian Hospital - Columbia Presbyterian Center,30 to 49,100,M,Other Race,Spanish/Hispanic,1,Emergency,Home or Self Care,2022,RSP011,"Pleurisy, pleural effusion and pulmonary collapse",,,145,ACUTE BRONCHITIS AND RELATED SYMPTOMS,04,DISEASES AND DISORDERS OF THE RESPIRATORY SYSTEM,3,Major,Major,Medical,Medicaid,,,,,Y,23773.89,5304.06
New York City,Manhattan,7002054,001464,New York-Presbyterian Hospital - Columbia Presbyterian Center,50 to 69,104,M,Black/African American,Not Span/Hispanic,1,Emergency,Left Against Medical Advice,2022,SYM013,Respiratory signs and symptoms,,,145,ACUTE BRONCHITIS AND RELATED SYMPTOMS,04,DISEASES AND DISORDERS OF THE RESPIRATORY SYSTEM,2,Moderate,Moderate,Medical,Medicare,,,,,Y,29905.50,5840.08
New York City,Manhattan,7002054,001464,New York-Presbyterian Hospital - Columbia Presbyterian Center,50 to 69,100,F,Other Race,Spanish/Hispanic,5,Emergency,Home or Self Care,2022,SYM013,Respiratory signs and symptoms,,,145,ACUTE BRONCHITIS AND RELATED SYMPTOMS,04,DISEASES AND DISORDERS OF THE RESPIRATORY SYSTEM,2,Moderate,Minor,Medical,Medicaid,,,,,Y,64644.78,14134.94
New York City,Manhattan,7002054,001464,New York-Presbyterian Hospital - Columbia Presbyterian Center,30 to 49,100,F,Black/African American,Not Span/Hispanic,1,Emergency,Left Against Medical Advice,2022,SYM013,Respiratory signs and symptoms,,,145,ACUTE BRONCHITIS AND RELATED SYMPTOMS,04,DISEASES AND DISORDERS OF THE RESPIRATORY SYSTEM,2,Moderate,Moderate,Medical,Medicare,,,,,Y,18126.84,
New York City,Manhattan,7002054,001464,New York-Presbyterian Hospital - Columbia Presbyterian Center,50 to 69,OOS,F,Other Race,Spanish/Hispanic,1,Emergency,Home or Self Care,2022,SYM013,Respiratory signs and symptoms,ENT001,LARYNGOSCOPY (DIAGNOSTIC),145,ACUTE BRONCHITIS AND RELATED SYMPTOMS,04,DISEASES AND DISORDERS OF THE RESPIRATORY SYSTEM,2,Moderate,Moderate,Medical,Medicare,,,,,Y,23346.94,4868.63
Finger Lakes,Monroe,2701005,000413,Strong Memorial Hospital,50 to 69,144,M,White,Not Span/Hispanic,4,Emergency,Home w/ Home Health Services,2022,RSP005,Acute bronchitis,ESA004,NON-INVASIVE VENTILATION,145,ACUTE BRONCHITIS AND RELATED SYMPTOMS,04,DISEASES AND DISORDERS OF THE RESPIRATORY SYSTEM,3,Major,Extreme,Medical,Medicare,Private Health Insurance,,,,Y,32090.08,14493.24
Finger Lakes,Monroe,2701005,000413,Strong Memorial Hospital,18 to 29,144,M,White,Not Span/Hispanic,7,Emergency,Home or Self Care,2022,SYM013,Respiratory signs and symptoms,RES001,BRONCHOSCOPY (DIAGNOSTIC),145,ACUTE BRONCHITIS AND RELATED SYMPTOMS,04,DISEASES AND DISORDERS OF THE RESPIRATORY SYSTEM,1,Minor,Minor,Medical,Medicaid,,,,,Y,42479.90,16198.92
New York City,Manhattan,7002001,001438,Bellevue Hospital Center,50 to 69,100,M,Black/African American,Not Span/Hispanic,1,Emergency,Left Against Medical Advice,2022,SYM013,Respiratory signs and symptoms,,,145,ACUTE BRONCHITIS AND RELATED SYMPTOMS,04,DISEASES AND DISORDERS OF THE RESPIRATORY SYSTEM,1,Minor,Minor,Medical,Medicaid,,,,,Y,8445.18,4856.69
Finger Lakes,Monroe,2701005,000413,Strong Memorial Hospital,0 to 17,146,M,Black/African American,Not Span/Hispanic,1,Emergency,Home or Self Care,2022,SYM013,Respiratory signs and symptoms,,,145,ACUTE BRONCHITIS AND RELATED SYMPTOMS,04,DISEASES AND DISORDERS OF THE RESPIRATORY SYSTEM,1,Minor,Minor,Medical,Medicaid,,,,,Y,7204.03,2911.57
Capital/Adirond,Warren,5601000,001005,Glens Falls Hospital,70 or Older,128,F,White,Not Span/Hispanic,3,Emergency,Home or Self Care,2022,RSP005,Acute bronchitis,,,145,ACUTE BRONCHITIS AND RELATED SYMPTOMS,04,DISEASES AND DISORDERS OF THE RESPIRATORY SYSTEM,2,Moderate,Minor,Medical,Medicare,,,,,Y,15325.85,5031.14
Capital/Adirond,Warren,5601000,001005,Glens Falls Hospital,70 or Older,128,M,White,Not Span/Hispanic,4,Emergency,Home or Self Care,2022,RSP005,Acute bronchitis,,,145,ACUTE BRONCHITIS AND RELATED SYMPTOMS,04,DISEASES AND DISORDERS OF THE RESPIRATORY SYSTEM,2,Moderate,Moderate,Medical,Medicare,Blue Cross/Blue Shield,,,,Y,23126.99,7479.63
New York City,Manhattan,7002054,001464,New York-Presbyterian Hospital - Columbia Presbyterian Center,70 or Older,100,F,Other Race,Spanish/Hispanic,1,Emergency,Home or Self Care,2022,SYM013,Respiratory signs and symptoms,,,145,ACUTE BRONCHITIS AND RELATED SYMPTOMS,04,DISEASES AND DISORDERS OF THE RESPIRATORY SYSTEM,1,Minor,Minor,Medical,Medicare,,,,,Y,25018.32,
New York City,Manhattan,7002054,001464,New York-Presbyterian Hospital - Columbia Presbyterian Center,30 to 49,104,F,Black/African American,Not Span/Hispanic,3,Emergency,Left Against Medical Advice,2022,SYM013,Respiratory signs and symptoms,,,145,ACUTE BRONCHITIS AND RELATED SYMPTOMS,04,DISEASES AND DISORDERS OF THE RESPIRATORY SYSTEM,3,Major,Moderate,Medical,Private Health Insurance,,,,,Y,71197.76,14573.96
Long Island,Nassau,2951001,000541,North Shore University Hospital,50 to 69,115,F,White,Not Span/Hispanic,4,Urgent,Home or Self Care,2022,RSP005,Acute bronchitis,IMG001,CARDIAC AND CORONARY FLUOROSCOPY,145,ACUTE BRONCHITIS AND RELATED SYMPTOMS,04,DISEASES AND DISORDERS OF THE RESPIRATORY SYSTEM,2,Moderate,Moderate,Medical,Medicare,Private Health Insurance,,,,N,63801.49,9964.82
Long Island,Nassau,2951001,000541,North Shore University Hospital,70 or Older,113,F,White,Not Span/Hispanic,4,Emergency,Home w/ Home Health Services,2022,SYM013,Respiratory signs and symptoms,,,145,ACUTE BRONCHITIS AND RELATED SYMPTOMS,04,DISEASES AND DISORDERS OF THE RESPIRATORY SYSTEM,2,Moderate,Moderate,Medical,Medicare,Private Health Insurance,Blue Cross/Blue Shield,,,Y,66623.51,9570.02
Long Island,Nassau,2951001,000541,North Shore University Hospital,30 to 49,113,M,Black/African American,Not Span/Hispanic,11,Emergency,Skilled Nursing Home,2022,SYM013,Respiratory signs and symptoms,,,145,ACUTE BRONCHITIS AND RELATED SYMPTOMS,04,DISEASES AND DISORDERS OF THE RESPIRATORY SYSTEM,3,Major,Moderate,Medical,Medicaid,Medicaid,,,,Y,135656.33,22529.20
Long Island,Nassau,2951001,000541,North Shore University Hospital,50 to 69,114,F,Black/African American,Not Span/Hispanic,1,Urgent,Home or Self Care,2022,SYM013,Respiratory signs and symptoms,,,145,ACUTE BRONCHITIS AND RELATED SYMPTOMS,04,DISEASES AND DISORDERS OF THE RESPIRATORY SYSTEM,3,Major,Major,Medical,Medicaid,Medicaid,,,,N,11977.05,1929.86
New York City,Manhattan,7002054,001464,New York-Presbyterian Hospital - Columbia Presbyterian Center,70 or Older,100,F,Black/African American,Not Span/Hispanic,2,Emergency,Home or Self Care,2022,SYM013,Respiratory signs and symptoms,,,145,ACUTE BRONCHITIS AND RELATED SYMPTOMS,04,DISEASES AND DISORDERS OF THE RESPIRATORY SYSTEM,2,Moderate,Moderate,Medical,Medicare,Medicaid,,,,Y,42163.95,9140.27
Long Island,Nassau,2951001,000541,North Shore University Hospital,30 to 49,117,F,White,Not Span/Hispanic,1,Emergency,Left Against Medical Advice,2022,SYM013,Respiratory signs and symptoms,,,145,ACUTE BRONCHITIS AND RELATED SYMPTOMS,04,DISEASES AND DISORDERS OF THE RESPIRATORY SYSTEM,1,Minor,Minor,Medical,Blue Cross/Blue Shield,,,,,Y,21405.14,3102.82