Hospital Service Area,Hospital County,Operating Certificate Number,Permanent Facility Id,Facility Name,Age Group,Zip Code - 3 digits,Gender,Race,Ethnicity,Length of Stay,Type of Admission,Patient Disposition,Discharge Year,CCS Diagnosis Code,CCS Diagnosis Description,CCS Procedure Code,CCS Procedure Description,APR DRG Code,APR DRG Description,APR MDC Code,APR MDC Description,APR Severity of Illness Code,APR Severity of Illness Description,APR Risk of Mortality,APR Medical Surgical Description,Payment Typology 1,Payment Typology 2,Payment Typology 3,Birth Weight,Abortion Edit Indicator,Emergency Department Indicator,Total Charges,Total Costs
New York City,Manhattan,7002054,001464,New York-Presbyterian Hospital - Columbia Presbyterian Center,50 to 69,100,M,White,Spanish/Hispanic,11,Emergency,Home or Self Care,2022,CIR009,Acute myocardial infarction,CAR003,CORONARY ARTERY BYPASS GRAFTS (CABG),165,CORONARY BYPASS WITH AMI OR COMPLEX PRINCIPAL DIAGNOSIS,05,DISEASES AND DISORDERS OF THE CIRCULATORY SYSTEM,2,Moderate,Moderate,Surgical,Medicaid,,,,,Y,382489.35,146661.46
New York City,Manhattan,7002054,001464,New York-Presbyterian Hospital - Columbia Presbyterian Center,50 to 69,107,M,Other Race,Unknown,19,Urgent,Home w/ Home Health Services,2022,CIR009,Acute myocardial infarction,CAR003,CORONARY ARTERY BYPASS GRAFTS (CABG),165,CORONARY BYPASS WITH AMI OR COMPLEX PRINCIPAL DIAGNOSIS,05,DISEASES AND DISORDERS OF THE CIRCULATORY SYSTEM,3,Major,Major,Surgical,Medicare,Medicaid,,,,N,590889.50,246298.85
New York City,Manhattan,7002054,001464,New York-Presbyterian Hospital - Columbia Presbyterian Center,70 or Older,104,M,Other Race,Spanish/Hispanic,47,Emergency,Home w/ Home Health Services,2022,GEN003,Chronic kidney disease,CAR003,CORONARY ARTERY BYPASS GRAFTS (CABG),165,CORONARY BYPASS WITH AMI OR COMPLEX PRINCIPAL DIAGNOSIS,05,DISEASES AND DISORDERS OF THE CIRCULATORY SYSTEM,3,Major,Extreme,Surgical,Medicare,,,,,Y,1317558.59,438837.79
New York City,Manhattan,7002053,001463,NYU Langone Hospitals,50 to 69,111,M,Other Race,Not Span/Hispanic,5,Elective,Home or Self Care,2022,INJ033,"Complication of cardiovascular device, implant or graft, initial encounter",CAR003,CORONARY ARTERY BYPASS GRAFTS (CABG),165,CORONARY BYPASS WITH AMI OR COMPLEX PRINCIPAL DIAGNOSIS,05,DISEASES AND DISORDERS OF THE CIRCULATORY SYSTEM,3,Major,Extreme,Surgical,Medicare,Medicaid,,,,N,428127.27,72889.19
Finger Lakes,Monroe,2701005,000413,Strong Memorial Hospital,70 or Older,144,F,White,Not Span/Hispanic,18,Emergency,Home w/ Home Health Services,2022,CIR009,Acute myocardial infarction,CAR003,CORONARY ARTERY BYPASS GRAFTS (CABG),165,CORONARY BYPASS WITH AMI OR COMPLEX PRINCIPAL DIAGNOSIS,05,DISEASES AND DISORDERS OF THE CIRCULATORY SYSTEM,3,Major,Major,Surgical,Medicare,,,,,Y,154663.77,67619.24
Finger Lakes,Monroe,2701005,000413,Strong Memorial Hospital,30 to 49,144,M,White,Not Span/Hispanic,10,Emergency,Home w/ Home Health Services,2022,CIR009,Acute myocardial infarction,CAR003,CORONARY ARTERY BYPASS GRAFTS (CABG),165,CORONARY BYPASS WITH AMI OR COMPLEX PRINCIPAL DIAGNOSIS,05,DISEASES AND DISORDERS OF THE CIRCULATORY SYSTEM,2,Moderate,Moderate,Surgical,Blue Cross/Blue Shield,,,,,Y,85684.61,35986.50
New York City,Manhattan,7002054,001464,New York-Presbyterian Hospital - Columbia Presbyterian Center,70 or Older,125,M,White,Not Span/Hispanic,41,Urgent,Home or Self Care,2022,CIR009,Acute myocardial infarction,CAR003,CORONARY ARTERY BYPASS GRAFTS (CABG),165,CORONARY BYPASS WITH AMI OR COMPLEX PRINCIPAL DIAGNOSIS,05,DISEASES AND DISORDERS OF THE CIRCULATORY SYSTEM,4,Extreme,Extreme,Surgical,Medicare,Private Health Insurance,,,,N,1169784.47,459393.40
New York City,Manhattan,7002053,001463,NYU Langone Hospitals,30 to 49,112,M,Black/African American,Not Span/Hispanic,7,Emergency,Home or Self Care,2022,CIR008,Hypertension with complications and secondary hypertension,MAM005,MEASUREMENT DURING CARDIAC CATHETERIZATION,165,CORONARY BYPASS WITH AMI OR COMPLEX PRINCIPAL DIAGNOSIS,05,DISEASES AND DISORDERS OF THE CIRCULATORY SYSTEM,3,Major,Extreme,Surgical,Private Health Insurance,,,,,Y,335327.62,71929.27
Finger Lakes,Monroe,2701005,000413,Strong Memorial Hospital,70 or Older,144,F,White,Not Span/Hispanic,9,Emergency,Home w/ Home Health Services,2022,CIR009,Acute myocardial infarction,CAR003,CORONARY ARTERY BYPASS GRAFTS (CABG),165,CORONARY BYPASS WITH AMI OR COMPLEX PRINCIPAL DIAGNOSIS,05,DISEASES AND DISORDERS OF THE CIRCULATORY SYSTEM,2,Moderate,Moderate,Surgical,Medicare,Blue Cross/Blue Shield,,,,Y,108657.25,47939.10
Finger Lakes,Monroe,2701005,000413,Strong Memorial Hospital,70 or Older,144,F,White,Not Span/Hispanic,8,Urgent,Skilled Nursing Home,2022,CIR009,Acute myocardial infarction,CAR003,CORONARY ARTERY BYPASS GRAFTS (CABG),165,CORONARY BYPASS WITH AMI OR COMPLEX PRINCIPAL DIAGNOSIS,05,DISEASES AND DISORDERS OF THE CIRCULATORY SYSTEM,2,Moderate,Moderate,Surgical,Medicare,,,,,N,121066.67,49410.24
Finger Lakes,Monroe,2701005,000413,Strong Memorial Hospital,50 to 69,141,M,White,Not Span/Hispanic,7,Elective,Home w/ Home Health Services,2022,INJ033,"Complication of cardiovascular device, implant or graft, initial encounter",CAR003,CORONARY ARTERY BYPASS GRAFTS (CABG),165,CORONARY BYPASS WITH AMI OR COMPLEX PRINCIPAL DIAGNOSIS,05,DISEASES AND DISORDERS OF THE CIRCULATORY SYSTEM,3,Major,Major,Surgical,Medicare,,,,,N,106374.81,46623.16
Finger Lakes,Monroe,2701005,000413,Strong Memorial Hospital,50 to 69,148,M,White,Not Span/Hispanic,13,Urgent,Home w/ Home Health Services,2022,CIR009,Acute myocardial infarction,CAR003,CORONARY ARTERY BYPASS GRAFTS (CABG),165,CORONARY BYPASS WITH AMI OR COMPLEX PRINCIPAL DIAGNOSIS,05,DISEASES AND DISORDERS OF THE CIRCULATORY SYSTEM,2,Moderate,Moderate,Surgical,Medicare,Medicaid,,,,N,113194.84,51178.90
Finger Lakes,Monroe,2701005,000413,Strong Memorial Hospital,70 or Older,146,M,White,Not Span/Hispanic,16,Emergency,Home w/ Home Health Services,2022,CIR009,Acute myocardial infarction,CAR003,CORONARY ARTERY BYPASS GRAFTS (CABG),165,CORONARY BYPASS WITH AMI OR COMPLEX PRINCIPAL DIAGNOSIS,05,DISEASES AND DISORDERS OF THE CIRCULATORY SYSTEM,3,Major,Major,Surgical,Federal/State/Local/VA,,,,,Y,134276.13,62161.23
New York City,Manhattan,7002054,001464,New York-Presbyterian Hospital - Columbia Presbyterian Center,50 to 69,100,M,Other Race,Spanish/Hispanic,20,Emergency,Home w/ Home Health Services,2022,CIR009,Acute myocardial infarction,CAR003,CORONARY ARTERY BYPASS GRAFTS (CABG),165,CORONARY BYPASS WITH AMI OR COMPLEX PRINCIPAL DIAGNOSIS,05,DISEASES AND DISORDERS OF THE CIRCULATORY SYSTEM,3,Major,Extreme,Surgical,Medicaid,,,,,Y,532028.57,185147.49
Finger Lakes,Monroe,2701005,000413,Strong Memorial Hospital,30 to 49,146,M,White,Not Span/Hispanic,8,Emergency,Home w/ Home Health Services,2022,CIR009,Acute myocardial infarction,CAR003,CORONARY ARTERY BYPASS GRAFTS (CABG),165,CORONARY BYPASS WITH AMI OR COMPLEX PRINCIPAL DIAGNOSIS,05,DISEASES AND DISORDERS OF THE CIRCULATORY SYSTEM,2,Moderate,Moderate,Surgical,Blue Cross/Blue Shield,,,,,Y,82302.20,36091.27
Finger Lakes,Monroe,2701005,000413,Strong Memorial Hospital,70 or Older,144,M,White,Not Span/Hispanic,9,Emergency,Home w/ Home Health Services,2022,CIR009,Acute myocardial infarction,CAR003,CORONARY ARTERY BYPASS GRAFTS (CABG),165,CORONARY BYPASS WITH AMI OR COMPLEX PRINCIPAL DIAGNOSIS,05,DISEASES AND DISORDERS OF THE CIRCULATORY SYSTEM,2,Moderate,Major,Surgical,Federal/State/Local/VA,,,,,Y,104112.40,44555.82
New York City,Manhattan,7002054,001464,New York-Presbyterian Hospital - Columbia Presbyterian Center,50 to 69,100,M,Other Race,Spanish/Hispanic,24,Emergency,Home w/ Home Health Services,2022,CIR009,Acute myocardial infarction,CAR003,CORONARY ARTERY BYPASS GRAFTS (CABG),165,CORONARY BYPASS WITH AMI OR COMPLEX PRINCIPAL DIAGNOSIS,05,DISEASES AND DISORDERS OF THE CIRCULATORY SYSTEM,3,Major,Moderate,Surgical,Medicaid,,,,,Y,748604.63,310513.42
Long Island,Nassau,2951001,000541,North Shore University Hospital,50 to 69,118,M,Other Race,Not Span/Hispanic,14,Urgent,Home w/ Home Health Services,2022,CIR009,Acute myocardial infarction,CAR003,CORONARY ARTERY BYPASS GRAFTS (CABG),165,CORONARY BYPASS WITH AMI OR COMPLEX PRINCIPAL DIAGNOSIS,05,DISEASES AND DISORDERS OF THE CIRCULATORY SYSTEM,4,Extreme,Extreme,Surgical,Private Health Insurance,,,,,N,489760.25,83376.18
Long Island,Nassau,2951001,000541,North Shore University Hospital,30 to 49,115,F,White,Spanish/Hispanic,11,Urgent,Home w/ Home Health Services,2022,CIR009,Acute myocardial infarction,CAR003,CORONARY ARTERY BYPASS GRAFTS (CABG),165,CORONARY BYPASS WITH AMI OR COMPLEX PRINCIPAL DIAGNOSIS,05,DISEASES AND DISORDERS OF THE CIRCULATORY SYSTEM,3,Major,Major,Surgical,Medicaid,,,,,N,303541.40,51197.50
Long Island,Nassau,2951001,000541,North Shore University Hospital,30 to 49,115,M,White,Not Span/Hispanic,13,Emergency,Home w/ Home Health Services,2022,INJ033,"Complication of cardiovascular device, implant or graft, initial encounter",CAR003,CORONARY ARTERY BYPASS GRAFTS (CABG),165,CORONARY BYPASS WITH AMI OR COMPLEX PRINCIPAL DIAGNOSIS,05,DISEASES AND DISORDERS OF THE CIRCULATORY SYSTEM,3,Major,Major,Surgical,Private Health Insurance,,,,,Y,317976.50,54293.73
Long Island,Nassau,2951001,000541,North Shore University Hospital,70 or Older,114,F,Other Race,Not Span/Hispanic,4,Emergency,Expired,2022,CIR009,Acute myocardial infarction,CAR003,CORONARY ARTERY BYPASS GRAFTS (CABG),165,CORONARY BYPASS WITH AMI OR COMPLEX PRINCIPAL DIAGNOSIS,05,DISEASES AND DISORDERS OF THE CIRCULATORY SYSTEM,4,Extreme,Extreme,Surgical,Medicare,Medicare,Medicaid,,,Y,387064.03,65659.86
Finger Lakes,Monroe,2701005,000413,Strong Memorial Hospital,70 or Older,145,M,White,Not Span/Hispanic,13,Emergency,Home w/ Home Health Services,2022,CIR009,Acute myocardial infarction,CAR003,CORONARY ARTERY BYPASS GRAFTS (CABG),165,CORONARY BYPASS WITH AMI OR COMPLEX PRINCIPAL DIAGNOSIS,05,DISEASES AND DISORDERS OF THE CIRCULATORY SYSTEM,3,Major,Major,Surgical,Medicare,,,,,Y,132924.81,54736.02
Finger Lakes,Monroe,2701005,000413,Strong Memorial Hospital,50 to 69,144,M,White,Not Span/Hispanic,15,Emergency,Home w/ Home Health Services,2022,CIR009,Acute myocardial infarction,MAM005,MEASUREMENT DURING CARDIAC CATHETERIZATION,165,CORONARY BYPASS WITH AMI OR COMPLEX PRINCIPAL DIAGNOSIS,05,DISEASES AND DISORDERS OF THE CIRCULATORY SYSTEM,2,Moderate,Moderate,Surgical,Medicaid,,,,,Y,103923.23,45672.05
Finger Lakes,Monroe,2701005,000413,Strong Memorial Hospital,50 to 69,144,M,White,Not Span/Hispanic,12,Emergency,Home w/ Home Health Services,2022,CIR009,Acute myocardial infarction,CAR003,CORONARY ARTERY BYPASS GRAFTS (CABG),165,CORONARY BYPASS WITH AMI OR COMPLEX PRINCIPAL DIAGNOSIS,05,DISEASES AND DISORDERS OF THE CIRCULATORY SYSTEM,3,Major,Major,Surgical,Private Health Insurance,,,,,Y,122972.02,52222.18
New York City,Manhattan,7002053,001463,NYU Langone Hospitals,70 or Older,OOS,M,Other Race,Not Span/Hispanic,12,Emergency,Home or Self Care,2022,CIR009,Acute myocardial infarction,CAR003,CORONARY ARTERY BYPASS GRAFTS (CABG),165,CORONARY BYPASS WITH AMI OR COMPLEX PRINCIPAL DIAGNOSIS,05,DISEASES AND DISORDERS OF THE CIRCULATORY SYSTEM,3,Major,Major,Surgical,Medicare,,,,,Y,531689.24,114875.99
New York City,Manhattan,7002053,001463,NYU Langone Hospitals,50 to 69,112,M,Black/African American,Not Span/Hispanic,8,Emergency,Home or Self Care,2022,CIR009,Acute myocardial infarction,ADM001,TRANSFUSION OF BLOOD AND BLOOD PRODUCTS,165,CORONARY BYPASS WITH AMI OR COMPLEX PRINCIPAL DIAGNOSIS,05,DISEASES AND DISORDERS OF THE CIRCULATORY SYSTEM,3,Major,Major,Surgical,Medicare,Medicaid,,,,Y,440537.72,84404.59
New York City,Manhattan,7002054,001464,New York-Presbyterian Hospital - Columbia Presbyterian Center,50 to 69,109,F,Other Race,Spanish/Hispanic,23,Urgent,Home w/ Home Health Services,2022,CIR009,Acute myocardial infarction,CAR003,CORONARY ARTERY BYPASS GRAFTS (CABG),165,CORONARY BYPASS WITH AMI OR COMPLEX PRINCIPAL DIAGNOSIS,05,DISEASES AND DISORDERS OF THE CIRCULATORY SYSTEM,3,Major,Major,Surgical,Medicare,Private Health Insurance,,,,N,692928.03,292934.66
New York City,Manhattan,7002053,001463,NYU Langone Hospitals,50 to 69,114,F,Other Race,Not Span/Hispanic,7,Emergency,Home w/ Home Health Services,2022,INJ033,"Complication of cardiovascular device, implant or graft, initial encounter",CAR003,CORONARY ARTERY BYPASS GRAFTS (CABG),165,CORONARY BYPASS WITH AMI OR COMPLEX PRINCIPAL DIAGNOSIS,05,DISEASES AND DISORDERS OF THE CIRCULATORY SYSTEM,3,Major,Extreme,Surgical,Medicaid,,,,,N,504494.52,87310.98
New York City,Manhattan,7002001,001438,Bellevue Hospital Center,50 to 69,111,M,Other Race,Not Span/Hispanic,47,Emergency,Home w/ Home Health Services,2022,INJ033,"Complication of cardiovascular device, implant or graft, initial encounter",CAR003,CORONARY ARTERY BYPASS GRAFTS (CABG),165,CORONARY BYPASS WITH AMI OR COMPLEX PRINCIPAL DIAGNOSIS,05,DISEASES AND DISORDERS OF THE CIRCULATORY SYSTEM,4,Extreme,Extreme,Surgical,Private Health Insurance,Private Health Insurance,,,,Y,574945.44,330641.92
New York City,Manhattan,7002054,001464,New York-Presbyterian Hospital - Columbia Presbyterian Center,70 or Older,104,M,Other Race,Not Span/Hispanic,13,Emergency,Home w/ Home Health Services,2022,CIR009,Acute myocardial infarction,CAR003,CORONARY ARTERY BYPASS GRAFTS (CABG),165,CORONARY BYPASS WITH AMI OR COMPLEX PRINCIPAL DIAGNOSIS,05,DISEASES AND DISORDERS OF THE CIRCULATORY SYSTEM,2,Moderate,Moderate,Surgical,Medicare,Private Health Insurance,,,,Y,435882.02,180902.15
New York City,Manhattan,7002054,001464,New York-Presbyterian Hospital - Columbia Presbyterian Center,50 to 69,112,F,Other Race,Unknown,12,Urgent,Skilled Nursing Home,2022,CIR009,Acute myocardial infarction,CAR003,CORONARY ARTERY BYPASS GRAFTS (CABG),165,CORONARY BYPASS WITH AMI OR COMPLEX PRINCIPAL DIAGNOSIS,05,DISEASES AND DISORDERS OF THE CIRCULATORY SYSTEM,2,Moderate,Moderate,Surgical,Medicare,Medicaid,,,,N,360614.38,148093.44
Finger Lakes,Monroe,2701005,000413,Strong Memorial Hospital,50 to 69,148,M,Other Race,Unknown,9,Urgent,Home w/ Home Health Services,2022,CIR009,Acute myocardial infarction,CAR003,CORONARY ARTERY BYPASS GRAFTS (CABG),165,CORONARY BYPASS WITH AMI OR COMPLEX PRINCIPAL DIAGNOSIS,05,DISEASES AND DISORDERS OF THE CIRCULATORY SYSTEM,3,Major,Major,Surgical,Medicaid,,,,,N,102882.92,44753.66
Finger Lakes,Monroe,2701005,000413,Strong Memorial Hospital,70 or Older,145,M,White,Not Span/Hispanic,7,Urgent,Home or Self Care,2022,CIR009,Acute myocardial infarction,MAM005,MEASUREMENT DURING CARDIAC CATHETERIZATION,165,CORONARY BYPASS WITH AMI OR COMPLEX PRINCIPAL DIAGNOSIS,05,DISEASES AND DISORDERS OF THE CIRCULATORY SYSTEM,2,Moderate,Moderate,Surgical,Medicare,Private Health Insurance,,,,N,87146.10,37154.73
Finger Lakes,Monroe,2701005,000413,Strong Memorial Hospital,70 or Older,145,F,White,Not Span/Hispanic,13,Emergency,Home w/ Home Health Services,2022,CIR009,Acute myocardial infarction,CAR003,CORONARY ARTERY BYPASS GRAFTS (CABG),165,CORONARY BYPASS WITH AMI OR COMPLEX PRINCIPAL DIAGNOSIS,05,DISEASES AND DISORDERS OF THE CIRCULATORY SYSTEM,3,Major,Major,Surgical,Medicare,,,,,Y,106719.81,46145.14
Finger Lakes,Monroe,2701005,000413,Strong Memorial Hospital,50 to 69,131,M,White,Not Span/Hispanic,20,Urgent,Home w/ Home Health Services,2022,CIR009,Acute myocardial infarction,MAM005,MEASUREMENT DURING CARDIAC CATHETERIZATION,165,CORONARY BYPASS WITH AMI OR COMPLEX PRINCIPAL DIAGNOSIS,05,DISEASES AND DISORDERS OF THE CIRCULATORY SYSTEM,3,Major,Extreme,Surgical,Medicaid,,,,,N,153488.53,64677.82
Finger Lakes,Monroe,2701005,000413,Strong Memorial Hospital,50 to 69,146,F,White,Not Span/Hispanic,12,Urgent,Home w/ Home Health Services,2022,CIR009,Acute myocardial infarction,CAR003,CORONARY ARTERY BYPASS GRAFTS (CABG),165,CORONARY BYPASS WITH AMI OR COMPLEX PRINCIPAL DIAGNOSIS,05,DISEASES AND DISORDERS OF THE CIRCULATORY SYSTEM,3,Major,Major,Surgical,Medicaid,,,,,N,158181.20,63352.63
Finger Lakes,Monroe,2701005,000413,Strong Memorial Hospital,70 or Older,145,M,White,Not Span/Hispanic,9,Emergency,Home w/ Home Health Services,2022,CIR009,Acute myocardial infarction,CAR003,CORONARY ARTERY BYPASS GRAFTS (CABG),165,CORONARY BYPASS WITH AMI OR COMPLEX PRINCIPAL DIAGNOSIS,05,DISEASES AND DISORDERS OF THE CIRCULATORY SYSTEM,3,Major,Major,Surgical,Medicare,Blue Cross/Blue Shield,,,,Y,125603.27,54423.22
Finger Lakes,Monroe,2701005,000413,Strong Memorial Hospital,70 or Older,144,M,White,Not Span/Hispanic,14,Emergency,Home w/ Home Health Services,2022,CIR009,Acute myocardial infarction,MAM005,MEASUREMENT DURING CARDIAC CATHETERIZATION,165,CORONARY BYPASS WITH AMI OR COMPLEX PRINCIPAL DIAGNOSIS,05,DISEASES AND DISORDERS OF THE CIRCULATORY SYSTEM,3,Major,Major,Surgical,Federal/State/Local/VA,,,,,Y,179084.25,69399.31
Long Island,Nassau,2951001,000541,North Shore University Hospital,50 to 69,114,M,Black/African American,Not Span/Hispanic,11,Emergency,Home w/ Home Health Services,2022,CIR009,Acute myocardial infarction,ESA009,CARDIAC ASSISTANCE WITH BALLOON PUMP,165,CORONARY BYPASS WITH AMI OR COMPLEX PRINCIPAL DIAGNOSIS,05,DISEASES AND DISORDERS OF THE CIRCULATORY SYSTEM,3,Major,Extreme,Surgical,Medicaid,Medicaid,,,,Y,399021.72,69266.07
Long Island,Nassau,2951001,000541,North Shore University Hospital,50 to 69,115,M,White,Not Span/Hispanic,9,Emergency,Home or Self Care,2022,CIR009,Acute myocardial infarction,CAR003,CORONARY ARTERY BYPASS GRAFTS (CABG),165,CORONARY BYPASS WITH AMI OR COMPLEX PRINCIPAL DIAGNOSIS,05,DISEASES AND DISORDERS OF THE CIRCULATORY SYSTEM,3,Major,Major,Surgical,Private Health Insurance,,,,,Y,231231.33,38515.08
Long Island,Nassau,2951001,000541,North Shore University Hospital,70 or Older,114,F,Other Race,Not Span/Hispanic,21,Emergency,Home w/ Home Health Services,2022,CIR009,Acute myocardial infarction,ESA003,MECHANICAL VENTILATION,165,CORONARY BYPASS WITH AMI OR COMPLEX PRINCIPAL DIAGNOSIS,05,DISEASES AND DISORDERS OF THE CIRCULATORY SYSTEM,4,Extreme,Extreme,Surgical,Medicaid,,,,,Y,587475.21,95584.61
Long Island,Nassau,2951001,000541,North Shore University Hospital,70 or Older,117,M,White,Not Span/Hispanic,9,Urgent,Home w/ Home Health Services,2022,CIR009,Acute myocardial infarction,CAR003,CORONARY ARTERY BYPASS GRAFTS (CABG),165,CORONARY BYPASS WITH AMI OR COMPLEX PRINCIPAL DIAGNOSIS,05,DISEASES AND DISORDERS OF THE CIRCULATORY SYSTEM,3,Major,Major,Surgical,Medicare,Medicare,,,,N,279164.46,45613.49
Long Island,Nassau,2951001,000541,North Shore University Hospital,50 to 69,114,M,Other Race,Not Span/Hispanic,6,Urgent,Home w/ Home Health Services,2022,CIR009,Acute myocardial infarction,ESA009,CARDIAC ASSISTANCE WITH BALLOON PUMP,165,CORONARY BYPASS WITH AMI OR COMPLEX PRINCIPAL DIAGNOSIS,05,DISEASES AND DISORDERS OF THE CIRCULATORY SYSTEM,3,Major,Major,Surgical,Medicaid,Medicaid,,,,N,235396.84,41458.96
Long Island,Nassau,2951001,000541,North Shore University Hospital,50 to 69,116,F,Other Race,Not Span/Hispanic,10,Urgent,Home w/ Home Health Services,2022,CIR009,Acute myocardial infarction,CAR003,CORONARY ARTERY BYPASS GRAFTS (CABG),165,CORONARY BYPASS WITH AMI OR COMPLEX PRINCIPAL DIAGNOSIS,05,DISEASES AND DISORDERS OF THE CIRCULATORY SYSTEM,3,Major,Major,Surgical,Medicare,Medicare,,,,N,284092.50,48000.96
Long Island,Nassau,2951001,000541,North Shore University Hospital,50 to 69,113,M,White,Not Span/Hispanic,9,Emergency,Home w/ Home Health Services,2022,CIR009,Acute myocardial infarction,ESA007,CARDIAC PACING,165,CORONARY BYPASS WITH AMI OR COMPLEX PRINCIPAL DIAGNOSIS,05,DISEASES AND DISORDERS OF THE CIRCULATORY SYSTEM,4,Extreme,Extreme,Surgical,Medicaid,Medicaid,,,,Y,273761.60,47075.11
Long Island,Nassau,2951001,000541,North Shore University Hospital,50 to 69,114,M,Other Race,Not Span/Hispanic,13,Urgent,Skilled Nursing Home,2022,CIR009,Acute myocardial infarction,CAR003,CORONARY ARTERY BYPASS GRAFTS (CABG),165,CORONARY BYPASS WITH AMI OR COMPLEX PRINCIPAL DIAGNOSIS,05,DISEASES AND DISORDERS OF THE CIRCULATORY SYSTEM,3,Major,Major,Surgical,Medicare,Medicaid,,,,N,343251.63,60260.55
Long Island,Nassau,2951001,000541,North Shore University Hospital,30 to 49,114,M,Other Race,Not Span/Hispanic,8,Urgent,Home w/ Home Health Services,2022,CIR009,Acute myocardial infarction,ESA009,CARDIAC ASSISTANCE WITH BALLOON PUMP,165,CORONARY BYPASS WITH AMI OR COMPLEX PRINCIPAL DIAGNOSIS,05,DISEASES AND DISORDERS OF THE CIRCULATORY SYSTEM,3,Major,Major,Surgical,Medicaid,Medicaid,,,,N,291815.84,49551.86
Long Island,Nassau,2951001,000541,North Shore University Hospital,70 or Older,115,F,White,Not Span/Hispanic,8,Urgent,Home w/ Home Health Services,2022,INJ033,"Complication of cardiovascular device, implant or graft, initial encounter",CAR003,CORONARY ARTERY BYPASS GRAFTS (CABG),165,CORONARY BYPASS WITH AMI OR COMPLEX PRINCIPAL DIAGNOSIS,05,DISEASES AND DISORDERS OF THE CIRCULATORY SYSTEM,2,Moderate,Moderate,Surgical,Medicare,Private Health Insurance,,,,N,264402.03,44277.90
Long Island,Nassau,2951001,000541,North Shore University Hospital,50 to 69,118,M,White,Not Span/Hispanic,12,Urgent,Home w/ Home Health Services,2022,CIR009,Acute myocardial infarction,CAR003,CORONARY ARTERY BYPASS GRAFTS (CABG),165,CORONARY BYPASS WITH AMI OR COMPLEX PRINCIPAL DIAGNOSIS,05,DISEASES AND DISORDERS OF THE CIRCULATORY SYSTEM,4,Extreme,Extreme,Surgical,Private Health Insurance,,,,,N,395133.41,67737.76
Long Island,Nassau,2951001,000541,North Shore University Hospital,50 to 69,117,M,Other Race,Spanish/Hispanic,13,Emergency,Home w/ Home Health Services,2022,CIR009,Acute myocardial infarction,OTR004,ISOLATION PROCEDURES,165,CORONARY BYPASS WITH AMI OR COMPLEX PRINCIPAL DIAGNOSIS,05,DISEASES AND DISORDERS OF THE CIRCULATORY SYSTEM,3,Major,Major,Surgical,Private Health Insurance,,,,,Y,349936.65,60350.06
Long Island,Nassau,2951001,000541,North Shore University Hospital,70 or Older,117,M,Other Race,Spanish/Hispanic,8,Emergency,Home w/ Home Health Services,2022,CIR009,Acute myocardial infarction,CAR003,CORONARY ARTERY BYPASS GRAFTS (CABG),165,CORONARY BYPASS WITH AMI OR COMPLEX PRINCIPAL DIAGNOSIS,05,DISEASES AND DISORDERS OF THE CIRCULATORY SYSTEM,3,Major,Major,Surgical,Medicare,Private Health Insurance,,,,Y,243039.47,41106.79
Long Island,Nassau,2951001,000541,North Shore University Hospital,50 to 69,114,F,Other Race,Not Span/Hispanic,11,Emergency,Home w/ Home Health Services,2022,CIR009,Acute myocardial infarction,ADM001,TRANSFUSION OF BLOOD AND BLOOD PRODUCTS,165,CORONARY BYPASS WITH AMI OR COMPLEX PRINCIPAL DIAGNOSIS,05,DISEASES AND DISORDERS OF THE CIRCULATORY SYSTEM,4,Extreme,Extreme,Surgical,Medicaid,,,,,Y,317865.29,51886.51
Long Island,Nassau,2951001,000541,North Shore University Hospital,50 to 69,112,F,Other Race,Unknown,7,Emergency,Home w/ Home Health Services,2022,CIR009,Acute myocardial infarction,ESA009,CARDIAC ASSISTANCE WITH BALLOON PUMP,165,CORONARY BYPASS WITH AMI OR COMPLEX PRINCIPAL DIAGNOSIS,05,DISEASES AND DISORDERS OF THE CIRCULATORY SYSTEM,4,Extreme,Extreme,Surgical,Medicaid,,,,,Y,285620.76,49713.46
Finger Lakes,Monroe,2701005,000413,Strong Memorial Hospital,50 to 69,144,F,Other Race,Spanish/Hispanic,23,Emergency,Home or Self Care,2022,CIR009,Acute myocardial infarction,CAR003,CORONARY ARTERY BYPASS GRAFTS (CABG),165,CORONARY BYPASS WITH AMI OR COMPLEX PRINCIPAL DIAGNOSIS,05,DISEASES AND DISORDERS OF THE CIRCULATORY SYSTEM,4,Extreme,Extreme,Surgical,Blue Cross/Blue Shield,Medicare,,,,Y,289757.73,103952.39
Finger Lakes,Monroe,2701005,000413,Strong Memorial Hospital,50 to 69,144,M,White,Not Span/Hispanic,7,Urgent,Home w/ Home Health Services,2022,CIR009,Acute myocardial infarction,CAR003,CORONARY ARTERY BYPASS GRAFTS (CABG),165,CORONARY BYPASS WITH AMI OR COMPLEX PRINCIPAL DIAGNOSIS,05,DISEASES AND DISORDERS OF THE CIRCULATORY SYSTEM,3,Major,Major,Surgical,Medicaid,,,,,N,129308.57,52485.22