Hospital Service Area,Hospital County,Operating Certificate Number,Permanent Facility Id,Facility Name,Age Group,Zip Code - 3 digits,Gender,Race,Ethnicity,Length of Stay,Type of Admission,Patient Disposition,Discharge Year,CCS Diagnosis Code,CCS Diagnosis Description,CCS Procedure Code,CCS Procedure Description,APR DRG Code,APR DRG Description,APR MDC Code,APR MDC Description,APR Severity of Illness Code,APR Severity of Illness Description,APR Risk of Mortality,APR Medical Surgical Description,Payment Typology 1,Payment Typology 2,Payment Typology 3,Birth Weight,Abortion Edit Indicator,Emergency Department Indicator,Total Charges,Total Costs
New York City,Manhattan,7002054,001464,New York-Presbyterian Hospital - Columbia Presbyterian Center,30 to 49,109,M,White,Unknown,1,Emergency,Home or Self Care,2022,CIR009,Acute myocardial infarction,CAR004,PERCUTANEOUS CORONARY INTERVENTIONS (PCI),174,PERCUTANEOUS CARDIAC INTERVENTION WITH AMI,05,DISEASES AND DISORDERS OF THE CIRCULATORY SYSTEM,3,Major,Major,Surgical,Blue Cross/Blue Shield,,,,,Y,69620.07,26407.12
New York City,Manhattan,7002001,001438,Bellevue Hospital Center,50 to 69,112,F,Multi-racial,Not Span/Hispanic,2,Emergency,Home or Self Care,2022,CIR009,Acute myocardial infarction,CAR004,PERCUTANEOUS CORONARY INTERVENTIONS (PCI),174,PERCUTANEOUS CARDIAC INTERVENTION WITH AMI,05,DISEASES AND DISORDERS OF THE CIRCULATORY SYSTEM,2,Moderate,Moderate,Surgical,Medicare,Medicaid,,,,N,46717.41,26866.44
New York City,Manhattan,7002001,001438,Bellevue Hospital Center,70 or Older,104,F,Other Race,Unknown,5,Urgent,Home or Self Care,2022,CIR009,Acute myocardial infarction,CAR004,PERCUTANEOUS CORONARY INTERVENTIONS (PCI),174,PERCUTANEOUS CARDIAC INTERVENTION WITH AMI,05,DISEASES AND DISORDERS OF THE CIRCULATORY SYSTEM,2,Moderate,Moderate,Surgical,Medicare,Medicaid,,,,N,76838.07,44188.34
New York City,Manhattan,7002001,001438,Bellevue Hospital Center,70 or Older,112,F,Other Race,Spanish/Hispanic,5,Emergency,Home or Self Care,2022,CIR009,Acute myocardial infarction,CAR004,PERCUTANEOUS CORONARY INTERVENTIONS (PCI),174,PERCUTANEOUS CARDIAC INTERVENTION WITH AMI,05,DISEASES AND DISORDERS OF THE CIRCULATORY SYSTEM,3,Major,Major,Surgical,Medicare,Medicaid,,,,Y,71486.82,41110.93
New York City,Manhattan,7002054,001464,New York-Presbyterian Hospital - Columbia Presbyterian Center,70 or Older,107,M,Other Race,Unknown,2,Urgent,Home or Self Care,2022,CIR009,Acute myocardial infarction,CAR004,PERCUTANEOUS CORONARY INTERVENTIONS (PCI),174,PERCUTANEOUS CARDIAC INTERVENTION WITH AMI,05,DISEASES AND DISORDERS OF THE CIRCULATORY SYSTEM,1,Minor,Moderate,Surgical,Medicare,,,,,N,65714.16,27118.88
New York City,Manhattan,7002054,001464,New York-Presbyterian Hospital - Columbia Presbyterian Center,70 or Older,104,F,Other Race,Spanish/Hispanic,2,Emergency,Home or Self Care,2022,CIR009,Acute myocardial infarction,CAR004,PERCUTANEOUS CORONARY INTERVENTIONS (PCI),174,PERCUTANEOUS CARDIAC INTERVENTION WITH AMI,05,DISEASES AND DISORDERS OF THE CIRCULATORY SYSTEM,2,Moderate,Minor,Surgical,Medicare,,,,,Y,109080.94,44984.73
New York City,Manhattan,7002054,001464,New York-Presbyterian Hospital - Columbia Presbyterian Center,50 to 69,107,M,White,Not Span/Hispanic,2,Urgent,Home or Self Care,2022,CIR009,Acute myocardial infarction,CAR004,PERCUTANEOUS CORONARY INTERVENTIONS (PCI),174,PERCUTANEOUS CARDIAC INTERVENTION WITH AMI,05,DISEASES AND DISORDERS OF THE CIRCULATORY SYSTEM,1,Minor,Minor,Surgical,Blue Cross/Blue Shield,,,,,N,87672.44,36348.88
New York City,Manhattan,7002054,001464,New York-Presbyterian Hospital - Columbia Presbyterian Center,50 to 69,100,M,Other Race,Spanish/Hispanic,7,Emergency,Home or Self Care,2022,CIR009,Acute myocardial infarction,CAR004,PERCUTANEOUS CORONARY INTERVENTIONS (PCI),174,PERCUTANEOUS CARDIAC INTERVENTION WITH AMI,05,DISEASES AND DISORDERS OF THE CIRCULATORY SYSTEM,3,Major,Major,Surgical,Medicaid,,,,,Y,205606.72,83076.04
New York City,Manhattan,7002054,001464,New York-Presbyterian Hospital - Columbia Presbyterian Center,30 to 49,OOS,M,Other Race,Unknown,4,Emergency,Home or Self Care,2022,CIR009,Acute myocardial infarction,CAR004,PERCUTANEOUS CORONARY INTERVENTIONS (PCI),174,PERCUTANEOUS CARDIAC INTERVENTION WITH AMI,05,DISEASES AND DISORDERS OF THE CIRCULATORY SYSTEM,2,Moderate,Moderate,Surgical,Private Health Insurance,,,,,Y,125230.95,48971.34
New York City,Manhattan,7002001,001438,Bellevue Hospital Center,50 to 69,112,M,White,Unknown,1,Urgent,Home or Self Care,2022,CIR009,Acute myocardial infarction,CAR004,PERCUTANEOUS CORONARY INTERVENTIONS (PCI),174,PERCUTANEOUS CARDIAC INTERVENTION WITH AMI,05,DISEASES AND DISORDERS OF THE CIRCULATORY SYSTEM,2,Moderate,Moderate,Surgical,Medicaid,,,,,N,41139.49,23658.66
New York City,Manhattan,7002001,001438,Bellevue Hospital Center,70 or Older,114,F,Other Race,Unknown,7,Urgent,Home or Self Care,2022,CIR009,Acute myocardial infarction,CAR004,PERCUTANEOUS CORONARY INTERVENTIONS (PCI),174,PERCUTANEOUS CARDIAC INTERVENTION WITH AMI,05,DISEASES AND DISORDERS OF THE CIRCULATORY SYSTEM,3,Major,Moderate,Surgical,Medicaid,,,,,N,75167.53,43227.64
New York City,Manhattan,7002053,001463,NYU Langone Hospitals,70 or Older,100,M,White,Not Span/Hispanic,2,Emergency,Home or Self Care,2022,CIR009,Acute myocardial infarction,CAR004,PERCUTANEOUS CORONARY INTERVENTIONS (PCI),174,PERCUTANEOUS CARDIAC INTERVENTION WITH AMI,05,DISEASES AND DISORDERS OF THE CIRCULATORY SYSTEM,2,Moderate,Moderate,Surgical,Medicare,Blue Cross/Blue Shield,,,,Y,192622.08,32395.85
New York City,Manhattan,7002001,001438,Bellevue Hospital Center,30 to 49,114,M,Other Race,Unknown,3,Urgent,Home or Self Care,2022,CIR009,Acute myocardial infarction,MAM005,MEASUREMENT DURING CARDIAC CATHETERIZATION,174,PERCUTANEOUS CARDIAC INTERVENTION WITH AMI,05,DISEASES AND DISORDERS OF THE CIRCULATORY SYSTEM,3,Major,Major,Surgical,Medicaid,,,,,N,42735.46,24576.48
New York City,Manhattan,7002053,001463,NYU Langone Hospitals,70 or Older,OOS,M,White,Not Span/Hispanic,15,Emergency,Home or Self Care,2022,CIR009,Acute myocardial infarction,CAR004,PERCUTANEOUS CORONARY INTERVENTIONS (PCI),174,PERCUTANEOUS CARDIAC INTERVENTION WITH AMI,05,DISEASES AND DISORDERS OF THE CIRCULATORY SYSTEM,4,Extreme,Extreme,Surgical,Medicare,Blue Cross/Blue Shield,,,,Y,374949.86,101679.52
New York City,Manhattan,7002001,001438,Bellevue Hospital Center,70 or Older,112,F,Other Race,Spanish/Hispanic,5,Emergency,Home or Self Care,2022,CIR009,Acute myocardial infarction,CAR004,PERCUTANEOUS CORONARY INTERVENTIONS (PCI),174,PERCUTANEOUS CARDIAC INTERVENTION WITH AMI,05,DISEASES AND DISORDERS OF THE CIRCULATORY SYSTEM,2,Moderate,Major,Surgical,Medicare,Medicaid,,,,Y,56030.11,32222.02
New York City,Manhattan,7002054,001464,New York-Presbyterian Hospital - Columbia Presbyterian Center,70 or Older,100,M,Black/African American,Not Span/Hispanic,22,Emergency,Home w/ Home Health Services,2022,CIR009,Acute myocardial infarction,MAM005,MEASUREMENT DURING CARDIAC CATHETERIZATION,174,PERCUTANEOUS CARDIAC INTERVENTION WITH AMI,05,DISEASES AND DISORDERS OF THE CIRCULATORY SYSTEM,4,Extreme,Extreme,Surgical,Medicare,Medicaid,,,,Y,628048.19,265686.11
Finger Lakes,Monroe,2701005,000413,Strong Memorial Hospital,70 or Older,146,M,White,Not Span/Hispanic,3,Emergency,Home or Self Care,2022,CIR009,Acute myocardial infarction,ESA009,CARDIAC ASSISTANCE WITH BALLOON PUMP,174,PERCUTANEOUS CARDIAC INTERVENTION WITH AMI,05,DISEASES AND DISORDERS OF THE CIRCULATORY SYSTEM,3,Major,Major,Surgical,Medicare,,,,,Y,102635.15,34384.77
Finger Lakes,Monroe,2701005,000413,Strong Memorial Hospital,70 or Older,145,M,White,Not Span/Hispanic,3,Emergency,Home or Self Care,2022,CIR009,Acute myocardial infarction,CAR004,PERCUTANEOUS CORONARY INTERVENTIONS (PCI),174,PERCUTANEOUS CARDIAC INTERVENTION WITH AMI,05,DISEASES AND DISORDERS OF THE CIRCULATORY SYSTEM,2,Moderate,Moderate,Surgical,Medicare,,,,,Y,53993.11,17295.10
Finger Lakes,Monroe,2701005,000413,Strong Memorial Hospital,50 to 69,144,M,White,Unknown,1,Emergency,Home or Self Care,2022,CIR009,Acute myocardial infarction,CAR004,PERCUTANEOUS CORONARY INTERVENTIONS (PCI),174,PERCUTANEOUS CARDIAC INTERVENTION WITH AMI,05,DISEASES AND DISORDERS OF THE CIRCULATORY SYSTEM,1,Minor,Minor,Surgical,Self-Pay,,,,,Y,36039.10,10227.99
Finger Lakes,Monroe,2701005,000413,Strong Memorial Hospital,30 to 49,146,M,Black/African American,Not Span/Hispanic,1,Emergency,Home or Self Care,2022,CIR009,Acute myocardial infarction,CAR004,PERCUTANEOUS CORONARY INTERVENTIONS (PCI),174,PERCUTANEOUS CARDIAC INTERVENTION WITH AMI,05,DISEASES AND DISORDERS OF THE CIRCULATORY SYSTEM,2,Moderate,Moderate,Surgical,Medicaid,,,,,Y,36199.27,10983.44
Finger Lakes,Monroe,2701005,000413,Strong Memorial Hospital,50 to 69,146,M,Black/African American,Not Span/Hispanic,4,Emergency,Home or Self Care,2022,CIR009,Acute myocardial infarction,CAR004,PERCUTANEOUS CORONARY INTERVENTIONS (PCI),174,PERCUTANEOUS CARDIAC INTERVENTION WITH AMI,05,DISEASES AND DISORDERS OF THE CIRCULATORY SYSTEM,3,Major,Major,Surgical,Medicaid,,,,,Y,52933.31,19590.54
Finger Lakes,Monroe,2701005,000413,Strong Memorial Hospital,50 to 69,145,M,White,Not Span/Hispanic,4,Emergency,Home or Self Care,2022,CIR009,Acute myocardial infarction,CAR004,PERCUTANEOUS CORONARY INTERVENTIONS (PCI),174,PERCUTANEOUS CARDIAC INTERVENTION WITH AMI,05,DISEASES AND DISORDERS OF THE CIRCULATORY SYSTEM,1,Minor,Minor,Surgical,Blue Cross/Blue Shield,,,,,Y,84712.10,26235.63
Finger Lakes,Monroe,2701005,000413,Strong Memorial Hospital,30 to 49,,M,Black/African American,Unknown,2,Emergency,Home or Self Care,2022,CIR009,Acute myocardial infarction,CAR004,PERCUTANEOUS CORONARY INTERVENTIONS (PCI),174,PERCUTANEOUS CARDIAC INTERVENTION WITH AMI,05,DISEASES AND DISORDERS OF THE CIRCULATORY SYSTEM,1,Minor,Moderate,Surgical,Self-Pay,,,,,Y,52234.49,16082.83
Finger Lakes,Monroe,2701005,000413,Strong Memorial Hospital,70 or Older,146,M,White,Not Span/Hispanic,3,Emergency,Home w/ Home Health Services,2022,CIR009,Acute myocardial infarction,CAR004,PERCUTANEOUS CORONARY INTERVENTIONS (PCI),174,PERCUTANEOUS CARDIAC INTERVENTION WITH AMI,05,DISEASES AND DISORDERS OF THE CIRCULATORY SYSTEM,2,Moderate,Moderate,Surgical,Federal/State/Local/VA,,,,,Y,40670.63,13206.81
Finger Lakes,Monroe,2701005,000413,Strong Memorial Hospital,70 or Older,145,M,White,Not Span/Hispanic,2,Emergency,Home or Self Care,2022,CIR009,Acute myocardial infarction,CAR004,PERCUTANEOUS CORONARY INTERVENTIONS (PCI),174,PERCUTANEOUS CARDIAC INTERVENTION WITH AMI,05,DISEASES AND DISORDERS OF THE CIRCULATORY SYSTEM,2,Moderate,Minor,Surgical,Medicare,Blue Cross/Blue Shield,,,,Y,54967.43,17565.51
Finger Lakes,Monroe,2701005,000413,Strong Memorial Hospital,70 or Older,146,F,Black/African American,Not Span/Hispanic,2,Emergency,Home or Self Care,2022,CIR009,Acute myocardial infarction,IMG001,CARDIAC AND CORONARY FLUOROSCOPY,174,PERCUTANEOUS CARDIAC INTERVENTION WITH AMI,05,DISEASES AND DISORDERS OF THE CIRCULATORY SYSTEM,2,Moderate,Moderate,Surgical,Medicare,,,,,Y,55946.04,21014.26
Finger Lakes,Monroe,2701005,000413,Strong Memorial Hospital,50 to 69,146,F,White,Unknown,2,Emergency,Home or Self Care,2022,CIR009,Acute myocardial infarction,CAR004,PERCUTANEOUS CORONARY INTERVENTIONS (PCI),174,PERCUTANEOUS CARDIAC INTERVENTION WITH AMI,05,DISEASES AND DISORDERS OF THE CIRCULATORY SYSTEM,2,Moderate,Moderate,Surgical,Medicare,,,,,Y,43474.35,13581.81
Finger Lakes,Monroe,2701005,000413,Strong Memorial Hospital,50 to 69,144,M,White,Not Span/Hispanic,2,Emergency,Home or Self Care,2022,CIR009,Acute myocardial infarction,CAR004,PERCUTANEOUS CORONARY INTERVENTIONS (PCI),174,PERCUTANEOUS CARDIAC INTERVENTION WITH AMI,05,DISEASES AND DISORDERS OF THE CIRCULATORY SYSTEM,1,Minor,Moderate,Surgical,Medicaid,,,,,Y,93343.94,26944.56
Finger Lakes,Monroe,2701005,000413,Strong Memorial Hospital,50 to 69,144,M,White,Not Span/Hispanic,3,Emergency,Home or Self Care,2022,CIR009,Acute myocardial infarction,CAR004,PERCUTANEOUS CORONARY INTERVENTIONS (PCI),174,PERCUTANEOUS CARDIAC INTERVENTION WITH AMI,05,DISEASES AND DISORDERS OF THE CIRCULATORY SYSTEM,1,Minor,Moderate,Surgical,Blue Cross/Blue Shield,,,,,Y,61478.08,22055.09
Finger Lakes,Monroe,2701005,000413,Strong Memorial Hospital,50 to 69,145,F,White,Not Span/Hispanic,1,Emergency,Home or Self Care,2022,CIR009,Acute myocardial infarction,IMG001,CARDIAC AND CORONARY FLUOROSCOPY,174,PERCUTANEOUS CARDIAC INTERVENTION WITH AMI,05,DISEASES AND DISORDERS OF THE CIRCULATORY SYSTEM,1,Minor,Minor,Surgical,Medicare,,,,,Y,49943.54,14248.76
Finger Lakes,Monroe,2701005,000413,Strong Memorial Hospital,50 to 69,146,M,White,Unknown,1,Emergency,Home or Self Care,2022,CIR009,Acute myocardial infarction,CAR004,PERCUTANEOUS CORONARY INTERVENTIONS (PCI),174,PERCUTANEOUS CARDIAC INTERVENTION WITH AMI,05,DISEASES AND DISORDERS OF THE CIRCULATORY SYSTEM,1,Minor,Moderate,Surgical,Blue Cross/Blue Shield,,,,,Y,40524.98,12891.52
Finger Lakes,Monroe,2701005,000413,Strong Memorial Hospital,50 to 69,145,F,White,Spanish/Hispanic,3,Emergency,Home or Self Care,2022,CIR009,Acute myocardial infarction,CAR004,PERCUTANEOUS CORONARY INTERVENTIONS (PCI),174,PERCUTANEOUS CARDIAC INTERVENTION WITH AMI,05,DISEASES AND DISORDERS OF THE CIRCULATORY SYSTEM,2,Moderate,Minor,Surgical,Medicare,Medicaid,,,,Y,50504.25,15542.89
Finger Lakes,Monroe,2701005,000413,Strong Memorial Hospital,50 to 69,146,M,White,Not Span/Hispanic,2,Emergency,Home or Self Care,2022,CIR009,Acute myocardial infarction,CAR004,PERCUTANEOUS CORONARY INTERVENTIONS (PCI),174,PERCUTANEOUS CARDIAC INTERVENTION WITH AMI,05,DISEASES AND DISORDERS OF THE CIRCULATORY SYSTEM,1,Minor,Minor,Surgical,Blue Cross/Blue Shield,,,,,Y,54010.01,16777.42
Finger Lakes,Monroe,2701005,000413,Strong Memorial Hospital,50 to 69,148,M,White,Not Span/Hispanic,1,Urgent,Home or Self Care,2022,CIR009,Acute myocardial infarction,CAR004,PERCUTANEOUS CORONARY INTERVENTIONS (PCI),174,PERCUTANEOUS CARDIAC INTERVENTION WITH AMI,05,DISEASES AND DISORDERS OF THE CIRCULATORY SYSTEM,2,Moderate,Minor,Surgical,Blue Cross/Blue Shield,,,,,N,75809.30,21981.40
Finger Lakes,Monroe,2701005,000413,Strong Memorial Hospital,50 to 69,144,M,White,Not Span/Hispanic,3,Emergency,Home or Self Care,2022,CIR009,Acute myocardial infarction,ESA009,CARDIAC ASSISTANCE WITH BALLOON PUMP,174,PERCUTANEOUS CARDIAC INTERVENTION WITH AMI,05,DISEASES AND DISORDERS OF THE CIRCULATORY SYSTEM,4,Extreme,Extreme,Surgical,Medicaid,,,,,Y,64604.17,22610.22
Finger Lakes,Monroe,2701005,000413,Strong Memorial Hospital,50 to 69,144,M,White,Not Span/Hispanic,8,Emergency,Expired,2022,CIR009,Acute myocardial infarction,IMG001,CARDIAC AND CORONARY FLUOROSCOPY,174,PERCUTANEOUS CARDIAC INTERVENTION WITH AMI,05,DISEASES AND DISORDERS OF THE CIRCULATORY SYSTEM,4,Extreme,Extreme,Surgical,Federal/State/Local/VA,,,,,Y,176818.39,60074.76
Finger Lakes,Monroe,2701005,000413,Strong Memorial Hospital,50 to 69,146,M,White,Not Span/Hispanic,1,Emergency,Home or Self Care,2022,CIR009,Acute myocardial infarction,CAR004,PERCUTANEOUS CORONARY INTERVENTIONS (PCI),174,PERCUTANEOUS CARDIAC INTERVENTION WITH AMI,05,DISEASES AND DISORDERS OF THE CIRCULATORY SYSTEM,1,Minor,Minor,Surgical,Medicare,,,,,Y,74831.53,20720.11
Finger Lakes,Monroe,2701005,000413,Strong Memorial Hospital,50 to 69,146,F,Black/African American,Not Span/Hispanic,2,Emergency,Home or Self Care,2022,CIR009,Acute myocardial infarction,CAR004,PERCUTANEOUS CORONARY INTERVENTIONS (PCI),174,PERCUTANEOUS CARDIAC INTERVENTION WITH AMI,05,DISEASES AND DISORDERS OF THE CIRCULATORY SYSTEM,1,Minor,Minor,Surgical,Medicaid,,,,,Y,50213.24,14901.25
Finger Lakes,Monroe,2701005,000413,Strong Memorial Hospital,50 to 69,146,M,White,Not Span/Hispanic,2,Emergency,Home or Self Care,2022,CIR009,Acute myocardial infarction,CAR004,PERCUTANEOUS CORONARY INTERVENTIONS (PCI),174,PERCUTANEOUS CARDIAC INTERVENTION WITH AMI,05,DISEASES AND DISORDERS OF THE CIRCULATORY SYSTEM,1,Minor,Moderate,Surgical,Blue Cross/Blue Shield,,,,,Y,80536.73,23814.70
Finger Lakes,Monroe,2701005,000413,Strong Memorial Hospital,50 to 69,OOS,M,White,Spanish/Hispanic,3,Urgent,Home or Self Care,2022,CIR009,Acute myocardial infarction,CAR004,PERCUTANEOUS CORONARY INTERVENTIONS (PCI),174,PERCUTANEOUS CARDIAC INTERVENTION WITH AMI,05,DISEASES AND DISORDERS OF THE CIRCULATORY SYSTEM,1,Minor,Minor,Surgical,Self-Pay,,,,,N,94101.31,29054.69
Finger Lakes,Monroe,2701005,000413,Strong Memorial Hospital,70 or Older,145,M,White,Unknown,2,Emergency,Home or Self Care,2022,CIR009,Acute myocardial infarction,CAR004,PERCUTANEOUS CORONARY INTERVENTIONS (PCI),174,PERCUTANEOUS CARDIAC INTERVENTION WITH AMI,05,DISEASES AND DISORDERS OF THE CIRCULATORY SYSTEM,1,Minor,Minor,Surgical,Medicare,,,,,Y,38398.95,12025.09
Finger Lakes,Monroe,2701005,000413,Strong Memorial Hospital,30 to 49,145,M,White,Not Span/Hispanic,1,Urgent,Home or Self Care,2022,CIR009,Acute myocardial infarction,CAR004,PERCUTANEOUS CORONARY INTERVENTIONS (PCI),174,PERCUTANEOUS CARDIAC INTERVENTION WITH AMI,05,DISEASES AND DISORDERS OF THE CIRCULATORY SYSTEM,1,Minor,Minor,Surgical,Private Health Insurance,,,,,N,43116.72,12139.26
Finger Lakes,Monroe,2701005,000413,Strong Memorial Hospital,50 to 69,146,F,Other Race,Not Span/Hispanic,3,Emergency,Home or Self Care,2022,CIR009,Acute myocardial infarction,CAR004,PERCUTANEOUS CORONARY INTERVENTIONS (PCI),174,PERCUTANEOUS CARDIAC INTERVENTION WITH AMI,05,DISEASES AND DISORDERS OF THE CIRCULATORY SYSTEM,1,Minor,Minor,Surgical,Medicare,,,,,Y,51666.97,15972.47
Finger Lakes,Monroe,2701005,000413,Strong Memorial Hospital,50 to 69,145,M,White,Not Span/Hispanic,2,Emergency,Home or Self Care,2022,CIR009,Acute myocardial infarction,CAR004,PERCUTANEOUS CORONARY INTERVENTIONS (PCI),174,PERCUTANEOUS CARDIAC INTERVENTION WITH AMI,05,DISEASES AND DISORDERS OF THE CIRCULATORY SYSTEM,1,Minor,Minor,Surgical,Blue Cross/Blue Shield,,,,,Y,74714.06,21378.99
Finger Lakes,Monroe,2701005,000413,Strong Memorial Hospital,70 or Older,144,M,White,Spanish/Hispanic,2,Emergency,Home or Self Care,2022,CIR009,Acute myocardial infarction,CAR004,PERCUTANEOUS CORONARY INTERVENTIONS (PCI),174,PERCUTANEOUS CARDIAC INTERVENTION WITH AMI,05,DISEASES AND DISORDERS OF THE CIRCULATORY SYSTEM,2,Moderate,Moderate,Surgical,Medicare,,,,,Y,67501.15,22460.11
Finger Lakes,Monroe,2701005,000413,Strong Memorial Hospital,70 or Older,148,F,White,Not Span/Hispanic,2,Urgent,Home or Self Care,2022,CIR009,Acute myocardial infarction,CAR004,PERCUTANEOUS CORONARY INTERVENTIONS (PCI),174,PERCUTANEOUS CARDIAC INTERVENTION WITH AMI,05,DISEASES AND DISORDERS OF THE CIRCULATORY SYSTEM,2,Moderate,Moderate,Surgical,Medicare,,,,,N,46936.42,14220.52
Finger Lakes,Monroe,2701005,000413,Strong Memorial Hospital,70 or Older,145,M,White,Not Span/Hispanic,2,Emergency,Home or Self Care,2022,CIR009,Acute myocardial infarction,CAR004,PERCUTANEOUS CORONARY INTERVENTIONS (PCI),174,PERCUTANEOUS CARDIAC INTERVENTION WITH AMI,05,DISEASES AND DISORDERS OF THE CIRCULATORY SYSTEM,3,Major,Major,Surgical,Medicare,,,,,Y,40568.80,13114.87
New York City,Manhattan,7002001,001438,Bellevue Hospital Center,50 to 69,112,M,Black/African American,Unknown,5,Urgent,Home or Self Care,2022,CIR009,Acute myocardial infarction,CAR004,PERCUTANEOUS CORONARY INTERVENTIONS (PCI),174,PERCUTANEOUS CARDIAC INTERVENTION WITH AMI,05,DISEASES AND DISORDERS OF THE CIRCULATORY SYSTEM,3,Major,Major,Surgical,Private Health Insurance,,,,,N,74289.81,42722.88
New York City,Manhattan,7002053,001463,NYU Langone Hospitals,50 to 69,113,M,White,Not Span/Hispanic,2,Emergency,Home or Self Care,2022,CIR009,Acute myocardial infarction,CAR004,PERCUTANEOUS CORONARY INTERVENTIONS (PCI),174,PERCUTANEOUS CARDIAC INTERVENTION WITH AMI,05,DISEASES AND DISORDERS OF THE CIRCULATORY SYSTEM,1,Minor,Minor,Surgical,Blue Cross/Blue Shield,,,,,Y,222205.39,36663.14
New York City,Manhattan,7002053,001463,NYU Langone Hospitals,70 or Older,112,M,White,Not Span/Hispanic,3,Emergency,Home w/ Home Health Services,2022,CIR009,Acute myocardial infarction,CAR004,PERCUTANEOUS CORONARY INTERVENTIONS (PCI),174,PERCUTANEOUS CARDIAC INTERVENTION WITH AMI,05,DISEASES AND DISORDERS OF THE CIRCULATORY SYSTEM,2,Moderate,Minor,Surgical,Medicare,Medicaid,,,,Y,220072.63,39986.73
New York City,Manhattan,7002053,001463,NYU Langone Hospitals,70 or Older,100,F,White,Not Span/Hispanic,3,Emergency,Home w/ Home Health Services,2022,CIR009,Acute myocardial infarction,CAR004,PERCUTANEOUS CORONARY INTERVENTIONS (PCI),174,PERCUTANEOUS CARDIAC INTERVENTION WITH AMI,05,DISEASES AND DISORDERS OF THE CIRCULATORY SYSTEM,3,Major,Major,Surgical,Medicare,Blue Cross/Blue Shield,,,,Y,151241.98,34623.70
New York City,Manhattan,7002053,001463,NYU Langone Hospitals,70 or Older,100,M,White,Not Span/Hispanic,2,Emergency,Home or Self Care,2022,CIR009,Acute myocardial infarction,CAR004,PERCUTANEOUS CORONARY INTERVENTIONS (PCI),174,PERCUTANEOUS CARDIAC INTERVENTION WITH AMI,05,DISEASES AND DISORDERS OF THE CIRCULATORY SYSTEM,2,Moderate,Moderate,Surgical,Medicare,Medicare,,,,Y,265150.55,44614.83
New York City,Manhattan,7002053,001463,NYU Langone Hospitals,70 or Older,100,M,White,Not Span/Hispanic,1,Emergency,Home or Self Care,2022,CIR009,Acute myocardial infarction,CAR004,PERCUTANEOUS CORONARY INTERVENTIONS (PCI),174,PERCUTANEOUS CARDIAC INTERVENTION WITH AMI,05,DISEASES AND DISORDERS OF THE CIRCULATORY SYSTEM,3,Major,Major,Surgical,Medicare,Blue Cross/Blue Shield,,,,Y,186391.13,28640.74
New York City,Manhattan,7002001,001438,Bellevue Hospital Center,50 to 69,104,F,Other Race,Unknown,7,Urgent,Home or Self Care,2022,CIR009,Acute myocardial infarction,CAR004,PERCUTANEOUS CORONARY INTERVENTIONS (PCI),174,PERCUTANEOUS CARDIAC INTERVENTION WITH AMI,05,DISEASES AND DISORDERS OF THE CIRCULATORY SYSTEM,3,Major,Major,Surgical,Medicare,Medicaid,,,,N,76585.36,44043.02
New York City,Manhattan,7002001,001438,Bellevue Hospital Center,50 to 69,100,M,Other Race,Spanish/Hispanic,9,Emergency,Home or Self Care,2022,CIR009,Acute myocardial infarction,CAR004,PERCUTANEOUS CORONARY INTERVENTIONS (PCI),174,PERCUTANEOUS CARDIAC INTERVENTION WITH AMI,05,DISEASES AND DISORDERS OF THE CIRCULATORY SYSTEM,2,Moderate,Moderate,Surgical,Medicare,,,,,Y,91804.33,52795.20
New York City,Manhattan,7002001,001438,Bellevue Hospital Center,50 to 69,100,M,Black/African American,Spanish/Hispanic,3,Emergency,Home or Self Care,2022,CIR009,Acute myocardial infarction,CAR004,PERCUTANEOUS CORONARY INTERVENTIONS (PCI),174,PERCUTANEOUS CARDIAC INTERVENTION WITH AMI,05,DISEASES AND DISORDERS OF THE CIRCULATORY SYSTEM,1,Minor,Minor,Surgical,Medicaid,,,,,Y,52638.99,30271.84
New York City,Manhattan,7002001,001438,Bellevue Hospital Center,50 to 69,113,M,White,Unknown,4,Urgent,Home or Self Care,2022,CIR009,Acute myocardial infarction,MAM005,MEASUREMENT DURING CARDIAC CATHETERIZATION,174,PERCUTANEOUS CARDIAC INTERVENTION WITH AMI,05,DISEASES AND DISORDERS OF THE CIRCULATORY SYSTEM,4,Extreme,Extreme,Surgical,Medicaid,,,,,N,59850.13,34418.85
New York City,Manhattan,7002001,001438,Bellevue Hospital Center,70 or Older,112,M,Other Race,Spanish/Hispanic,4,Urgent,Home or Self Care,2022,CIR009,Acute myocardial infarction,CAR004,PERCUTANEOUS CORONARY INTERVENTIONS (PCI),174,PERCUTANEOUS CARDIAC INTERVENTION WITH AMI,05,DISEASES AND DISORDERS OF THE CIRCULATORY SYSTEM,2,Moderate,Minor,Surgical,Medicare,,,,,N,58891.91,33867.80
New York City,Manhattan,7002001,001438,Bellevue Hospital Center,50 to 69,104,M,Other Race,Spanish/Hispanic,3,Emergency,Home or Self Care,2022,CIR009,Acute myocardial infarction,CAR004,PERCUTANEOUS CORONARY INTERVENTIONS (PCI),174,PERCUTANEOUS CARDIAC INTERVENTION WITH AMI,05,DISEASES AND DISORDERS OF THE CIRCULATORY SYSTEM,2,Moderate,Moderate,Surgical,Private Health Insurance,,,,,Y,40608.99,23353.58