Hospital Service Area,Hospital County,Operating Certificate Number,Permanent Facility Id,Facility Name,Age Group,Zip Code - 3 digits,Gender,Race,Ethnicity,Length of Stay,Type of Admission,Patient Disposition,Discharge Year,CCS Diagnosis Code,CCS Diagnosis Description,CCS Procedure Code,CCS Procedure Description,APR DRG Code,APR DRG Description,APR MDC Code,APR MDC Description,APR Severity of Illness Code,APR Severity of Illness Description,APR Risk of Mortality,APR Medical Surgical Description,Payment Typology 1,Payment Typology 2,Payment Typology 3,Birth Weight,Abortion Edit Indicator,Emergency Department Indicator,Total Charges,Total Costs
New York City,Manhattan,7002054,001464,New York-Presbyterian Hospital - Columbia Presbyterian Center,30 to 49,100,M,Black/African American,Not Span/Hispanic,14,Emergency,Home or Self Care,2022,INJ033,"Complication of cardiovascular device, implant or graft, initial encounter",CAR027,HEART ASSIST DEVICE PROCEDURES,176,"INSERTION, REVISION AND REPLACEMENTS OF PACEMAKER AND OTHER CARDIAC DEVICES",05,DISEASES AND DISORDERS OF THE CIRCULATORY SYSTEM,3,Major,Major,Surgical,Medicare,,,,,Y,430104.62,164471.82
New York City,Manhattan,7002054,001464,New York-Presbyterian Hospital - Columbia Presbyterian Center,70 or Older,100,F,Other Race,Spanish/Hispanic,1,Elective,Home or Self Care,2022,CIR016,Conduction disorders,CAR026,PACEMAKER AND DEFIBRILLATOR PROCEDURES,176,"INSERTION, REVISION AND REPLACEMENTS OF PACEMAKER AND OTHER CARDIAC DEVICES",05,DISEASES AND DISORDERS OF THE CIRCULATORY SYSTEM,2,Moderate,Moderate,Surgical,Medicare,Medicaid,,,,N,127904.87,46826.37
New York City,Manhattan,7002054,001464,New York-Presbyterian Hospital - Columbia Presbyterian Center,50 to 69,112,F,Other Race,Spanish/Hispanic,1,Elective,Home or Self Care,2022,FAC009,"Implant, device or graft related encounter",CAR026,PACEMAKER AND DEFIBRILLATOR PROCEDURES,176,"INSERTION, REVISION AND REPLACEMENTS OF PACEMAKER AND OTHER CARDIAC DEVICES",05,DISEASES AND DISORDERS OF THE CIRCULATORY SYSTEM,3,Major,Moderate,Surgical,Medicaid,,,,,N,182393.53,67637.79
New York City,Manhattan,7002054,001464,New York-Presbyterian Hospital - Columbia Presbyterian Center,18 to 29,104,F,White,Spanish/Hispanic,4,Emergency,Home or Self Care,2022,CIR016,Conduction disorders,CAR026,PACEMAKER AND DEFIBRILLATOR PROCEDURES,176,"INSERTION, REVISION AND REPLACEMENTS OF PACEMAKER AND OTHER CARDIAC DEVICES",05,DISEASES AND DISORDERS OF THE CIRCULATORY SYSTEM,2,Moderate,Major,Surgical,Medicaid,,,,,Y,97460.45,34203.59
Finger Lakes,Monroe,2701005,000413,Strong Memorial Hospital,70 or Older,145,M,White,Not Span/Hispanic,5,Emergency,Home or Self Care,2022,INJ033,"Complication of cardiovascular device, implant or graft, initial encounter",CAR017,PERICARDIAL PROCEDURES,176,"INSERTION, REVISION AND REPLACEMENTS OF PACEMAKER AND OTHER CARDIAC DEVICES",05,DISEASES AND DISORDERS OF THE CIRCULATORY SYSTEM,3,Major,Major,Surgical,Medicare,,,,,Y,37256.34,13895.20
New York City,Manhattan,7002001,001438,Bellevue Hospital Center,70 or Older,112,M,Black/African American,Not Span/Hispanic,1,Elective,Home or Self Care,2022,CIR016,Conduction disorders,CAR026,PACEMAKER AND DEFIBRILLATOR PROCEDURES,176,"INSERTION, REVISION AND REPLACEMENTS OF PACEMAKER AND OTHER CARDIAC DEVICES",05,DISEASES AND DISORDERS OF THE CIRCULATORY SYSTEM,2,Moderate,Moderate,Surgical,Medicaid,,,,,N,72571.94,41734.96
New York City,Manhattan,7002054,001464,New York-Presbyterian Hospital - Columbia Presbyterian Center,50 to 69,100,M,Black/African American,Not Span/Hispanic,30,Emergency,Skilled Nursing Home,2022,CIR016,Conduction disorders,CAR026,PACEMAKER AND DEFIBRILLATOR PROCEDURES,176,"INSERTION, REVISION AND REPLACEMENTS OF PACEMAKER AND OTHER CARDIAC DEVICES",05,DISEASES AND DISORDERS OF THE CIRCULATORY SYSTEM,4,Extreme,Extreme,Surgical,Medicaid,,,,,Y,651987.08,218206.83
New York City,Manhattan,7002054,001464,New York-Presbyterian Hospital - Columbia Presbyterian Center,0 to 17,OOS,M,Other Race,Spanish/Hispanic,1,Elective,Home or Self Care,2022,CIR016,Conduction disorders,CAR026,PACEMAKER AND DEFIBRILLATOR PROCEDURES,176,"INSERTION, REVISION AND REPLACEMENTS OF PACEMAKER AND OTHER CARDIAC DEVICES",05,DISEASES AND DISORDERS OF THE CIRCULATORY SYSTEM,3,Major,Moderate,Surgical,Blue Cross/Blue Shield,,,,,N,138743.96,55420.83
Finger Lakes,Monroe,2701005,000413,Strong Memorial Hospital,30 to 49,147,M,White,Not Span/Hispanic,4,Urgent,Home or Self Care,2022,CIR019,Heart failure,CAR026,PACEMAKER AND DEFIBRILLATOR PROCEDURES,176,"INSERTION, REVISION AND REPLACEMENTS OF PACEMAKER AND OTHER CARDIAC DEVICES",05,DISEASES AND DISORDERS OF THE CIRCULATORY SYSTEM,3,Major,Major,Surgical,Medicaid,,,,,N,101773.99,41335.80
Finger Lakes,Monroe,2701005,000413,Strong Memorial Hospital,18 to 29,132,F,White,Not Span/Hispanic,6,Urgent,Home or Self Care,2022,FAC009,"Implant, device or graft related encounter",CAR026,PACEMAKER AND DEFIBRILLATOR PROCEDURES,176,"INSERTION, REVISION AND REPLACEMENTS OF PACEMAKER AND OTHER CARDIAC DEVICES",05,DISEASES AND DISORDERS OF THE CIRCULATORY SYSTEM,3,Major,Major,Surgical,Medicaid,,,,,N,80458.22,32635.84
Long Island,Nassau,2951001,000541,North Shore University Hospital,50 to 69,110,M,White,Not Span/Hispanic,1,Emergency,Home or Self Care,2022,INJ033,"Complication of cardiovascular device, implant or graft, initial encounter",CAR026,PACEMAKER AND DEFIBRILLATOR PROCEDURES,176,"INSERTION, REVISION AND REPLACEMENTS OF PACEMAKER AND OTHER CARDIAC DEVICES",05,DISEASES AND DISORDERS OF THE CIRCULATORY SYSTEM,3,Major,Minor,Surgical,Medicare,Medicare,Medicaid,,,Y,215688.75,49545.28
Long Island,Nassau,2951001,000541,North Shore University Hospital,70 or Older,113,M,White,Not Span/Hispanic,1,Elective,Home or Self Care,2022,CIR016,Conduction disorders,CAR026,PACEMAKER AND DEFIBRILLATOR PROCEDURES,176,"INSERTION, REVISION AND REPLACEMENTS OF PACEMAKER AND OTHER CARDIAC DEVICES",05,DISEASES AND DISORDERS OF THE CIRCULATORY SYSTEM,3,Major,Major,Surgical,Medicare,Medicaid,,,,N,153718.54,32949.55
Long Island,Nassau,2951001,000541,North Shore University Hospital,70 or Older,117,M,White,Not Span/Hispanic,7,Elective,Home w/ Home Health Services,2022,CIR017,Cardiac dysrhythmias,CAR026,PACEMAKER AND DEFIBRILLATOR PROCEDURES,176,"INSERTION, REVISION AND REPLACEMENTS OF PACEMAKER AND OTHER CARDIAC DEVICES",05,DISEASES AND DISORDERS OF THE CIRCULATORY SYSTEM,4,Extreme,Extreme,Surgical,Medicare,Blue Cross/Blue Shield,,,,N,179854.72,36821.35
Long Island,Nassau,2951001,000541,North Shore University Hospital,70 or Older,113,M,White,Spanish/Hispanic,2,Emergency,Home or Self Care,2022,CIR016,Conduction disorders,CAR026,PACEMAKER AND DEFIBRILLATOR PROCEDURES,176,"INSERTION, REVISION AND REPLACEMENTS OF PACEMAKER AND OTHER CARDIAC DEVICES",05,DISEASES AND DISORDERS OF THE CIRCULATORY SYSTEM,1,Minor,Minor,Surgical,Medicare,Blue Cross/Blue Shield,,,,Y,81563.20,13396.87
Long Island,Nassau,2951001,000541,North Shore University Hospital,70 or Older,115,M,White,Not Span/Hispanic,1,Elective,Home or Self Care,2022,FAC009,"Implant, device or graft related encounter",CAR026,PACEMAKER AND DEFIBRILLATOR PROCEDURES,176,"INSERTION, REVISION AND REPLACEMENTS OF PACEMAKER AND OTHER CARDIAC DEVICES",05,DISEASES AND DISORDERS OF THE CIRCULATORY SYSTEM,3,Major,Moderate,Surgical,Medicare,Private Health Insurance,,,,N,186008.57,41216.78
New York City,Manhattan,7002054,001464,New York-Presbyterian Hospital - Columbia Presbyterian Center,50 to 69,112,M,White,Not Span/Hispanic,1,Elective,Home or Self Care,2022,CIR016,Conduction disorders,CAR026,PACEMAKER AND DEFIBRILLATOR PROCEDURES,176,"INSERTION, REVISION AND REPLACEMENTS OF PACEMAKER AND OTHER CARDIAC DEVICES",05,DISEASES AND DISORDERS OF THE CIRCULATORY SYSTEM,2,Moderate,Moderate,Surgical,Medicare,Private Health Insurance,,,,N,147178.12,54050.73
Finger Lakes,Monroe,2701005,000413,Strong Memorial Hospital,70 or Older,131,F,White,Not Span/Hispanic,3,Emergency,Expired,2022,INJ033,"Complication of cardiovascular device, implant or graft, initial encounter",CAR026,PACEMAKER AND DEFIBRILLATOR PROCEDURES,176,"INSERTION, REVISION AND REPLACEMENTS OF PACEMAKER AND OTHER CARDIAC DEVICES",05,DISEASES AND DISORDERS OF THE CIRCULATORY SYSTEM,4,Extreme,Extreme,Surgical,Medicare,,,,,Y,69754.91,24075.66
Long Island,Nassau,2951001,000541,North Shore University Hospital,70 or Older,113,M,Other Race,Spanish/Hispanic,2,Emergency,Home or Self Care,2022,INJ033,"Complication of cardiovascular device, implant or graft, initial encounter",CAR026,PACEMAKER AND DEFIBRILLATOR PROCEDURES,176,"INSERTION, REVISION AND REPLACEMENTS OF PACEMAKER AND OTHER CARDIAC DEVICES",05,DISEASES AND DISORDERS OF THE CIRCULATORY SYSTEM,2,Moderate,Moderate,Surgical,Medicare,Medicare,,,,Y,91627.46,18253.01
Long Island,Nassau,2951001,000541,North Shore University Hospital,70 or Older,117,M,White,Not Span/Hispanic,1,Emergency,Home or Self Care,2022,CIR016,Conduction disorders,CAR026,PACEMAKER AND DEFIBRILLATOR PROCEDURES,176,"INSERTION, REVISION AND REPLACEMENTS OF PACEMAKER AND OTHER CARDIAC DEVICES",05,DISEASES AND DISORDERS OF THE CIRCULATORY SYSTEM,2,Moderate,Moderate,Surgical,Medicare,Medicare,,,,Y,140634.91,29009.81
Long Island,Nassau,2951001,000541,North Shore University Hospital,70 or Older,117,M,White,Not Span/Hispanic,1,Elective,Home or Self Care,2022,CIR016,Conduction disorders,CAR026,PACEMAKER AND DEFIBRILLATOR PROCEDURES,176,"INSERTION, REVISION AND REPLACEMENTS OF PACEMAKER AND OTHER CARDIAC DEVICES",05,DISEASES AND DISORDERS OF THE CIRCULATORY SYSTEM,2,Moderate,Minor,Surgical,Medicare,Medicare,,,,N,105507.37,21725.71
Long Island,Nassau,2951001,000541,North Shore University Hospital,70 or Older,117,M,White,Not Span/Hispanic,1,Elective,Home or Self Care,2022,CIR031,Hypotension,CAR026,PACEMAKER AND DEFIBRILLATOR PROCEDURES,176,"INSERTION, REVISION AND REPLACEMENTS OF PACEMAKER AND OTHER CARDIAC DEVICES",05,DISEASES AND DISORDERS OF THE CIRCULATORY SYSTEM,2,Moderate,Moderate,Surgical,Medicare,Private Health Insurance,,,,N,89822.34,16887.51
Long Island,Nassau,2951001,000541,North Shore University Hospital,70 or Older,117,M,Black/African American,Not Span/Hispanic,6,Emergency,Skilled Nursing Home,2022,FAC009,"Implant, device or graft related encounter",CAR026,PACEMAKER AND DEFIBRILLATOR PROCEDURES,176,"INSERTION, REVISION AND REPLACEMENTS OF PACEMAKER AND OTHER CARDIAC DEVICES",05,DISEASES AND DISORDERS OF THE CIRCULATORY SYSTEM,3,Major,Moderate,Surgical,Medicare,Blue Cross/Blue Shield,,,,Y,199631.67,39690.85
Long Island,Nassau,2951001,000541,North Shore University Hospital,70 or Older,114,M,Black/African American,Not Span/Hispanic,11,Emergency,Home or Self Care,2022,CIR019,Heart failure,CAR026,PACEMAKER AND DEFIBRILLATOR PROCEDURES,176,"INSERTION, REVISION AND REPLACEMENTS OF PACEMAKER AND OTHER CARDIAC DEVICES",05,DISEASES AND DISORDERS OF THE CIRCULATORY SYSTEM,3,Major,Major,Surgical,Medicare,Medicare,,,,Y,228388.29,43235.27
Long Island,Nassau,2951001,000541,North Shore University Hospital,50 to 69,115,M,Other Race,Not Span/Hispanic,1,Elective,Home or Self Care,2022,FAC009,"Implant, device or graft related encounter",CAR026,PACEMAKER AND DEFIBRILLATOR PROCEDURES,176,"INSERTION, REVISION AND REPLACEMENTS OF PACEMAKER AND OTHER CARDIAC DEVICES",05,DISEASES AND DISORDERS OF THE CIRCULATORY SYSTEM,3,Major,Moderate,Surgical,Private Health Insurance,Medicare,,,,N,105972.63,24825.45
Long Island,Nassau,2951001,000541,North Shore University Hospital,50 to 69,114,F,Black/African American,Not Span/Hispanic,1,Urgent,Home or Self Care,2022,SYM012,Circulatory signs and symptoms,CAR026,PACEMAKER AND DEFIBRILLATOR PROCEDURES,176,"INSERTION, REVISION AND REPLACEMENTS OF PACEMAKER AND OTHER CARDIAC DEVICES",05,DISEASES AND DISORDERS OF THE CIRCULATORY SYSTEM,2,Moderate,Moderate,Surgical,Medicare,Medicaid,,,,N,58168.72,11175.77
Long Island,Nassau,2951001,000541,North Shore University Hospital,70 or Older,113,M,White,Not Span/Hispanic,11,Emergency,Home w/ Home Health Services,2022,CIR017,Cardiac dysrhythmias,CAR026,PACEMAKER AND DEFIBRILLATOR PROCEDURES,176,"INSERTION, REVISION AND REPLACEMENTS OF PACEMAKER AND OTHER CARDIAC DEVICES",05,DISEASES AND DISORDERS OF THE CIRCULATORY SYSTEM,2,Moderate,Moderate,Surgical,Medicare,Medicare,,,,Y,233540.20,44600.35
New York City,Manhattan,7002001,001438,Bellevue Hospital Center,30 to 49,104,M,White,Not Span/Hispanic,2,Emergency,Home or Self Care,2022,CIR016,Conduction disorders,CAR026,PACEMAKER AND DEFIBRILLATOR PROCEDURES,176,"INSERTION, REVISION AND REPLACEMENTS OF PACEMAKER AND OTHER CARDIAC DEVICES",05,DISEASES AND DISORDERS OF THE CIRCULATORY SYSTEM,2,Moderate,Minor,Surgical,Medicaid,,,,,Y,33890.95,19490.14
New York City,Manhattan,7002001,001438,Bellevue Hospital Center,50 to 69,113,M,Black/African American,Unknown,5,Emergency,Home or Self Care,2022,CIR019,Heart failure,CAR026,PACEMAKER AND DEFIBRILLATOR PROCEDURES,176,"INSERTION, REVISION AND REPLACEMENTS OF PACEMAKER AND OTHER CARDIAC DEVICES",05,DISEASES AND DISORDERS OF THE CIRCULATORY SYSTEM,3,Major,Moderate,Surgical,Private Health Insurance,,,,,Y,89501.04,51470.62
New York City,Manhattan,7002001,001438,Bellevue Hospital Center,70 or Older,112,M,Other Race,Not Span/Hispanic,36,Urgent,Skilled Nursing Home,2022,CIR019,Heart failure,CAR026,PACEMAKER AND DEFIBRILLATOR PROCEDURES,176,"INSERTION, REVISION AND REPLACEMENTS OF PACEMAKER AND OTHER CARDIAC DEVICES",05,DISEASES AND DISORDERS OF THE CIRCULATORY SYSTEM,4,Extreme,Extreme,Surgical,Medicare,Medicare,Medicaid,,,N,389658.88,224086.59
New York City,Manhattan,7002001,001438,Bellevue Hospital Center,70 or Older,114,F,Black/African American,Not Span/Hispanic,6,Urgent,Home or Self Care,2022,CIR018,Cardiac arrest and ventricular fibrillation,CAR026,PACEMAKER AND DEFIBRILLATOR PROCEDURES,176,"INSERTION, REVISION AND REPLACEMENTS OF PACEMAKER AND OTHER CARDIAC DEVICES",05,DISEASES AND DISORDERS OF THE CIRCULATORY SYSTEM,3,Major,Extreme,Surgical,Medicare,,,,,N,77407.73,44515.95
Finger Lakes,Monroe,2701005,000413,Strong Memorial Hospital,70 or Older,148,F,White,Not Span/Hispanic,2,Emergency,Home or Self Care,2022,INJ033,"Complication of cardiovascular device, implant or graft, initial encounter",CAR026,PACEMAKER AND DEFIBRILLATOR PROCEDURES,176,"INSERTION, REVISION AND REPLACEMENTS OF PACEMAKER AND OTHER CARDIAC DEVICES",05,DISEASES AND DISORDERS OF THE CIRCULATORY SYSTEM,2,Moderate,Moderate,Surgical,Medicare,Blue Cross/Blue Shield,,,,Y,27741.05,9612.93
Finger Lakes,Monroe,2701005,000413,Strong Memorial Hospital,30 to 49,135,M,Other Race,Unknown,5,Urgent,Home or Self Care,2022,INJ033,"Complication of cardiovascular device, implant or graft, initial encounter",CAR027,HEART ASSIST DEVICE PROCEDURES,176,"INSERTION, REVISION AND REPLACEMENTS OF PACEMAKER AND OTHER CARDIAC DEVICES",05,DISEASES AND DISORDERS OF THE CIRCULATORY SYSTEM,3,Major,Moderate,Surgical,Medicaid,,,,,N,51199.56,24877.58
Long Island,Nassau,2951001,000541,North Shore University Hospital,70 or Older,110,M,Black/African American,Not Span/Hispanic,7,Emergency,Home w/ Home Health Services,2022,CIR019,Heart failure,CAR026,PACEMAKER AND DEFIBRILLATOR PROCEDURES,176,"INSERTION, REVISION AND REPLACEMENTS OF PACEMAKER AND OTHER CARDIAC DEVICES",05,DISEASES AND DISORDERS OF THE CIRCULATORY SYSTEM,3,Major,Major,Surgical,Medicare,Private Health Insurance,,,,Y,265975.95,55209.89
Hudson Valley,Dutchess,1302001,000181,Vassar Brothers Medical Center,70 or Older,125,F,White,Not Span/Hispanic,3,Emergency,Home or Self Care,2022,CIR017,Cardiac dysrhythmias,CAR026,PACEMAKER AND DEFIBRILLATOR PROCEDURES,176,"INSERTION, REVISION AND REPLACEMENTS OF PACEMAKER AND OTHER CARDIAC DEVICES",05,DISEASES AND DISORDERS OF THE CIRCULATORY SYSTEM,3,Major,Major,Surgical,Medicare,Federal/State/Local/VA,,,,Y,70213.90,27666.31
New York City,Manhattan,7002053,001463,NYU Langone Hospitals,30 to 49,117,M,White,Not Span/Hispanic,5,Urgent,Home or Self Care,2022,MAL001,Cardiac and circulatory congenital anomalies,CAR026,PACEMAKER AND DEFIBRILLATOR PROCEDURES,176,"INSERTION, REVISION AND REPLACEMENTS OF PACEMAKER AND OTHER CARDIAC DEVICES",05,DISEASES AND DISORDERS OF THE CIRCULATORY SYSTEM,3,Major,Minor,Surgical,Private Health Insurance,,,,,N,496321.44,83161.37
New York City,Manhattan,7002053,001463,NYU Langone Hospitals,50 to 69,112,F,White,Not Span/Hispanic,2,Elective,Home or Self Care,2022,CIR016,Conduction disorders,CAR026,PACEMAKER AND DEFIBRILLATOR PROCEDURES,176,"INSERTION, REVISION AND REPLACEMENTS OF PACEMAKER AND OTHER CARDIAC DEVICES",05,DISEASES AND DISORDERS OF THE CIRCULATORY SYSTEM,3,Major,Moderate,Surgical,Medicare,Medicaid,,,,N,154820.41,27268.36
New York City,Manhattan,7002053,001463,NYU Langone Hospitals,70 or Older,100,M,White,Not Span/Hispanic,4,Emergency,Home or Self Care,2022,CIR016,Conduction disorders,CAR026,PACEMAKER AND DEFIBRILLATOR PROCEDURES,176,"INSERTION, REVISION AND REPLACEMENTS OF PACEMAKER AND OTHER CARDIAC DEVICES",05,DISEASES AND DISORDERS OF THE CIRCULATORY SYSTEM,3,Major,Moderate,Surgical,Medicare,,,,,Y,366901.24,71375.23
New York City,Manhattan,7002053,001463,NYU Langone Hospitals,70 or Older,111,M,White,Not Span/Hispanic,7,Emergency,Home or Self Care,2022,CIR017,Cardiac dysrhythmias,CAR026,PACEMAKER AND DEFIBRILLATOR PROCEDURES,176,"INSERTION, REVISION AND REPLACEMENTS OF PACEMAKER AND OTHER CARDIAC DEVICES",05,DISEASES AND DISORDERS OF THE CIRCULATORY SYSTEM,3,Major,Extreme,Surgical,Medicare,Medicaid,,,,Y,412036.64,86007.07
Finger Lakes,Monroe,2701005,000413,Strong Memorial Hospital,70 or Older,146,M,White,Not Span/Hispanic,10,Emergency,Skilled Nursing Home,2022,CIR017,Cardiac dysrhythmias,CAR026,PACEMAKER AND DEFIBRILLATOR PROCEDURES,176,"INSERTION, REVISION AND REPLACEMENTS OF PACEMAKER AND OTHER CARDIAC DEVICES",05,DISEASES AND DISORDERS OF THE CIRCULATORY SYSTEM,2,Moderate,Major,Surgical,Medicare,Medicaid,,,,Y,68224.37,29390.39
New York City,Manhattan,7002053,001463,NYU Langone Hospitals,70 or Older,100,F,Multi-racial,Not Span/Hispanic,20,Emergency,Skilled Nursing Home,2022,GEN003,Chronic kidney disease,MAM005,MEASUREMENT DURING CARDIAC CATHETERIZATION,176,"INSERTION, REVISION AND REPLACEMENTS OF PACEMAKER AND OTHER CARDIAC DEVICES",05,DISEASES AND DISORDERS OF THE CIRCULATORY SYSTEM,3,Major,Extreme,Surgical,Medicare,Blue Cross/Blue Shield,,,,Y,584637.03,138640.17
New York City,Manhattan,7002001,001438,Bellevue Hospital Center,70 or Older,112,M,Other Race,Spanish/Hispanic,2,Urgent,Home or Self Care,2022,CIR016,Conduction disorders,CAR026,PACEMAKER AND DEFIBRILLATOR PROCEDURES,176,"INSERTION, REVISION AND REPLACEMENTS OF PACEMAKER AND OTHER CARDIAC DEVICES",05,DISEASES AND DISORDERS OF THE CIRCULATORY SYSTEM,2,Moderate,Minor,Surgical,Medicare,,,,,N,36015.24,20711.79
New York City,Manhattan,7002001,001438,Bellevue Hospital Center,50 to 69,104,M,Other Race,Spanish/Hispanic,3,Urgent,Home or Self Care,2022,CIR016,Conduction disorders,MAM009,ELECTROPHYSIOLOGIC STUDIES,176,"INSERTION, REVISION AND REPLACEMENTS OF PACEMAKER AND OTHER CARDIAC DEVICES",05,DISEASES AND DISORDERS OF THE CIRCULATORY SYSTEM,4,Extreme,Extreme,Surgical,Medicaid,,,,,N,95490.88,54915.28
New York City,Manhattan,7002001,001438,Bellevue Hospital Center,30 to 49,113,M,Other Race,Spanish/Hispanic,4,Emergency,Home or Self Care,2022,CIR016,Conduction disorders,CAR026,PACEMAKER AND DEFIBRILLATOR PROCEDURES,176,"INSERTION, REVISION AND REPLACEMENTS OF PACEMAKER AND OTHER CARDIAC DEVICES",05,DISEASES AND DISORDERS OF THE CIRCULATORY SYSTEM,2,Moderate,Major,Surgical,Medicaid,,,,,Y,124532.47,71616.63
Hudson Valley,Dutchess,1302001,000181,Vassar Brothers Medical Center,50 to 69,126,M,White,Not Span/Hispanic,4,Emergency,Home or Self Care,2022,CIR018,Cardiac arrest and ventricular fibrillation,CAR026,PACEMAKER AND DEFIBRILLATOR PROCEDURES,176,"INSERTION, REVISION AND REPLACEMENTS OF PACEMAKER AND OTHER CARDIAC DEVICES",05,DISEASES AND DISORDERS OF THE CIRCULATORY SYSTEM,3,Major,Extreme,Surgical,Medicare,,,,,Y,139381.01,52018.68
Long Island,Nassau,2951001,000541,North Shore University Hospital,50 to 69,115,M,White,Not Span/Hispanic,1,Elective,Home or Self Care,2022,CIR016,Conduction disorders,CAR026,PACEMAKER AND DEFIBRILLATOR PROCEDURES,176,"INSERTION, REVISION AND REPLACEMENTS OF PACEMAKER AND OTHER CARDIAC DEVICES",05,DISEASES AND DISORDERS OF THE CIRCULATORY SYSTEM,2,Moderate,Moderate,Surgical,Private Health Insurance,Medicare,,,,N,178131.74,39385.76
Long Island,Nassau,2951001,000541,North Shore University Hospital,50 to 69,113,M,White,Not Span/Hispanic,3,Urgent,Home or Self Care,2022,CIR016,Conduction disorders,MAM009,ELECTROPHYSIOLOGIC STUDIES,176,"INSERTION, REVISION AND REPLACEMENTS OF PACEMAKER AND OTHER CARDIAC DEVICES",05,DISEASES AND DISORDERS OF THE CIRCULATORY SYSTEM,2,Moderate,Major,Surgical,Medicaid,Medicaid,,,,N,158943.62,28424.72
Long Island,Nassau,2951001,000541,North Shore University Hospital,50 to 69,113,F,Other Race,Not Span/Hispanic,3,Emergency,Home or Self Care,2022,INJ033,"Complication of cardiovascular device, implant or graft, initial encounter",CAR026,PACEMAKER AND DEFIBRILLATOR PROCEDURES,176,"INSERTION, REVISION AND REPLACEMENTS OF PACEMAKER AND OTHER CARDIAC DEVICES",05,DISEASES AND DISORDERS OF THE CIRCULATORY SYSTEM,2,Moderate,Moderate,Surgical,Medicaid,Medicaid,,,,Y,64107.89,12354.08
Long Island,Nassau,2951001,000541,North Shore University Hospital,70 or Older,110,M,Other Race,Not Span/Hispanic,1,Emergency,Home or Self Care,2022,CIR016,Conduction disorders,CAR026,PACEMAKER AND DEFIBRILLATOR PROCEDURES,176,"INSERTION, REVISION AND REPLACEMENTS OF PACEMAKER AND OTHER CARDIAC DEVICES",05,DISEASES AND DISORDERS OF THE CIRCULATORY SYSTEM,1,Minor,Minor,Surgical,Medicare,Medicare,Medicaid,,,Y,42899.73,9506.76
Long Island,Nassau,2951001,000541,North Shore University Hospital,70 or Older,115,M,Black/African American,Not Span/Hispanic,1,Elective,Home or Self Care,2022,CIR005,Myocarditis and cardiomyopathy,CAR026,PACEMAKER AND DEFIBRILLATOR PROCEDURES,176,"INSERTION, REVISION AND REPLACEMENTS OF PACEMAKER AND OTHER CARDIAC DEVICES",05,DISEASES AND DISORDERS OF THE CIRCULATORY SYSTEM,2,Moderate,Moderate,Surgical,Medicare,Medicare,,,,N,111616.17,25504.27
Long Island,Nassau,2951001,000541,North Shore University Hospital,70 or Older,114,F,White,Spanish/Hispanic,5,Elective,Home w/ Home Health Services,2022,CIR016,Conduction disorders,CAR026,PACEMAKER AND DEFIBRILLATOR PROCEDURES,176,"INSERTION, REVISION AND REPLACEMENTS OF PACEMAKER AND OTHER CARDIAC DEVICES",05,DISEASES AND DISORDERS OF THE CIRCULATORY SYSTEM,2,Moderate,Moderate,Surgical,Medicare,Medicare,,,,N,262888.00,57025.65
Long Island,Nassau,2951001,000541,North Shore University Hospital,70 or Older,114,M,White,Not Span/Hispanic,2,Emergency,Home w/ Home Health Services,2022,INJ033,"Complication of cardiovascular device, implant or graft, initial encounter",CAR026,PACEMAKER AND DEFIBRILLATOR PROCEDURES,176,"INSERTION, REVISION AND REPLACEMENTS OF PACEMAKER AND OTHER CARDIAC DEVICES",05,DISEASES AND DISORDERS OF THE CIRCULATORY SYSTEM,3,Major,Moderate,Surgical,Medicare,Medicaid,,,,Y,136186.81,27052.06
Long Island,Nassau,2951001,000541,North Shore University Hospital,70 or Older,,F,White,Spanish/Hispanic,1,Emergency,Home or Self Care,2022,CIR016,Conduction disorders,CAR026,PACEMAKER AND DEFIBRILLATOR PROCEDURES,176,"INSERTION, REVISION AND REPLACEMENTS OF PACEMAKER AND OTHER CARDIAC DEVICES",05,DISEASES AND DISORDERS OF THE CIRCULATORY SYSTEM,1,Minor,Minor,Surgical,Medicare,Medicare,,,,Y,28316.70,6167.12
Finger Lakes,Monroe,2701005,000413,Strong Memorial Hospital,70 or Older,140,M,White,Not Span/Hispanic,8,Emergency,Home or Self Care,2022,CIR017,Cardiac dysrhythmias,CAR026,PACEMAKER AND DEFIBRILLATOR PROCEDURES,176,"INSERTION, REVISION AND REPLACEMENTS OF PACEMAKER AND OTHER CARDIAC DEVICES",05,DISEASES AND DISORDERS OF THE CIRCULATORY SYSTEM,3,Major,Major,Surgical,Federal/State/Local/VA,,,,,Y,82775.56,34502.83