Hospital Service Area,Hospital County,Operating Certificate Number,Permanent Facility Id,Facility Name,Age Group,Zip Code - 3 digits,Gender,Race,Ethnicity,Length of Stay,Type of Admission,Patient Disposition,Discharge Year,CCS Diagnosis Code,CCS Diagnosis Description,CCS Procedure Code,CCS Procedure Description,APR DRG Code,APR DRG Description,APR MDC Code,APR MDC Description,APR Severity of Illness Code,APR Severity of Illness Description,APR Risk of Mortality,APR Medical Surgical Description,Payment Typology 1,Payment Typology 2,Payment Typology 3,Birth Weight,Abortion Edit Indicator,Emergency Department Indicator,Total Charges,Total Costs
New York City,Manhattan,7002054,001464,New York-Presbyterian Hospital - Columbia Presbyterian Center,50 to 69,100,M,White,Spanish/Hispanic,2,Emergency,Home or Self Care,2022,CIR019,Heart failure,ADM019,POTENTIAL COVID-19 THERAPIES,194,HEART FAILURE,05,DISEASES AND DISORDERS OF THE CIRCULATORY SYSTEM,3,Major,Extreme,Medical,Medicaid,,,,,Y,48308.91,11212.52
New York City,Manhattan,7002054,001464,New York-Presbyterian Hospital - Columbia Presbyterian Center,50 to 69,100,M,Other Race,Spanish/Hispanic,1,Emergency,Home or Self Care,2022,CIR019,Heart failure,,,194,HEART FAILURE,05,DISEASES AND DISORDERS OF THE CIRCULATORY SYSTEM,2,Moderate,Moderate,Medical,Medicaid,,,,,Y,25807.04,5734.06
New York City,Manhattan,7002054,001464,New York-Presbyterian Hospital - Columbia Presbyterian Center,50 to 69,104,M,Black/African American,Not Span/Hispanic,16,Emergency,Home or Self Care,2022,CIR019,Heart failure,ADM015,ADMINISTRATION OF ANTIBIOTICS,194,HEART FAILURE,05,DISEASES AND DISORDERS OF THE CIRCULATORY SYSTEM,3,Major,Major,Medical,Medicaid,,,,,Y,231901.26,52102.75
New York City,Manhattan,7002054,001464,New York-Presbyterian Hospital - Columbia Presbyterian Center,50 to 69,112,M,Black/African American,Not Span/Hispanic,13,Emergency,Left Against Medical Advice,2022,CIR019,Heart failure,MAM006,PACEMAKER AND DEFIBRILLATOR INTERROGATION,194,HEART FAILURE,05,DISEASES AND DISORDERS OF THE CIRCULATORY SYSTEM,2,Moderate,Major,Medical,Medicaid,,,,,Y,253621.78,118866.84
New York City,Manhattan,7002054,001464,New York-Presbyterian Hospital - Columbia Presbyterian Center,50 to 69,112,M,Black/African American,Not Span/Hispanic,41,Emergency,Skilled Nursing Home,2022,CIR019,Heart failure,ADM021,"ADMINISTRATION OF THERAPEUTIC SUBSTANCES, NEC",194,HEART FAILURE,05,DISEASES AND DISORDERS OF THE CIRCULATORY SYSTEM,3,Major,Extreme,Medical,Medicaid,,,,,Y,493662.49,105900.25
New York City,Manhattan,7002054,001464,New York-Presbyterian Hospital - Columbia Presbyterian Center,70 or Older,OOS,F,White,Not Span/Hispanic,6,Emergency,Expired,2022,CIR019,Heart failure,CAR024,VENOUS AND ARTERIAL CATHETER PLACEMENT,194,HEART FAILURE,05,DISEASES AND DISORDERS OF THE CIRCULATORY SYSTEM,4,Extreme,Extreme,Medical,Medicare,Private Health Insurance,,,,Y,168377.74,60792.15
New York City,Manhattan,7002054,001464,New York-Presbyterian Hospital - Columbia Presbyterian Center,70 or Older,100,F,Other Race,Spanish/Hispanic,8,Emergency,Home or Self Care,2022,CIR019,Heart failure,ADM015,ADMINISTRATION OF ANTIBIOTICS,194,HEART FAILURE,05,DISEASES AND DISORDERS OF THE CIRCULATORY SYSTEM,3,Major,Extreme,Medical,Medicare,Medicaid,,,,Y,161214.20,35879.46
New York City,Manhattan,7002054,001464,New York-Presbyterian Hospital - Columbia Presbyterian Center,70 or Older,100,F,Other Race,Spanish/Hispanic,3,Emergency,Home w/ Home Health Services,2022,CIR019,Heart failure,,,194,HEART FAILURE,05,DISEASES AND DISORDERS OF THE CIRCULATORY SYSTEM,2,Moderate,Moderate,Medical,Medicare,Medicaid,,,,Y,46420.80,9835.14
New York City,Manhattan,7002054,001464,New York-Presbyterian Hospital - Columbia Presbyterian Center,70 or Older,100,M,White,Not Span/Hispanic,12,Emergency,Expired,2022,CIR019,Heart failure,ADM015,ADMINISTRATION OF ANTIBIOTICS,194,HEART FAILURE,05,DISEASES AND DISORDERS OF THE CIRCULATORY SYSTEM,3,Major,Major,Medical,Medicare,,,,,Y,157507.90,34392.61
New York City,Manhattan,7002054,001464,New York-Presbyterian Hospital - Columbia Presbyterian Center,70 or Older,100,F,Black/African American,Not Span/Hispanic,4,Emergency,Home w/ Home Health Services,2022,CIR019,Heart failure,ADM019,POTENTIAL COVID-19 THERAPIES,194,HEART FAILURE,05,DISEASES AND DISORDERS OF THE CIRCULATORY SYSTEM,3,Major,Extreme,Medical,Medicare,Medicaid,,,,Y,94979.83,42259.70
New York City,Manhattan,7002054,001464,New York-Presbyterian Hospital - Columbia Presbyterian Center,70 or Older,100,M,Other Race,Spanish/Hispanic,10,Emergency,Home or Self Care,2022,CIR019,Heart failure,IMG008,ULTRASONOGRAPHY,194,HEART FAILURE,05,DISEASES AND DISORDERS OF THE CIRCULATORY SYSTEM,2,Moderate,Major,Medical,Medicare,,,,,Y,140292.88,30205.30
New York City,Manhattan,7002001,001438,Bellevue Hospital Center,50 to 69,115,M,Other Race,Spanish/Hispanic,3,Emergency,Home or Self Care,2022,CIR019,Heart failure,IMG008,ULTRASONOGRAPHY,194,HEART FAILURE,05,DISEASES AND DISORDERS OF THE CIRCULATORY SYSTEM,2,Moderate,Minor,Medical,Medicaid,,,,,Y,24805.26,14265.11
New York City,Manhattan,7002001,001438,Bellevue Hospital Center,70 or Older,112,M,Other Race,Spanish/Hispanic,6,Urgent,Home w/ Home Health Services,2022,CIR019,Heart failure,ADM021,"ADMINISTRATION OF THERAPEUTIC SUBSTANCES, NEC",194,HEART FAILURE,05,DISEASES AND DISORDERS OF THE CIRCULATORY SYSTEM,2,Moderate,Major,Medical,Medicare,Medicaid,,,,N,58212.47,33477.06
New York City,Manhattan,7002001,001438,Bellevue Hospital Center,70 or Older,100,F,Other Race,Not Span/Hispanic,7,Emergency,Home w/ Home Health Services,2022,CIR019,Heart failure,ADM022,COVID-19 VACCINATIONS,194,HEART FAILURE,05,DISEASES AND DISORDERS OF THE CIRCULATORY SYSTEM,2,Moderate,Moderate,Medical,Medicare,Medicaid,,,,Y,60169.66,
New York City,Manhattan,7002001,001438,Bellevue Hospital Center,70 or Older,104,M,Other Race,Not Span/Hispanic,3,Emergency,Home w/ Home Health Services,2022,CIR019,Heart failure,ADM021,"ADMINISTRATION OF THERAPEUTIC SUBSTANCES, NEC",194,HEART FAILURE,05,DISEASES AND DISORDERS OF THE CIRCULATORY SYSTEM,2,Moderate,Major,Medical,Medicare,Medicaid,,,,Y,25967.72,14933.62
New York City,Manhattan,7002001,001438,Bellevue Hospital Center,50 to 69,112,M,Black/African American,Unknown,2,Urgent,Expired,2022,CIR019,Heart failure,IMG008,ULTRASONOGRAPHY,194,HEART FAILURE,05,DISEASES AND DISORDERS OF THE CIRCULATORY SYSTEM,4,Extreme,Extreme,Medical,Medicaid,,,,,N,58726.93,33772.92
New York City,Manhattan,7002001,001438,Bellevue Hospital Center,50 to 69,112,M,Black/African American,Not Span/Hispanic,9,Urgent,Home or Self Care,2022,CIR019,Heart failure,IMG008,ULTRASONOGRAPHY,194,HEART FAILURE,05,DISEASES AND DISORDERS OF THE CIRCULATORY SYSTEM,3,Major,Major,Medical,Medicaid,,,,,N,71746.95,41260.52
New York City,Manhattan,7002001,001438,Bellevue Hospital Center,70 or Older,100,M,Black/African American,Not Span/Hispanic,5,Emergency,Home or Self Care,2022,CIR019,Heart failure,IMG008,ULTRASONOGRAPHY,194,HEART FAILURE,05,DISEASES AND DISORDERS OF THE CIRCULATORY SYSTEM,2,Moderate,Major,Medical,Medicare,,,,,Y,39823.36,22901.78
New York City,Manhattan,7002054,001464,New York-Presbyterian Hospital - Columbia Presbyterian Center,70 or Older,100,M,White,Not Span/Hispanic,5,Emergency,Skilled Nursing Home,2022,CIR019,Heart failure,RES005,CHEST TUBE PLACEMENT AND THERAPEUTIC THORACENTESIS,194,HEART FAILURE,05,DISEASES AND DISORDERS OF THE CIRCULATORY SYSTEM,3,Major,Major,Medical,Medicare,Private Health Insurance,,,,Y,102838.91,43422.01
New York City,Manhattan,7002054,001464,New York-Presbyterian Hospital - Columbia Presbyterian Center,70 or Older,100,F,Other Race,Spanish/Hispanic,5,Emergency,Home w/ Home Health Services,2022,CIR019,Heart failure,,,194,HEART FAILURE,05,DISEASES AND DISORDERS OF THE CIRCULATORY SYSTEM,2,Moderate,Major,Medical,Medicare,Private Health Insurance,,,,Y,78619.89,17143.31
New York City,Manhattan,7002054,001464,New York-Presbyterian Hospital - Columbia Presbyterian Center,50 to 69,115,M,White,Not Span/Hispanic,13,Emergency,Expired,2022,CIR019,Heart failure,CAR024,VENOUS AND ARTERIAL CATHETER PLACEMENT,194,HEART FAILURE,05,DISEASES AND DISORDERS OF THE CIRCULATORY SYSTEM,4,Extreme,Extreme,Medical,Medicaid,,,,,Y,407061.76,156220.95
New York City,Manhattan,7002054,001464,New York-Presbyterian Hospital - Columbia Presbyterian Center,70 or Older,100,F,Other Race,Spanish/Hispanic,3,Emergency,Home w/ Home Health Services,2022,GEN003,Chronic kidney disease,ESA001,HEMODIALYSIS,194,HEART FAILURE,05,DISEASES AND DISORDERS OF THE CIRCULATORY SYSTEM,3,Major,Extreme,Medical,Medicare,Medicaid,,,,Y,66009.05,14616.05
New York City,Manhattan,7002054,001464,New York-Presbyterian Hospital - Columbia Presbyterian Center,70 or Older,100,F,Other Race,Unknown,4,Emergency,Home or Self Care,2022,CIR019,Heart failure,,,194,HEART FAILURE,05,DISEASES AND DISORDERS OF THE CIRCULATORY SYSTEM,2,Moderate,Moderate,Medical,Medicare,,,,,Y,74025.42,15636.10
New York City,Manhattan,7002054,001464,New York-Presbyterian Hospital - Columbia Presbyterian Center,50 to 69,100,M,Black/African American,Not Span/Hispanic,4,Emergency,Home or Self Care,2022,CIR019,Heart failure,,,194,HEART FAILURE,05,DISEASES AND DISORDERS OF THE CIRCULATORY SYSTEM,2,Moderate,Moderate,Medical,Medicaid,,,,,Y,73607.51,17684.12
New York City,Manhattan,7002054,001464,New York-Presbyterian Hospital - Columbia Presbyterian Center,70 or Older,100,F,Other Race,Spanish/Hispanic,4,Emergency,Home or Self Care,2022,GEN003,Chronic kidney disease,ESA001,HEMODIALYSIS,194,HEART FAILURE,05,DISEASES AND DISORDERS OF THE CIRCULATORY SYSTEM,4,Extreme,Extreme,Medical,Medicare,,,,,Y,99432.45,21423.47
New York City,Manhattan,7002054,001464,New York-Presbyterian Hospital - Columbia Presbyterian Center,50 to 69,100,F,Other Race,Spanish/Hispanic,8,Emergency,Home w/ Home Health Services,2022,CIR019,Heart failure,IMG008,ULTRASONOGRAPHY,194,HEART FAILURE,05,DISEASES AND DISORDERS OF THE CIRCULATORY SYSTEM,4,Extreme,Extreme,Medical,Medicare,Medicaid,,,,Y,169336.98,37962.50
New York City,Manhattan,7002054,001464,New York-Presbyterian Hospital - Columbia Presbyterian Center,70 or Older,100,M,White,Spanish/Hispanic,1,Emergency,Left Against Medical Advice,2022,CIR019,Heart failure,ADM021,"ADMINISTRATION OF THERAPEUTIC SUBSTANCES, NEC",194,HEART FAILURE,05,DISEASES AND DISORDERS OF THE CIRCULATORY SYSTEM,3,Major,Major,Medical,Medicaid,,,,,Y,22229.48,4554.45
New York City,Manhattan,7002054,001464,New York-Presbyterian Hospital - Columbia Presbyterian Center,70 or Older,100,F,Black/African American,Not Span/Hispanic,3,Emergency,Home or Self Care,2022,CIR019,Heart failure,ADM021,"ADMINISTRATION OF THERAPEUTIC SUBSTANCES, NEC",194,HEART FAILURE,05,DISEASES AND DISORDERS OF THE CIRCULATORY SYSTEM,3,Major,Major,Medical,Medicare,Medicaid,,,,Y,47942.75,10189.94
New York City,Manhattan,7002054,001464,New York-Presbyterian Hospital - Columbia Presbyterian Center,50 to 69,104,F,Other Race,Spanish/Hispanic,4,Emergency,Left Against Medical Advice,2022,CIR019,Heart failure,ADM017,ADMINISTRATION OF NUTRITIONAL AND ELECTROLYTIC SUBSTANCES,194,HEART FAILURE,05,DISEASES AND DISORDERS OF THE CIRCULATORY SYSTEM,2,Moderate,Minor,Medical,Medicaid,,,,,Y,62613.59,13538.84
New York City,Manhattan,7002054,001464,New York-Presbyterian Hospital - Columbia Presbyterian Center,70 or Older,100,M,Other Race,Spanish/Hispanic,7,Emergency,Home w/ Home Health Services,2022,CIR019,Heart failure,MAM006,PACEMAKER AND DEFIBRILLATOR INTERROGATION,194,HEART FAILURE,05,DISEASES AND DISORDERS OF THE CIRCULATORY SYSTEM,3,Major,Major,Medical,Medicare,Medicaid,,,,Y,103705.15,22287.48
New York City,Manhattan,7002054,001464,New York-Presbyterian Hospital - Columbia Presbyterian Center,50 to 69,100,M,Black/African American,Not Span/Hispanic,4,Emergency,Home or Self Care,2022,CIR019,Heart failure,MAM006,PACEMAKER AND DEFIBRILLATOR INTERROGATION,194,HEART FAILURE,05,DISEASES AND DISORDERS OF THE CIRCULATORY SYSTEM,3,Major,Major,Medical,Medicare,,,,,Y,65276.84,13667.91
New York City,Manhattan,7002001,001438,Bellevue Hospital Center,50 to 69,112,F,Black/African American,Unknown,6,Urgent,Home w/ Home Health Services,2022,CIR019,Heart failure,IMG008,ULTRASONOGRAPHY,194,HEART FAILURE,05,DISEASES AND DISORDERS OF THE CIRCULATORY SYSTEM,3,Major,Extreme,Medical,Medicare,Medicaid,,,,N,48927.18,28137.24
New York City,Manhattan,7002001,001438,Bellevue Hospital Center,70 or Older,100,M,White,Unknown,14,Emergency,Home or Self Care,2022,CIR019,Heart failure,OTR004,ISOLATION PROCEDURES,194,HEART FAILURE,05,DISEASES AND DISORDERS OF THE CIRCULATORY SYSTEM,3,Major,Extreme,Medical,Medicaid,,,,,Y,94225.41,54187.53
New York City,Manhattan,7002001,001438,Bellevue Hospital Center,70 or Older,112,M,Other Race,Spanish/Hispanic,7,Emergency,Home or Self Care,2022,CIR019,Heart failure,ADM021,"ADMINISTRATION OF THERAPEUTIC SUBSTANCES, NEC",194,HEART FAILURE,05,DISEASES AND DISORDERS OF THE CIRCULATORY SYSTEM,2,Moderate,Major,Medical,Medicare,,,,,Y,55462.51,31895.60
New York City,Manhattan,7002001,001438,Bellevue Hospital Center,50 to 69,104,M,Other Race,Spanish/Hispanic,5,Emergency,Home or Self Care,2022,CIR019,Heart failure,,,194,HEART FAILURE,05,DISEASES AND DISORDERS OF THE CIRCULATORY SYSTEM,1,Minor,Minor,Medical,Medicaid,,,,,Y,39910.27,22951.76
New York City,Manhattan,7002054,001464,New York-Presbyterian Hospital - Columbia Presbyterian Center,30 to 49,100,M,Other Race,Unknown,6,Emergency,Home or Self Care,2022,CIR019,Heart failure,ADM021,"ADMINISTRATION OF THERAPEUTIC SUBSTANCES, NEC",194,HEART FAILURE,05,DISEASES AND DISORDERS OF THE CIRCULATORY SYSTEM,4,Extreme,Extreme,Medical,Medicaid,,,,,Y,121911.00,25961.38
New York City,Manhattan,7002054,001464,New York-Presbyterian Hospital - Columbia Presbyterian Center,70 or Older,100,F,Black/African American,Not Span/Hispanic,5,Emergency,Home w/ Home Health Services,2022,CIR019,Heart failure,IMG008,ULTRASONOGRAPHY,194,HEART FAILURE,05,DISEASES AND DISORDERS OF THE CIRCULATORY SYSTEM,3,Major,Major,Medical,Medicare,Medicaid,,,,Y,81969.15,18217.44
New York City,Manhattan,7002054,001464,New York-Presbyterian Hospital - Columbia Presbyterian Center,70 or Older,104,F,Other Race,Spanish/Hispanic,7,Emergency,Home or Self Care,2022,CIR019,Heart failure,RES005,CHEST TUBE PLACEMENT AND THERAPEUTIC THORACENTESIS,194,HEART FAILURE,05,DISEASES AND DISORDERS OF THE CIRCULATORY SYSTEM,3,Major,Major,Medical,Medicare,Medicaid,,,,Y,109693.33,23876.95
New York City,Manhattan,7002054,001464,New York-Presbyterian Hospital - Columbia Presbyterian Center,0 to 17,117,M,White,Spanish/Hispanic,8,Emergency,Home or Self Care,2022,CIR019,Heart failure,,,194,HEART FAILURE,05,DISEASES AND DISORDERS OF THE CIRCULATORY SYSTEM,3,Major,Moderate,Medical,Medicaid,,,,,Y,195661.93,92437.53
New York City,Manhattan,7002054,001464,New York-Presbyterian Hospital - Columbia Presbyterian Center,30 to 49,112,M,Black/African American,Not Span/Hispanic,11,Emergency,Home or Self Care,2022,CIR019,Heart failure,ADM017,ADMINISTRATION OF NUTRITIONAL AND ELECTROLYTIC SUBSTANCES,194,HEART FAILURE,05,DISEASES AND DISORDERS OF THE CIRCULATORY SYSTEM,2,Moderate,Major,Medical,Medicare,,,,,Y,214445.49,45907.08
New York City,Manhattan,7002054,001464,New York-Presbyterian Hospital - Columbia Presbyterian Center,50 to 69,100,M,Other Race,Spanish/Hispanic,2,Emergency,Home or Self Care,2022,CIR019,Heart failure,ADM021,"ADMINISTRATION OF THERAPEUTIC SUBSTANCES, NEC",194,HEART FAILURE,05,DISEASES AND DISORDERS OF THE CIRCULATORY SYSTEM,3,Major,Major,Medical,Medicaid,,,,,Y,51766.71,21624.34
New York City,Manhattan,7002054,001464,New York-Presbyterian Hospital - Columbia Presbyterian Center,50 to 69,116,F,Other Race,Not Span/Hispanic,6,Emergency,Home or Self Care,2022,GEN003,Chronic kidney disease,ESA004,NON-INVASIVE VENTILATION,194,HEART FAILURE,05,DISEASES AND DISORDERS OF THE CIRCULATORY SYSTEM,3,Major,Extreme,Medical,Medicaid,,,,,Y,102337.15,21549.22
New York City,Manhattan,7002054,001464,New York-Presbyterian Hospital - Columbia Presbyterian Center,50 to 69,100,M,Black/African American,Not Span/Hispanic,6,Emergency,Home or Self Care,2022,CIR019,Heart failure,,,194,HEART FAILURE,05,DISEASES AND DISORDERS OF THE CIRCULATORY SYSTEM,2,Moderate,Major,Medical,Medicaid,,,,,Y,87391.66,18739.09
New York City,Manhattan,7002054,001464,New York-Presbyterian Hospital - Columbia Presbyterian Center,0 to 17,136,M,White,Not Span/Hispanic,1,Elective,Home or Self Care,2022,CIR019,Heart failure,IMG005,MAGNETIC RESONANCE IMAGING (MRI),194,HEART FAILURE,05,DISEASES AND DISORDERS OF THE CIRCULATORY SYSTEM,2,Moderate,Moderate,Medical,Medicaid,,,,,N,32491.07,9340.77
New York City,Manhattan,7002054,001464,New York-Presbyterian Hospital - Columbia Presbyterian Center,70 or Older,100,F,Black/African American,Not Span/Hispanic,2,Emergency,Home or Self Care,2022,CIR019,Heart failure,ADM021,"ADMINISTRATION OF THERAPEUTIC SUBSTANCES, NEC",194,HEART FAILURE,05,DISEASES AND DISORDERS OF THE CIRCULATORY SYSTEM,3,Major,Major,Medical,Medicare,Medicaid,,,,Y,45775.98,
New York City,Manhattan,7002054,001464,New York-Presbyterian Hospital - Columbia Presbyterian Center,70 or Older,104,M,White,Not Span/Hispanic,4,Emergency,Home or Self Care,2022,CIR019,Heart failure,,,194,HEART FAILURE,05,DISEASES AND DISORDERS OF THE CIRCULATORY SYSTEM,3,Major,Major,Medical,Medicare,,,,,Y,88698.02,18422.62
New York City,Manhattan,7002054,001464,New York-Presbyterian Hospital - Columbia Presbyterian Center,70 or Older,100,F,Black/African American,Not Span/Hispanic,1,Emergency,Home or Self Care,2022,CIR019,Heart failure,ADM021,"ADMINISTRATION OF THERAPEUTIC SUBSTANCES, NEC",194,HEART FAILURE,05,DISEASES AND DISORDERS OF THE CIRCULATORY SYSTEM,2,Moderate,Moderate,Medical,Medicare,Medicaid,,,,Y,22563.84,4583.76
New York City,Manhattan,7002001,001438,Bellevue Hospital Center,50 to 69,112,M,Other Race,Spanish/Hispanic,7,Emergency,Home or Self Care,2022,CIR019,Heart failure,ADM022,COVID-19 VACCINATIONS,194,HEART FAILURE,05,DISEASES AND DISORDERS OF THE CIRCULATORY SYSTEM,2,Moderate,Major,Medical,Medicare,,,,,Y,52840.96,
New York City,Manhattan,7002001,001438,Bellevue Hospital Center,70 or Older,100,F,Other Race,Spanish/Hispanic,36,Emergency,Home w/ Home Health Services,2022,CIR019,Heart failure,ADM021,"ADMINISTRATION OF THERAPEUTIC SUBSTANCES, NEC",194,HEART FAILURE,05,DISEASES AND DISORDERS OF THE CIRCULATORY SYSTEM,3,Major,Major,Medical,Medicare,Medicaid,,,,Y,262048.84,150700.10
New York City,Manhattan,7002001,001438,Bellevue Hospital Center,50 to 69,100,F,Black/African American,Unknown,8,Emergency,Skilled Nursing Home,2022,GEN003,Chronic kidney disease,ESA001,HEMODIALYSIS,194,HEART FAILURE,05,DISEASES AND DISORDERS OF THE CIRCULATORY SYSTEM,3,Major,Major,Medical,Medicare,Medicaid,,,,Y,57095.21,32834.54
New York City,Manhattan,7002001,001438,Bellevue Hospital Center,70 or Older,114,M,Other Race,Not Span/Hispanic,32,Emergency,Home w/ Home Health Services,2022,GEN003,Chronic kidney disease,ADM017,ADMINISTRATION OF NUTRITIONAL AND ELECTROLYTIC SUBSTANCES,194,HEART FAILURE,05,DISEASES AND DISORDERS OF THE CIRCULATORY SYSTEM,4,Extreme,Extreme,Medical,Medicare,Medicaid,,,,Y,260049.97,149550.58
New York City,Manhattan,7002001,001438,Bellevue Hospital Center,50 to 69,112,M,Black/African American,Unknown,2,Emergency,Home or Self Care,2022,CIR019,Heart failure,,,194,HEART FAILURE,05,DISEASES AND DISORDERS OF THE CIRCULATORY SYSTEM,1,Minor,Minor,Medical,Medicaid,,,,,Y,17794.52,10233.34
New York City,Manhattan,7002001,001438,Bellevue Hospital Center,70 or Older,114,M,Other Race,Not Span/Hispanic,2,Urgent,Home or Self Care,2022,CIR019,Heart failure,ADM021,"ADMINISTRATION OF THERAPEUTIC SUBSTANCES, NEC",194,HEART FAILURE,05,DISEASES AND DISORDERS OF THE CIRCULATORY SYSTEM,3,Major,Major,Medical,Medicare,Medicaid,,,,N,16122.51,9271.80
New York City,Manhattan,7002054,001464,New York-Presbyterian Hospital - Columbia Presbyterian Center,70 or Older,100,F,White,Not Span/Hispanic,18,Emergency,Skilled Nursing Home,2022,CIR019,Heart failure,,,194,HEART FAILURE,05,DISEASES AND DISORDERS OF THE CIRCULATORY SYSTEM,2,Moderate,Major,Medical,Private Health Insurance,,,,,Y,373889.05,175333.76
New York City,Manhattan,7002054,001464,New York-Presbyterian Hospital - Columbia Presbyterian Center,70 or Older,100,F,Other Race,Spanish/Hispanic,6,Emergency,Home or Self Care,2022,CIR019,Heart failure,MAM006,PACEMAKER AND DEFIBRILLATOR INTERROGATION,194,HEART FAILURE,05,DISEASES AND DISORDERS OF THE CIRCULATORY SYSTEM,4,Extreme,Major,Medical,Medicare,,,,,Y,139746.73,61880.53
New York City,Manhattan,7002054,001464,New York-Presbyterian Hospital - Columbia Presbyterian Center,50 to 69,104,F,Black/African American,Spanish/Hispanic,5,Emergency,Home w/ Home Health Services,2022,GEN003,Chronic kidney disease,ADM001,TRANSFUSION OF BLOOD AND BLOOD PRODUCTS,194,HEART FAILURE,05,DISEASES AND DISORDERS OF THE CIRCULATORY SYSTEM,4,Extreme,Extreme,Medical,Medicaid,,,,,Y,78948.65,18840.15
New York City,Manhattan,7002054,001464,New York-Presbyterian Hospital - Columbia Presbyterian Center,70 or Older,100,F,Other Race,Spanish/Hispanic,7,Emergency,Home w/ Home Health Services,2022,CIR019,Heart failure,OTR004,ISOLATION PROCEDURES,194,HEART FAILURE,05,DISEASES AND DISORDERS OF THE CIRCULATORY SYSTEM,3,Major,Major,Medical,Medicare,,,,,Y,131381.25,27935.85
New York City,Manhattan,7002054,001464,New York-Presbyterian Hospital - Columbia Presbyterian Center,50 to 69,100,M,Other Race,Spanish/Hispanic,13,Emergency,Home or Self Care,2022,CIR019,Heart failure,ADM019,POTENTIAL COVID-19 THERAPIES,194,HEART FAILURE,05,DISEASES AND DISORDERS OF THE CIRCULATORY SYSTEM,3,Major,Major,Medical,Medicaid,,,,,Y,200931.34,43814.97
New York City,Manhattan,7002054,001464,New York-Presbyterian Hospital - Columbia Presbyterian Center,30 to 49,OOS,M,Other Race,Not Span/Hispanic,6,Emergency,Home or Self Care,2022,GEN003,Chronic kidney disease,,,194,HEART FAILURE,05,DISEASES AND DISORDERS OF THE CIRCULATORY SYSTEM,3,Major,Moderate,Medical,Medicaid,,,,,Y,161029.58,41863.27
New York City,Manhattan,7002054,001464,New York-Presbyterian Hospital - Columbia Presbyterian Center,70 or Older,100,F,Other Race,Spanish/Hispanic,5,Emergency,Home w/ Home Health Services,2022,CIR019,Heart failure,ADM015,ADMINISTRATION OF ANTIBIOTICS,194,HEART FAILURE,05,DISEASES AND DISORDERS OF THE CIRCULATORY SYSTEM,3,Major,Major,Medical,Medicaid,,,,,Y,76925.46,16479.29
New York City,Manhattan,7002054,001464,New York-Presbyterian Hospital - Columbia Presbyterian Center,50 to 69,100,M,Black/African American,Not Span/Hispanic,4,Emergency,Home or Self Care,2022,CIR019,Heart failure,,,194,HEART FAILURE,05,DISEASES AND DISORDERS OF THE CIRCULATORY SYSTEM,2,Moderate,Major,Medical,Medicaid,,,,,Y,63536.28,13447.69
New York City,Manhattan,7002054,001464,New York-Presbyterian Hospital - Columbia Presbyterian Center,18 to 29,OOS,F,Other Race,Unknown,6,Urgent,Home or Self Care,2022,CIR019,Heart failure,,,194,HEART FAILURE,05,DISEASES AND DISORDERS OF THE CIRCULATORY SYSTEM,2,Moderate,Major,Medical,Medicaid,,,,,N,134653.74,60186.20
New York City,Manhattan,7002054,001464,New York-Presbyterian Hospital - Columbia Presbyterian Center,70 or Older,104,F,White,Not Span/Hispanic,7,Emergency,Home w/ Home Health Services,2022,CIR019,Heart failure,ADM019,POTENTIAL COVID-19 THERAPIES,194,HEART FAILURE,05,DISEASES AND DISORDERS OF THE CIRCULATORY SYSTEM,3,Major,Major,Medical,Medicare,Medicaid,,,,Y,113301.33,26106.62
New York City,Manhattan,7002001,001438,Bellevue Hospital Center,50 to 69,112,F,Other Race,Spanish/Hispanic,2,Emergency,Expired,2022,CIR019,Heart failure,ESA005,CARDIAC CHEST COMPRESSION,194,HEART FAILURE,05,DISEASES AND DISORDERS OF THE CIRCULATORY SYSTEM,2,Moderate,Major,Medical,Medicaid,,,,,Y,19434.29,11176.35