Hospital Service Area,Hospital County,Operating Certificate Number,Permanent Facility Id,Facility Name,Age Group,Zip Code - 3 digits,Gender,Race,Ethnicity,Length of Stay,Type of Admission,Patient Disposition,Discharge Year,CCS Diagnosis Code,CCS Diagnosis Description,CCS Procedure Code,CCS Procedure Description,APR DRG Code,APR DRG Description,APR MDC Code,APR MDC Description,APR Severity of Illness Code,APR Severity of Illness Description,APR Risk of Mortality,APR Medical Surgical Description,Payment Typology 1,Payment Typology 2,Payment Typology 3,Birth Weight,Abortion Edit Indicator,Emergency Department Indicator,Total Charges,Total Costs
New York City,Manhattan,7002054,001464,New York-Presbyterian Hospital - Columbia Presbyterian Center,30 to 49,100,M,Other Race,Spanish/Hispanic,10,Emergency,Left Against Medical Advice,2022,CIR004,Endocarditis and endocardial disease,OTR004,ISOLATION PROCEDURES,200,CARDIAC STRUCTURAL AND VALVULAR DISORDERS,05,DISEASES AND DISORDERS OF THE CIRCULATORY SYSTEM,4,Extreme,Major,Medical,Medicaid,,,,,Y,155960.86,33413.74
New York City,Manhattan,7002001,001438,Bellevue Hospital Center,50 to 69,114,F,Other Race,Unknown,2,Elective,Home or Self Care,2022,CIR003,Nonrheumatic and unspecified valve disorders,OTR004,ISOLATION PROCEDURES,200,CARDIAC STRUCTURAL AND VALVULAR DISORDERS,05,DISEASES AND DISORDERS OF THE CIRCULATORY SYSTEM,2,Moderate,Major,Medical,Medicaid,,,,,N,14229.05,8182.90
New York City,Manhattan,7002001,001438,Bellevue Hospital Center,50 to 69,114,F,Other Race,Spanish/Hispanic,15,Urgent,Home or Self Care,2022,CIR001,Chronic rheumatic heart disease,ADM019,POTENTIAL COVID-19 THERAPIES,200,CARDIAC STRUCTURAL AND VALVULAR DISORDERS,05,DISEASES AND DISORDERS OF THE CIRCULATORY SYSTEM,3,Major,Major,Medical,Medicaid,,,,,N,123188.28,70843.61
New York City,Manhattan,7002054,001464,New York-Presbyterian Hospital - Columbia Presbyterian Center,30 to 49,104,F,Other Race,Spanish/Hispanic,2,Emergency,Home or Self Care,2022,CIR003,Nonrheumatic and unspecified valve disorders,,,200,CARDIAC STRUCTURAL AND VALVULAR DISORDERS,05,DISEASES AND DISORDERS OF THE CIRCULATORY SYSTEM,2,Moderate,Moderate,Medical,Private Health Insurance,,,,,Y,32848.76,7253.01
New York City,Manhattan,7002054,001464,New York-Presbyterian Hospital - Columbia Presbyterian Center,0 to 17,112,F,White,Not Span/Hispanic,4,Elective,Home or Self Care,2022,MAL001,Cardiac and circulatory congenital anomalies,ADM017,ADMINISTRATION OF NUTRITIONAL AND ELECTROLYTIC SUBSTANCES,200,CARDIAC STRUCTURAL AND VALVULAR DISORDERS,05,DISEASES AND DISORDERS OF THE CIRCULATORY SYSTEM,3,Major,Major,Medical,Medicaid,,,,,N,89390.95,41896.39
New York City,Manhattan,7002054,001464,New York-Presbyterian Hospital - Columbia Presbyterian Center,0 to 17,112,F,Other Race,Unknown,1,Emergency,Home or Self Care,2022,MAL001,Cardiac and circulatory congenital anomalies,,,200,CARDIAC STRUCTURAL AND VALVULAR DISORDERS,05,DISEASES AND DISORDERS OF THE CIRCULATORY SYSTEM,2,Moderate,Minor,Medical,Medicaid,,,03200,,Y,23056.19,
New York City,Manhattan,7002054,001464,New York-Presbyterian Hospital - Columbia Presbyterian Center,0 to 17,107,F,White,Spanish/Hispanic,19,Emergency,Home or Self Care,2022,MAL001,Cardiac and circulatory congenital anomalies,ESA004,NON-INVASIVE VENTILATION,200,CARDIAC STRUCTURAL AND VALVULAR DISORDERS,05,DISEASES AND DISORDERS OF THE CIRCULATORY SYSTEM,4,Extreme,Extreme,Medical,Medicaid,,,02600,,Y,724420.22,268723.35
New York City,Manhattan,7002053,001463,NYU Langone Hospitals,70 or Older,115,M,White,Not Span/Hispanic,1,Elective,Home or Self Care,2022,CIR003,Nonrheumatic and unspecified valve disorders,,,200,CARDIAC STRUCTURAL AND VALVULAR DISORDERS,05,DISEASES AND DISORDERS OF THE CIRCULATORY SYSTEM,3,Major,Major,Medical,Medicare,Medicare,,,,N,11213.07,4875.86
New York City,Manhattan,7002054,001464,New York-Presbyterian Hospital - Columbia Presbyterian Center,50 to 69,105,F,Other Race,Unknown,2,Elective,Home or Self Care,2022,CIR001,Chronic rheumatic heart disease,IMG008,ULTRASONOGRAPHY,200,CARDIAC STRUCTURAL AND VALVULAR DISORDERS,05,DISEASES AND DISORDERS OF THE CIRCULATORY SYSTEM,2,Moderate,Moderate,Medical,Medicare,Private Health Insurance,,,,N,62070.56,24128.86
New York City,Manhattan,7002001,001438,Bellevue Hospital Center,30 to 49,,M,Other Race,Spanish/Hispanic,1,Emergency,Home or Self Care,2022,MAL001,Cardiac and circulatory congenital anomalies,IMG008,ULTRASONOGRAPHY,200,CARDIAC STRUCTURAL AND VALVULAR DISORDERS,05,DISEASES AND DISORDERS OF THE CIRCULATORY SYSTEM,1,Minor,Minor,Medical,Medicaid,,,,,Y,12057.90,6934.31
New York City,Manhattan,7002001,001438,Bellevue Hospital Center,70 or Older,112,M,Black/African American,Unknown,7,Urgent,Home or Self Care,2022,MAL001,Cardiac and circulatory congenital anomalies,ADM022,COVID-19 VACCINATIONS,200,CARDIAC STRUCTURAL AND VALVULAR DISORDERS,05,DISEASES AND DISORDERS OF THE CIRCULATORY SYSTEM,3,Major,Major,Medical,Medicare,Medicaid,,,,N,51909.45,
New York City,Manhattan,7002001,001438,Bellevue Hospital Center,70 or Older,114,F,Black/African American,Unknown,1,Urgent,Short-term Hospital,2022,CIR003,Nonrheumatic and unspecified valve disorders,ADM021,"ADMINISTRATION OF THERAPEUTIC SUBSTANCES, NEC",200,CARDIAC STRUCTURAL AND VALVULAR DISORDERS,05,DISEASES AND DISORDERS OF THE CIRCULATORY SYSTEM,2,Moderate,Minor,Medical,Medicare,Medicaid,,,,N,6779.31,3898.67
New York City,Manhattan,7002001,001438,Bellevue Hospital Center,50 to 69,,M,White,Not Span/Hispanic,1,Emergency,Left Against Medical Advice,2022,CIR004,Endocarditis and endocardial disease,ADM015,ADMINISTRATION OF ANTIBIOTICS,200,CARDIAC STRUCTURAL AND VALVULAR DISORDERS,05,DISEASES AND DISORDERS OF THE CIRCULATORY SYSTEM,3,Major,Moderate,Medical,Medicaid,,,,,Y,12165.04,6995.92
New York City,Manhattan,7002001,001438,Bellevue Hospital Center,70 or Older,112,F,Black/African American,Not Span/Hispanic,1,Emergency,Home or Self Care,2022,CIR003,Nonrheumatic and unspecified valve disorders,IMG007,COMPUTERIZED TOMOGRAPHY (CT) WITHOUT CONTRAST,200,CARDIAC STRUCTURAL AND VALVULAR DISORDERS,05,DISEASES AND DISORDERS OF THE CIRCULATORY SYSTEM,2,Moderate,Minor,Medical,Medicaid,,,,,Y,15868.88,9125.94
New York City,Manhattan,7002054,001464,New York-Presbyterian Hospital - Columbia Presbyterian Center,0 to 17,OOS,M,White,Not Span/Hispanic,3,Emergency,Home or Self Care,2022,MAL001,Cardiac and circulatory congenital anomalies,IMG008,ULTRASONOGRAPHY,200,CARDIAC STRUCTURAL AND VALVULAR DISORDERS,05,DISEASES AND DISORDERS OF THE CIRCULATORY SYSTEM,2,Moderate,Moderate,Medical,Self-Pay,,,03300,,Y,72021.94,14978.88
New York City,Manhattan,7002054,001464,New York-Presbyterian Hospital - Columbia Presbyterian Center,70 or Older,109,F,White,Not Span/Hispanic,7,Urgent,Home or Self Care,2022,CIR003,Nonrheumatic and unspecified valve disorders,IMG008,ULTRASONOGRAPHY,200,CARDIAC STRUCTURAL AND VALVULAR DISORDERS,05,DISEASES AND DISORDERS OF THE CIRCULATORY SYSTEM,3,Major,Major,Medical,Medicare,Private Health Insurance,,,,N,98645.49,21238.49
New York City,Manhattan,7002001,001438,Bellevue Hospital Center,70 or Older,113,M,Other Race,Unknown,7,Urgent,Home or Self Care,2022,CIR003,Nonrheumatic and unspecified valve disorders,MAM004,CARDIAC STRESS TESTS,200,CARDIAC STRUCTURAL AND VALVULAR DISORDERS,05,DISEASES AND DISORDERS OF THE CIRCULATORY SYSTEM,2,Moderate,Major,Medical,Medicaid,,,,,N,51648.03,29701.96
New York City,Manhattan,7002001,001438,Bellevue Hospital Center,50 to 69,104,M,Other Race,Spanish/Hispanic,3,Urgent,Home or Self Care,2022,MAL001,Cardiac and circulatory congenital anomalies,MAM008,CARDIAC MONITORING,200,CARDIAC STRUCTURAL AND VALVULAR DISORDERS,05,DISEASES AND DISORDERS OF THE CIRCULATORY SYSTEM,2,Moderate,Minor,Medical,Medicaid,,,,,N,27914.92,16053.42
New York City,Manhattan,7002053,001463,NYU Langone Hospitals,70 or Older,100,F,White,Not Span/Hispanic,3,Elective,Home or Self Care,2022,CIR003,Nonrheumatic and unspecified valve disorders,,,200,CARDIAC STRUCTURAL AND VALVULAR DISORDERS,05,DISEASES AND DISORDERS OF THE CIRCULATORY SYSTEM,1,Minor,Minor,Medical,Medicare,Medicare,,,,N,64090.16,17805.38
New York City,Manhattan,7002054,001464,New York-Presbyterian Hospital - Columbia Presbyterian Center,70 or Older,105,M,White,Unknown,14,Urgent,Expired,2022,CIR001,Chronic rheumatic heart disease,URN006,BLADDER CATHETERIZATION AND DRAINAGE,200,CARDIAC STRUCTURAL AND VALVULAR DISORDERS,05,DISEASES AND DISORDERS OF THE CIRCULATORY SYSTEM,4,Extreme,Extreme,Medical,Medicare,,,,,N,343025.85,153094.52
New York City,Manhattan,7002054,001464,New York-Presbyterian Hospital - Columbia Presbyterian Center,0 to 17,OOS,M,Other Race,Not Span/Hispanic,27,Urgent,Short-term Hospital,2022,MAL001,Cardiac and circulatory congenital anomalies,ESA004,NON-INVASIVE VENTILATION,200,CARDIAC STRUCTURAL AND VALVULAR DISORDERS,05,DISEASES AND DISORDERS OF THE CIRCULATORY SYSTEM,3,Major,Moderate,Medical,Medicaid,,,01300,,N,762966.36,160622.28
New York City,Manhattan,7002054,001464,New York-Presbyterian Hospital - Columbia Presbyterian Center,70 or Older,105,F,White,Not Span/Hispanic,1,Urgent,Expired,2022,CIR001,Chronic rheumatic heart disease,CAR024,VENOUS AND ARTERIAL CATHETER PLACEMENT,200,CARDIAC STRUCTURAL AND VALVULAR DISORDERS,05,DISEASES AND DISORDERS OF THE CIRCULATORY SYSTEM,3,Major,Extreme,Medical,Medicare,Private Health Insurance,,,,N,46874.19,17575.77
New York City,Manhattan,7002001,001438,Bellevue Hospital Center,50 to 69,112,F,White,Unknown,13,Emergency,Home or Self Care,2022,CIR001,Chronic rheumatic heart disease,ADM015,ADMINISTRATION OF ANTIBIOTICS,200,CARDIAC STRUCTURAL AND VALVULAR DISORDERS,05,DISEASES AND DISORDERS OF THE CIRCULATORY SYSTEM,3,Major,Major,Medical,Medicaid,,,,,Y,99065.56,56971.02
New York City,Manhattan,7002001,001438,Bellevue Hospital Center,50 to 69,100,F,Other Race,Unknown,4,Elective,Home or Self Care,2022,CIR001,Chronic rheumatic heart disease,GIS001,ESOPHAGOGASTRODUODENOSCOPY (EGD) WITH BIOPSY,200,CARDIAC STRUCTURAL AND VALVULAR DISORDERS,05,DISEASES AND DISORDERS OF THE CIRCULATORY SYSTEM,2,Moderate,Moderate,Medical,Private Health Insurance,,,,,N,47230.04,27161.24
New York City,Manhattan,7002001,001438,Bellevue Hospital Center,70 or Older,100,F,White,Unknown,27,Emergency,Skilled Nursing Home,2022,CIR004,Endocarditis and endocardial disease,CAR024,VENOUS AND ARTERIAL CATHETER PLACEMENT,200,CARDIAC STRUCTURAL AND VALVULAR DISORDERS,05,DISEASES AND DISORDERS OF THE CIRCULATORY SYSTEM,4,Extreme,Major,Medical,Medicare,,,,,Y,236369.82,135932.50
New York City,Manhattan,7002053,001463,NYU Langone Hospitals,70 or Older,113,M,Other Race,Not Span/Hispanic,1,Elective,Home or Self Care,2022,CIR003,Nonrheumatic and unspecified valve disorders,,,200,CARDIAC STRUCTURAL AND VALVULAR DISORDERS,05,DISEASES AND DISORDERS OF THE CIRCULATORY SYSTEM,3,Major,Major,Medical,Medicare,Medicaid,,,,N,32823.51,7564.03
Long Island,Nassau,2951001,000541,North Shore University Hospital,70 or Older,116,M,White,Not Span/Hispanic,12,Urgent,Skilled Nursing Home,2022,CIR003,Nonrheumatic and unspecified valve disorders,,,200,CARDIAC STRUCTURAL AND VALVULAR DISORDERS,05,DISEASES AND DISORDERS OF THE CIRCULATORY SYSTEM,3,Major,Extreme,Medical,Medicare,Blue Cross/Blue Shield,,,,N,138049.36,23050.16
New York City,Manhattan,7002001,001438,Bellevue Hospital Center,50 to 69,104,M,White,Unknown,6,Urgent,Home or Self Care,2022,CIR003,Nonrheumatic and unspecified valve disorders,IMG008,ULTRASONOGRAPHY,200,CARDIAC STRUCTURAL AND VALVULAR DISORDERS,05,DISEASES AND DISORDERS OF THE CIRCULATORY SYSTEM,2,Moderate,Moderate,Medical,Private Health Insurance,,,,,N,49842.83,28663.81
New York City,Manhattan,7002001,001438,Bellevue Hospital Center,70 or Older,114,F,Other Race,Unknown,1,Urgent,Home w/ Home Health Services,2022,CIR003,Nonrheumatic and unspecified valve disorders,IMG008,ULTRASONOGRAPHY,200,CARDIAC STRUCTURAL AND VALVULAR DISORDERS,05,DISEASES AND DISORDERS OF THE CIRCULATORY SYSTEM,2,Moderate,Moderate,Medical,Medicare,Medicaid,,,,N,9896.48,5691.31
New York City,Manhattan,7002001,001438,Bellevue Hospital Center,70 or Older,100,F,Other Race,Spanish/Hispanic,7,Urgent,Home or Self Care,2022,CIR003,Nonrheumatic and unspecified valve disorders,ADM021,"ADMINISTRATION OF THERAPEUTIC SUBSTANCES, NEC",200,CARDIAC STRUCTURAL AND VALVULAR DISORDERS,05,DISEASES AND DISORDERS OF THE CIRCULATORY SYSTEM,2,Moderate,Minor,Medical,Medicare,Medicaid,,,,N,52745.01,30332.81
New York City,Manhattan,7002001,001438,Bellevue Hospital Center,50 to 69,104,M,Other Race,Spanish/Hispanic,3,Urgent,Short-term Hospital,2022,CIR003,Nonrheumatic and unspecified valve disorders,ADM021,"ADMINISTRATION OF THERAPEUTIC SUBSTANCES, NEC",200,CARDIAC STRUCTURAL AND VALVULAR DISORDERS,05,DISEASES AND DISORDERS OF THE CIRCULATORY SYSTEM,2,Moderate,Major,Medical,Medicaid,,,,,N,22407.12,12885.98
New York City,Manhattan,7002053,001463,NYU Langone Hospitals,70 or Older,100,M,White,Not Span/Hispanic,5,Emergency,Home w/ Home Health Services,2022,CIR003,Nonrheumatic and unspecified valve disorders,,,200,CARDIAC STRUCTURAL AND VALVULAR DISORDERS,05,DISEASES AND DISORDERS OF THE CIRCULATORY SYSTEM,3,Major,Major,Medical,Medicare,Medicare,,,,Y,106822.47,28126.25
New York City,Manhattan,7002054,001464,New York-Presbyterian Hospital - Columbia Presbyterian Center,50 to 69,,M,White,Unknown,9,Emergency,Home w/ Home Health Services,2022,CIR004,Endocarditis and endocardial disease,ADM015,ADMINISTRATION OF ANTIBIOTICS,200,CARDIAC STRUCTURAL AND VALVULAR DISORDERS,05,DISEASES AND DISORDERS OF THE CIRCULATORY SYSTEM,3,Major,Major,Medical,Private Health Insurance,,,,,Y,223352.06,96903.66
New York City,Manhattan,7002001,001438,Bellevue Hospital Center,70 or Older,,F,Multi-racial,Unknown,4,Urgent,Home or Self Care,2022,CIR003,Nonrheumatic and unspecified valve disorders,ADM021,"ADMINISTRATION OF THERAPEUTIC SUBSTANCES, NEC",200,CARDIAC STRUCTURAL AND VALVULAR DISORDERS,05,DISEASES AND DISORDERS OF THE CIRCULATORY SYSTEM,2,Moderate,Major,Medical,Medicare,Medicaid,,,,N,33396.76,19205.94
New York City,Manhattan,7002001,001438,Bellevue Hospital Center,70 or Older,112,F,Other Race,Unknown,27,Urgent,Home w/ Home Health Services,2022,CIR001,Chronic rheumatic heart disease,IMG008,ULTRASONOGRAPHY,200,CARDIAC STRUCTURAL AND VALVULAR DISORDERS,05,DISEASES AND DISORDERS OF THE CIRCULATORY SYSTEM,2,Moderate,Major,Medical,Medicare,Medicaid,,,,N,209823.58,120666.18
Hudson Valley,Dutchess,1302001,000181,Vassar Brothers Medical Center,70 or Older,125,M,White,Not Span/Hispanic,5,Emergency,Skilled Nursing Home,2022,CIR003,Nonrheumatic and unspecified valve disorders,,,200,CARDIAC STRUCTURAL AND VALVULAR DISORDERS,05,DISEASES AND DISORDERS OF THE CIRCULATORY SYSTEM,4,Extreme,Major,Medical,Private Health Insurance,,,,,Y,32069.87,10117.53
Western NY,Cattaraugus,0401001,000066,Olean General Hospital,70 or Older,147,F,White,Not Span/Hispanic,7,Emergency,Skilled Nursing Home,2022,CIR002,Acute rheumatic heart disease,,,200,CARDIAC STRUCTURAL AND VALVULAR DISORDERS,05,DISEASES AND DISORDERS OF THE CIRCULATORY SYSTEM,4,Extreme,Extreme,Medical,Medicare,,,,,Y,25631.67,9384.93
New York City,Manhattan,7002001,001438,Bellevue Hospital Center,70 or Older,113,M,White,Not Span/Hispanic,1,Elective,Home w/ Home Health Services,2022,CIR003,Nonrheumatic and unspecified valve disorders,ESA003,MECHANICAL VENTILATION,200,CARDIAC STRUCTURAL AND VALVULAR DISORDERS,05,DISEASES AND DISORDERS OF THE CIRCULATORY SYSTEM,2,Moderate,Major,Medical,Medicare,Medicaid,,,,N,12625.88,7260.94
New York City,Manhattan,7002001,001438,Bellevue Hospital Center,70 or Older,112,F,Other Race,Spanish/Hispanic,3,Elective,Home w/ Home Health Services,2022,CIR003,Nonrheumatic and unspecified valve disorders,ADM021,"ADMINISTRATION OF THERAPEUTIC SUBSTANCES, NEC",200,CARDIAC STRUCTURAL AND VALVULAR DISORDERS,05,DISEASES AND DISORDERS OF THE CIRCULATORY SYSTEM,1,Minor,Minor,Medical,Medicare,Medicaid,,,,N,20099.79,11559.07
New York City,Manhattan,7002001,001438,Bellevue Hospital Center,30 to 49,112,F,White,Unknown,1,Emergency,Left Against Medical Advice,2022,CIR001,Chronic rheumatic heart disease,ADM015,ADMINISTRATION OF ANTIBIOTICS,200,CARDIAC STRUCTURAL AND VALVULAR DISORDERS,05,DISEASES AND DISORDERS OF THE CIRCULATORY SYSTEM,1,Minor,Moderate,Medical,Medicare,Medicaid,,,,Y,13756.93,7911.39
New York City,Manhattan,7002001,001438,Bellevue Hospital Center,30 to 49,112,F,White,Unknown,1,Emergency,Left Against Medical Advice,2022,CIR001,Chronic rheumatic heart disease,ADM015,ADMINISTRATION OF ANTIBIOTICS,200,CARDIAC STRUCTURAL AND VALVULAR DISORDERS,05,DISEASES AND DISORDERS OF THE CIRCULATORY SYSTEM,3,Major,Moderate,Medical,Medicare,Medicaid,,,,Y,9739.95,5601.29
New York City,Manhattan,7002001,001438,Bellevue Hospital Center,50 to 69,112,F,Black/African American,Unknown,7,Urgent,Home or Self Care,2022,CIR001,Chronic rheumatic heart disease,IMG006,COMPUTERIZED TOMOGRAPHY (CT) WITH CONTRAST,200,CARDIAC STRUCTURAL AND VALVULAR DISORDERS,05,DISEASES AND DISORDERS OF THE CIRCULATORY SYSTEM,3,Major,Major,Medical,Private Health Insurance,,,,,N,61501.80,35368.70
Finger Lakes,Monroe,2701005,000413,Strong Memorial Hospital,70 or Older,144,F,White,Not Span/Hispanic,1,Emergency,Hospice - Home,2022,CIR001,Chronic rheumatic heart disease,,,200,CARDIAC STRUCTURAL AND VALVULAR DISORDERS,05,DISEASES AND DISORDERS OF THE CIRCULATORY SYSTEM,2,Moderate,Major,Medical,Medicare,Blue Cross/Blue Shield,,,,Y,15639.25,5324.87
Capital/Adirond,Warren,5601000,001005,Glens Falls Hospital,70 or Older,128,F,White,Not Span/Hispanic,3,Emergency,Skilled Nursing Home,2022,CIR001,Chronic rheumatic heart disease,,,200,CARDIAC STRUCTURAL AND VALVULAR DISORDERS,05,DISEASES AND DISORDERS OF THE CIRCULATORY SYSTEM,3,Major,Major,Medical,Medicare,Blue Cross/Blue Shield,,,,Y,13065.46,4370.13
Capital/Adirond,Warren,5601000,001005,Glens Falls Hospital,50 to 69,128,F,White,Not Span/Hispanic,5,Emergency,Short-term Hospital,2022,CIR003,Nonrheumatic and unspecified valve disorders,,,200,CARDIAC STRUCTURAL AND VALVULAR DISORDERS,05,DISEASES AND DISORDERS OF THE CIRCULATORY SYSTEM,3,Major,Moderate,Medical,Medicare,,,,,Y,22233.97,6995.86
New York City,Manhattan,7002001,001438,Bellevue Hospital Center,70 or Older,,F,Black/African American,Unknown,1,Elective,Home or Self Care,2022,CIR003,Nonrheumatic and unspecified valve disorders,ADM021,"ADMINISTRATION OF THERAPEUTIC SUBSTANCES, NEC",200,CARDIAC STRUCTURAL AND VALVULAR DISORDERS,05,DISEASES AND DISORDERS OF THE CIRCULATORY SYSTEM,3,Major,Extreme,Medical,Medicare,,,,,N,8039.37,4623.31
Long Island,Nassau,2951001,000541,North Shore University Hospital,70 or Older,110,M,White,Spanish/Hispanic,1,Emergency,Left Against Medical Advice,2022,CIR003,Nonrheumatic and unspecified valve disorders,,,200,CARDIAC STRUCTURAL AND VALVULAR DISORDERS,05,DISEASES AND DISORDERS OF THE CIRCULATORY SYSTEM,2,Moderate,Moderate,Medical,Medicare,Blue Cross/Blue Shield,,,,Y,17972.00,2823.37
Long Island,Nassau,2951001,000541,North Shore University Hospital,50 to 69,115,M,Other Race,Spanish/Hispanic,1,Urgent,Home or Self Care,2022,CIR003,Nonrheumatic and unspecified valve disorders,,,200,CARDIAC STRUCTURAL AND VALVULAR DISORDERS,05,DISEASES AND DISORDERS OF THE CIRCULATORY SYSTEM,1,Minor,Minor,Medical,Medicare,Medicare,,,,N,29513.10,3870.35
Long Island,Nassau,2951001,000541,North Shore University Hospital,50 to 69,114,M,White,Spanish/Hispanic,4,Emergency,Home or Self Care,2022,MAL001,Cardiac and circulatory congenital anomalies,,,200,CARDIAC STRUCTURAL AND VALVULAR DISORDERS,05,DISEASES AND DISORDERS OF THE CIRCULATORY SYSTEM,2,Moderate,Minor,Medical,Medicaid,Medicaid,,,,Y,72756.36,10166.77
Long Island,Nassau,2951001,000541,North Shore University Hospital,70 or Older,113,F,White,Not Span/Hispanic,17,Emergency,Skilled Nursing Home,2022,CIR003,Nonrheumatic and unspecified valve disorders,ESA004,NON-INVASIVE VENTILATION,200,CARDIAC STRUCTURAL AND VALVULAR DISORDERS,05,DISEASES AND DISORDERS OF THE CIRCULATORY SYSTEM,4,Extreme,Extreme,Medical,Medicare,Medicare,,,,Y,242794.03,42800.97
Long Island,Nassau,2951001,000541,North Shore University Hospital,70 or Older,115,F,White,Not Span/Hispanic,8,Emergency,Home w/ Home Health Services,2022,CIR003,Nonrheumatic and unspecified valve disorders,MAM006,PACEMAKER AND DEFIBRILLATOR INTERROGATION,200,CARDIAC STRUCTURAL AND VALVULAR DISORDERS,05,DISEASES AND DISORDERS OF THE CIRCULATORY SYSTEM,3,Major,Major,Medical,Medicare,Blue Cross/Blue Shield,,,,Y,106786.55,17395.60
Long Island,Nassau,2951001,000541,North Shore University Hospital,70 or Older,110,M,White,Not Span/Hispanic,2,Emergency,Home w/ Home Health Services,2022,CIR003,Nonrheumatic and unspecified valve disorders,,,200,CARDIAC STRUCTURAL AND VALVULAR DISORDERS,05,DISEASES AND DISORDERS OF THE CIRCULATORY SYSTEM,2,Moderate,Moderate,Medical,Medicare,Blue Cross/Blue Shield,,,,Y,33660.54,5619.90
Long Island,Nassau,2951001,000541,North Shore University Hospital,70 or Older,115,F,White,Not Span/Hispanic,9,Urgent,Skilled Nursing Home,2022,CIR003,Nonrheumatic and unspecified valve disorders,ESA004,NON-INVASIVE VENTILATION,200,CARDIAC STRUCTURAL AND VALVULAR DISORDERS,05,DISEASES AND DISORDERS OF THE CIRCULATORY SYSTEM,4,Extreme,Major,Medical,Medicare,Medicare,,,,N,118547.43,18939.11
Long Island,Nassau,2951001,000541,North Shore University Hospital,70 or Older,114,F,Black/African American,Not Span/Hispanic,14,Urgent,Home w/ Home Health Services,2022,CIR003,Nonrheumatic and unspecified valve disorders,,,200,CARDIAC STRUCTURAL AND VALVULAR DISORDERS,05,DISEASES AND DISORDERS OF THE CIRCULATORY SYSTEM,2,Moderate,Moderate,Medical,Medicare,,,,,N,162071.15,26795.49
New York City,Manhattan,7002001,001438,Bellevue Hospital Center,30 to 49,113,F,Other Race,Spanish/Hispanic,3,Urgent,Home or Self Care,2022,MAL001,Cardiac and circulatory congenital anomalies,ADM021,"ADMINISTRATION OF THERAPEUTIC SUBSTANCES, NEC",200,CARDIAC STRUCTURAL AND VALVULAR DISORDERS,05,DISEASES AND DISORDERS OF THE CIRCULATORY SYSTEM,4,Extreme,Major,Medical,Medicaid,,,,,N,20196.51,11614.69
New York City,Manhattan,7002001,001438,Bellevue Hospital Center,70 or Older,112,F,Black/African American,Unknown,13,Urgent,Home or Self Care,2022,CIR003,Nonrheumatic and unspecified valve disorders,IMG008,ULTRASONOGRAPHY,200,CARDIAC STRUCTURAL AND VALVULAR DISORDERS,05,DISEASES AND DISORDERS OF THE CIRCULATORY SYSTEM,2,Moderate,Moderate,Medical,Medicare,Medicaid,,,,N,93268.13,53637.01
New York City,Manhattan,7002001,001438,Bellevue Hospital Center,50 to 69,114,F,Other Race,Unknown,2,Urgent,Home or Self Care,2022,CIR003,Nonrheumatic and unspecified valve disorders,ADM021,"ADMINISTRATION OF THERAPEUTIC SUBSTANCES, NEC",200,CARDIAC STRUCTURAL AND VALVULAR DISORDERS,05,DISEASES AND DISORDERS OF THE CIRCULATORY SYSTEM,2,Moderate,Moderate,Medical,Medicaid,,,,,N,18443.62,10606.63
New York City,Manhattan,7002001,001438,Bellevue Hospital Center,70 or Older,112,F,White,Not Span/Hispanic,18,Urgent,Short-term Hospital,2022,CIR001,Chronic rheumatic heart disease,ADM021,"ADMINISTRATION OF THERAPEUTIC SUBSTANCES, NEC",200,CARDIAC STRUCTURAL AND VALVULAR DISORDERS,05,DISEASES AND DISORDERS OF THE CIRCULATORY SYSTEM,4,Extreme,Extreme,Medical,Medicare,Medicaid,,,,N,137916.99,79313.85
New York City,Manhattan,7002054,001464,New York-Presbyterian Hospital - Columbia Presbyterian Center,30 to 49,,F,Other Race,Unknown,3,Emergency,Home or Self Care,2022,CIR003,Nonrheumatic and unspecified valve disorders,ENT001,LARYNGOSCOPY (DIAGNOSTIC),200,CARDIAC STRUCTURAL AND VALVULAR DISORDERS,05,DISEASES AND DISORDERS OF THE CIRCULATORY SYSTEM,2,Moderate,Moderate,Medical,Private Health Insurance,,,,,Y,75906.36,26856.88