Hospital Service Area,Hospital County,Operating Certificate Number,Permanent Facility Id,Facility Name,Age Group,Zip Code - 3 digits,Gender,Race,Ethnicity,Length of Stay,Type of Admission,Patient Disposition,Discharge Year,CCS Diagnosis Code,CCS Diagnosis Description,CCS Procedure Code,CCS Procedure Description,APR DRG Code,APR DRG Description,APR MDC Code,APR MDC Description,APR Severity of Illness Code,APR Severity of Illness Description,APR Risk of Mortality,APR Medical Surgical Description,Payment Typology 1,Payment Typology 2,Payment Typology 3,Birth Weight,Abortion Edit Indicator,Emergency Department Indicator,Total Charges,Total Costs
New York City,Manhattan,7002054,001464,New York-Presbyterian Hospital - Columbia Presbyterian Center,30 to 49,113,M,White,Not Span/Hispanic,1,Emergency,Home or Self Care,2022,CIR017,Cardiac dysrhythmias,ADM021,"ADMINISTRATION OF THERAPEUTIC SUBSTANCES, NEC",201,CARDIAC ARRHYTHMIA AND CONDUCTION DISORDERS,05,DISEASES AND DISORDERS OF THE CIRCULATORY SYSTEM,2,Moderate,Moderate,Medical,Private Health Insurance,,,,,Y,22474.94,4916.18
New York City,Manhattan,7002054,001464,New York-Presbyterian Hospital - Columbia Presbyterian Center,70 or Older,100,F,Other Race,Unknown,2,Emergency,Home or Self Care,2022,CIR017,Cardiac dysrhythmias,IMG008,ULTRASONOGRAPHY,201,CARDIAC ARRHYTHMIA AND CONDUCTION DISORDERS,05,DISEASES AND DISORDERS OF THE CIRCULATORY SYSTEM,1,Minor,Minor,Medical,Medicare,,,,,Y,43752.71,14711.86
New York City,Manhattan,7002054,001464,New York-Presbyterian Hospital - Columbia Presbyterian Center,50 to 69,117,M,White,Not Span/Hispanic,1,Urgent,Home or Self Care,2022,CIR017,Cardiac dysrhythmias,ESA006,CARDIOVERSION,201,CARDIAC ARRHYTHMIA AND CONDUCTION DISORDERS,05,DISEASES AND DISORDERS OF THE CIRCULATORY SYSTEM,3,Major,Major,Medical,Private Health Insurance,,,,,N,31948.25,13644.41
New York City,Manhattan,7002054,001464,New York-Presbyterian Hospital - Columbia Presbyterian Center,18 to 29,104,M,Other Race,Spanish/Hispanic,1,Emergency,Home or Self Care,2022,CIR017,Cardiac dysrhythmias,MAM006,PACEMAKER AND DEFIBRILLATOR INTERROGATION,201,CARDIAC ARRHYTHMIA AND CONDUCTION DISORDERS,05,DISEASES AND DISORDERS OF THE CIRCULATORY SYSTEM,3,Major,Major,Medical,Medicaid,,,,,Y,33792.88,12262.33
New York City,Manhattan,7002001,001438,Bellevue Hospital Center,50 to 69,100,F,Other Race,Unknown,2,Emergency,Left Against Medical Advice,2022,CIR017,Cardiac dysrhythmias,MAM006,PACEMAKER AND DEFIBRILLATOR INTERROGATION,201,CARDIAC ARRHYTHMIA AND CONDUCTION DISORDERS,05,DISEASES AND DISORDERS OF THE CIRCULATORY SYSTEM,2,Moderate,Major,Medical,Medicare,Medicare,,,,Y,17449.97,10035.20
New York City,Manhattan,7002001,001438,Bellevue Hospital Center,50 to 69,114,M,Black/African American,Not Span/Hispanic,11,Urgent,Home or Self Care,2022,CIR016,Conduction disorders,IMG008,ULTRASONOGRAPHY,201,CARDIAC ARRHYTHMIA AND CONDUCTION DISORDERS,05,DISEASES AND DISORDERS OF THE CIRCULATORY SYSTEM,3,Major,Major,Medical,Medicare,Private Health Insurance,,,,N,90666.19,52140.68
New York City,Manhattan,7002001,001438,Bellevue Hospital Center,70 or Older,100,F,White,Not Span/Hispanic,2,Emergency,Home or Self Care,2022,CIR017,Cardiac dysrhythmias,ADM019,POTENTIAL COVID-19 THERAPIES,201,CARDIAC ARRHYTHMIA AND CONDUCTION DISORDERS,05,DISEASES AND DISORDERS OF THE CIRCULATORY SYSTEM,2,Moderate,Moderate,Medical,Medicare,Medicaid,,,,Y,32359.94,18609.68
New York City,Manhattan,7002001,001438,Bellevue Hospital Center,50 to 69,100,F,Black/African American,Unknown,5,Emergency,Home w/ Home Health Services,2022,CIR017,Cardiac dysrhythmias,IMG008,ULTRASONOGRAPHY,201,CARDIAC ARRHYTHMIA AND CONDUCTION DISORDERS,05,DISEASES AND DISORDERS OF THE CIRCULATORY SYSTEM,2,Moderate,Major,Medical,Private Health Insurance,,,,,Y,48891.23,28116.56
New York City,Manhattan,7002001,001438,Bellevue Hospital Center,70 or Older,100,F,White,Unknown,5,Emergency,Home w/ Home Health Services,2022,SYM012,Circulatory signs and symptoms,ADM021,"ADMINISTRATION OF THERAPEUTIC SUBSTANCES, NEC",201,CARDIAC ARRHYTHMIA AND CONDUCTION DISORDERS,05,DISEASES AND DISORDERS OF THE CIRCULATORY SYSTEM,3,Major,Extreme,Medical,Medicare,Medicare,,,,Y,37309.20,21455.92
New York City,Manhattan,7002054,001464,New York-Presbyterian Hospital - Columbia Presbyterian Center,50 to 69,100,F,Other Race,Spanish/Hispanic,3,Emergency,Home or Self Care,2022,CIR017,Cardiac dysrhythmias,,,201,CARDIAC ARRHYTHMIA AND CONDUCTION DISORDERS,05,DISEASES AND DISORDERS OF THE CIRCULATORY SYSTEM,2,Moderate,Moderate,Medical,Medicaid,,,,,Y,49638.28,10764.47
New York City,Manhattan,7002054,001464,New York-Presbyterian Hospital - Columbia Presbyterian Center,50 to 69,100,M,Black/African American,Spanish/Hispanic,2,Emergency,Home or Self Care,2022,CIR017,Cardiac dysrhythmias,OTR004,ISOLATION PROCEDURES,201,CARDIAC ARRHYTHMIA AND CONDUCTION DISORDERS,05,DISEASES AND DISORDERS OF THE CIRCULATORY SYSTEM,3,Major,Major,Medical,Medicare,,,,,Y,50704.61,10969.07
New York City,Manhattan,7002054,001464,New York-Presbyterian Hospital - Columbia Presbyterian Center,50 to 69,100,F,Black/African American,Not Span/Hispanic,4,Emergency,Home or Self Care,2022,CIR017,Cardiac dysrhythmias,ESA004,NON-INVASIVE VENTILATION,201,CARDIAC ARRHYTHMIA AND CONDUCTION DISORDERS,05,DISEASES AND DISORDERS OF THE CIRCULATORY SYSTEM,2,Moderate,Minor,Medical,Medicaid,,,,,Y,93694.59,35808.49
New York City,Manhattan,7002054,001464,New York-Presbyterian Hospital - Columbia Presbyterian Center,50 to 69,100,F,Other Race,Spanish/Hispanic,7,Emergency,Home w/ Home Health Services,2022,CIR017,Cardiac dysrhythmias,MST028,"SUBCUTANEOUS TISSUE AND FASCIA PROCEDURES, NEC",201,CARDIAC ARRHYTHMIA AND CONDUCTION DISORDERS,05,DISEASES AND DISORDERS OF THE CIRCULATORY SYSTEM,2,Moderate,Moderate,Medical,Medicare,Medicaid,,,,Y,167232.28,45520.35
New York City,Manhattan,7002054,001464,New York-Presbyterian Hospital - Columbia Presbyterian Center,0 to 17,OOS,M,White,Not Span/Hispanic,14,Urgent,Home or Self Care,2022,CIR017,Cardiac dysrhythmias,ESA004,NON-INVASIVE VENTILATION,201,CARDIAC ARRHYTHMIA AND CONDUCTION DISORDERS,05,DISEASES AND DISORDERS OF THE CIRCULATORY SYSTEM,3,Major,Moderate,Medical,Medicaid,,,03400,,N,326127.02,138114.17
New York City,Manhattan,7002054,001464,New York-Presbyterian Hospital - Columbia Presbyterian Center,50 to 69,109,M,White,Not Span/Hispanic,2,Emergency,Home or Self Care,2022,CIR017,Cardiac dysrhythmias,ADM021,"ADMINISTRATION OF THERAPEUTIC SUBSTANCES, NEC",201,CARDIAC ARRHYTHMIA AND CONDUCTION DISORDERS,05,DISEASES AND DISORDERS OF THE CIRCULATORY SYSTEM,3,Major,Major,Medical,Private Health Insurance,,,,,Y,48415.61,
New York City,Manhattan,7002054,001464,New York-Presbyterian Hospital - Columbia Presbyterian Center,50 to 69,100,M,Other Race,Spanish/Hispanic,2,Emergency,Home or Self Care,2022,CIR017,Cardiac dysrhythmias,,,201,CARDIAC ARRHYTHMIA AND CONDUCTION DISORDERS,05,DISEASES AND DISORDERS OF THE CIRCULATORY SYSTEM,1,Minor,Minor,Medical,Medicaid,,,,,Y,33907.75,7340.91
New York City,Manhattan,7002054,001464,New York-Presbyterian Hospital - Columbia Presbyterian Center,70 or Older,100,F,Other Race,Not Span/Hispanic,12,Emergency,Skilled Nursing Home,2022,CIR017,Cardiac dysrhythmias,,,201,CARDIAC ARRHYTHMIA AND CONDUCTION DISORDERS,05,DISEASES AND DISORDERS OF THE CIRCULATORY SYSTEM,3,Major,Major,Medical,Medicare,,,,,Y,163325.31,35700.98
New York City,Manhattan,7002054,001464,New York-Presbyterian Hospital - Columbia Presbyterian Center,70 or Older,104,M,White,Spanish/Hispanic,2,Emergency,Home or Self Care,2022,CIR017,Cardiac dysrhythmias,,,201,CARDIAC ARRHYTHMIA AND CONDUCTION DISORDERS,05,DISEASES AND DISORDERS OF THE CIRCULATORY SYSTEM,3,Major,Major,Medical,Medicare,,,,,Y,52616.69,10875.93
New York City,Manhattan,7002054,001464,New York-Presbyterian Hospital - Columbia Presbyterian Center,50 to 69,100,M,Other Race,Not Span/Hispanic,1,Emergency,Home or Self Care,2022,CIR017,Cardiac dysrhythmias,,,201,CARDIAC ARRHYTHMIA AND CONDUCTION DISORDERS,05,DISEASES AND DISORDERS OF THE CIRCULATORY SYSTEM,1,Minor,Minor,Medical,Medicaid,,,,,Y,28972.22,11590.38
New York City,Manhattan,7002054,001464,New York-Presbyterian Hospital - Columbia Presbyterian Center,50 to 69,100,F,Black/African American,Not Span/Hispanic,3,Emergency,Home or Self Care,2022,CIR017,Cardiac dysrhythmias,OTR004,ISOLATION PROCEDURES,201,CARDIAC ARRHYTHMIA AND CONDUCTION DISORDERS,05,DISEASES AND DISORDERS OF THE CIRCULATORY SYSTEM,3,Major,Moderate,Medical,Medicaid,,,,,Y,71618.45,30822.26
New York City,Manhattan,7002054,001464,New York-Presbyterian Hospital - Columbia Presbyterian Center,30 to 49,104,M,Other Race,Unknown,5,Emergency,Home or Self Care,2022,CIR017,Cardiac dysrhythmias,ESA006,CARDIOVERSION,201,CARDIAC ARRHYTHMIA AND CONDUCTION DISORDERS,05,DISEASES AND DISORDERS OF THE CIRCULATORY SYSTEM,2,Moderate,Moderate,Medical,Medicaid,,,,,Y,124641.20,54483.03
New York City,Manhattan,7002001,001438,Bellevue Hospital Center,18 to 29,114,M,Multi-racial,Not Span/Hispanic,1,Emergency,Home or Self Care,2022,SYM012,Circulatory signs and symptoms,MAM008,CARDIAC MONITORING,201,CARDIAC ARRHYTHMIA AND CONDUCTION DISORDERS,05,DISEASES AND DISORDERS OF THE CIRCULATORY SYSTEM,1,Minor,Minor,Medical,Medicaid,,,,,Y,11151.50,6413.05
New York City,Manhattan,7002001,001438,Bellevue Hospital Center,50 to 69,112,M,Other Race,Spanish/Hispanic,4,Emergency,Left Against Medical Advice,2022,CIR017,Cardiac dysrhythmias,ADM019,POTENTIAL COVID-19 THERAPIES,201,CARDIAC ARRHYTHMIA AND CONDUCTION DISORDERS,05,DISEASES AND DISORDERS OF THE CIRCULATORY SYSTEM,3,Major,Major,Medical,Medicare,Medicaid,,,,Y,40678.06,23393.30
New York City,Manhattan,7002054,001464,New York-Presbyterian Hospital - Columbia Presbyterian Center,30 to 49,100,F,Other Race,Spanish/Hispanic,1,Emergency,Home or Self Care,2022,SYM012,Circulatory signs and symptoms,,,201,CARDIAC ARRHYTHMIA AND CONDUCTION DISORDERS,05,DISEASES AND DISORDERS OF THE CIRCULATORY SYSTEM,1,Minor,Minor,Medical,Medicaid,,,,,Y,30092.60,6600.08
New York City,Manhattan,7002001,001438,Bellevue Hospital Center,70 or Older,112,F,Other Race,Spanish/Hispanic,3,Emergency,Home or Self Care,2022,CIR016,Conduction disorders,,,201,CARDIAC ARRHYTHMIA AND CONDUCTION DISORDERS,05,DISEASES AND DISORDERS OF THE CIRCULATORY SYSTEM,3,Major,Moderate,Medical,Medicare,Medicaid,,,,Y,26135.04,15029.84
New York City,Manhattan,7002001,001438,Bellevue Hospital Center,50 to 69,113,M,White,Unknown,3,Emergency,Home or Self Care,2022,CIR016,Conduction disorders,IMG008,ULTRASONOGRAPHY,201,CARDIAC ARRHYTHMIA AND CONDUCTION DISORDERS,05,DISEASES AND DISORDERS OF THE CIRCULATORY SYSTEM,3,Major,Moderate,Medical,Medicaid,,,,,Y,26897.27,15468.19
New York City,Manhattan,7002054,001464,New York-Presbyterian Hospital - Columbia Presbyterian Center,0 to 17,OOS,M,Other Race,Not Span/Hispanic,6,Urgent,Home or Self Care,2022,CIR017,Cardiac dysrhythmias,RES007,AIRWAY INTUBATION,201,CARDIAC ARRHYTHMIA AND CONDUCTION DISORDERS,05,DISEASES AND DISORDERS OF THE CIRCULATORY SYSTEM,4,Extreme,Major,Medical,Private Health Insurance,,,,,N,198702.63,84799.80
New York City,Manhattan,7002054,001464,New York-Presbyterian Hospital - Columbia Presbyterian Center,50 to 69,107,M,Black/African American,Not Span/Hispanic,4,Emergency,Home or Self Care,2022,CIR017,Cardiac dysrhythmias,,,201,CARDIAC ARRHYTHMIA AND CONDUCTION DISORDERS,05,DISEASES AND DISORDERS OF THE CIRCULATORY SYSTEM,2,Moderate,Moderate,Medical,Medicare,Medicaid,,,,Y,62879.79,13922.53
New York City,Manhattan,7002054,001464,New York-Presbyterian Hospital - Columbia Presbyterian Center,70 or Older,100,F,Other Race,Spanish/Hispanic,5,Emergency,Home w/ Home Health Services,2022,CIR017,Cardiac dysrhythmias,ESA001,HEMODIALYSIS,201,CARDIAC ARRHYTHMIA AND CONDUCTION DISORDERS,05,DISEASES AND DISORDERS OF THE CIRCULATORY SYSTEM,3,Major,Major,Medical,Medicare,Medicaid,,,,Y,92202.23,20217.26
New York City,Manhattan,7002054,001464,New York-Presbyterian Hospital - Columbia Presbyterian Center,50 to 69,100,M,Black/African American,Not Span/Hispanic,8,Emergency,Home or Self Care,2022,CIR017,Cardiac dysrhythmias,MAM006,PACEMAKER AND DEFIBRILLATOR INTERROGATION,201,CARDIAC ARRHYTHMIA AND CONDUCTION DISORDERS,05,DISEASES AND DISORDERS OF THE CIRCULATORY SYSTEM,3,Major,Major,Medical,Medicaid,,,,,Y,132203.05,30047.04
New York City,Manhattan,7002054,001464,New York-Presbyterian Hospital - Columbia Presbyterian Center,70 or Older,100,M,Other Race,Spanish/Hispanic,2,Emergency,Hospice - Home,2022,CIR017,Cardiac dysrhythmias,ADM021,"ADMINISTRATION OF THERAPEUTIC SUBSTANCES, NEC",201,CARDIAC ARRHYTHMIA AND CONDUCTION DISORDERS,05,DISEASES AND DISORDERS OF THE CIRCULATORY SYSTEM,2,Moderate,Major,Medical,Medicaid,,,,,Y,39261.47,8384.55
New York City,Manhattan,7002054,001464,New York-Presbyterian Hospital - Columbia Presbyterian Center,70 or Older,100,F,Black/African American,Not Span/Hispanic,2,Emergency,Left Against Medical Advice,2022,CIR017,Cardiac dysrhythmias,,,201,CARDIAC ARRHYTHMIA AND CONDUCTION DISORDERS,05,DISEASES AND DISORDERS OF THE CIRCULATORY SYSTEM,2,Moderate,Minor,Medical,Medicare,Medicaid,,,,Y,33274.28,7196.29
New York City,Manhattan,7002001,001438,Bellevue Hospital Center,30 to 49,114,F,Other Race,Not Span/Hispanic,1,Urgent,Home or Self Care,2022,SYM012,Circulatory signs and symptoms,ADM021,"ADMINISTRATION OF THERAPEUTIC SUBSTANCES, NEC",201,CARDIAC ARRHYTHMIA AND CONDUCTION DISORDERS,05,DISEASES AND DISORDERS OF THE CIRCULATORY SYSTEM,1,Minor,Minor,Medical,Medicaid,,,,,N,6544.52,3763.65
New York City,Manhattan,7002053,001463,NYU Langone Hospitals,70 or Older,112,F,Other Race,Not Span/Hispanic,5,Emergency,Home w/ Home Health Services,2022,CIR017,Cardiac dysrhythmias,,,201,CARDIAC ARRHYTHMIA AND CONDUCTION DISORDERS,05,DISEASES AND DISORDERS OF THE CIRCULATORY SYSTEM,3,Major,Extreme,Medical,Medicare,Medicaid,,,,Y,78390.02,26620.31
New York City,Manhattan,7002053,001463,NYU Langone Hospitals,70 or Older,112,M,White,Not Span/Hispanic,5,Emergency,Home or Self Care,2022,CIR017,Cardiac dysrhythmias,,,201,CARDIAC ARRHYTHMIA AND CONDUCTION DISORDERS,05,DISEASES AND DISORDERS OF THE CIRCULATORY SYSTEM,3,Major,Major,Medical,Medicare,Blue Cross/Blue Shield,,,,Y,75931.62,25614.36
New York City,Manhattan,7002053,001463,NYU Langone Hospitals,70 or Older,100,M,White,Not Span/Hispanic,1,Emergency,Home or Self Care,2022,CIR017,Cardiac dysrhythmias,ADM019,POTENTIAL COVID-19 THERAPIES,201,CARDIAC ARRHYTHMIA AND CONDUCTION DISORDERS,05,DISEASES AND DISORDERS OF THE CIRCULATORY SYSTEM,3,Major,Moderate,Medical,Medicare,Blue Cross/Blue Shield,,,,Y,23823.88,6482.98
New York City,Manhattan,7002001,001438,Bellevue Hospital Center,50 to 69,114,F,Black/African American,Unknown,2,Urgent,Home or Self Care,2022,CIR017,Cardiac dysrhythmias,ADM021,"ADMINISTRATION OF THERAPEUTIC SUBSTANCES, NEC",201,CARDIAC ARRHYTHMIA AND CONDUCTION DISORDERS,05,DISEASES AND DISORDERS OF THE CIRCULATORY SYSTEM,2,Moderate,Moderate,Medical,Medicaid,,,,,N,14335.79,8244.28
New York City,Manhattan,7002001,001438,Bellevue Hospital Center,50 to 69,OOS,F,Other Race,Unknown,2,Emergency,Home or Self Care,2022,CIR017,Cardiac dysrhythmias,MAM007,ELECTROCARDIOGRAM (ECG),201,CARDIAC ARRHYTHMIA AND CONDUCTION DISORDERS,05,DISEASES AND DISORDERS OF THE CIRCULATORY SYSTEM,2,Moderate,Major,Medical,Private Health Insurance,,,,,Y,17851.62,10266.18
New York City,Manhattan,7002054,001464,New York-Presbyterian Hospital - Columbia Presbyterian Center,50 to 69,104,F,Black/African American,Not Span/Hispanic,3,Emergency,Home or Self Care,2022,CIR017,Cardiac dysrhythmias,ADM021,"ADMINISTRATION OF THERAPEUTIC SUBSTANCES, NEC",201,CARDIAC ARRHYTHMIA AND CONDUCTION DISORDERS,05,DISEASES AND DISORDERS OF THE CIRCULATORY SYSTEM,2,Moderate,Moderate,Medical,Medicare,,,,,Y,51840.98,11102.37
New York City,Manhattan,7002001,001438,Bellevue Hospital Center,50 to 69,113,M,Other Race,Not Span/Hispanic,2,Emergency,Home or Self Care,2022,CIR017,Cardiac dysrhythmias,ADM021,"ADMINISTRATION OF THERAPEUTIC SUBSTANCES, NEC",201,CARDIAC ARRHYTHMIA AND CONDUCTION DISORDERS,05,DISEASES AND DISORDERS OF THE CIRCULATORY SYSTEM,2,Moderate,Moderate,Medical,Medicaid,,,,,Y,20852.96,11992.20
New York City,Manhattan,7002001,001438,Bellevue Hospital Center,50 to 69,112,M,White,Not Span/Hispanic,7,Urgent,Home or Self Care,2022,CIR017,Cardiac dysrhythmias,ADM021,"ADMINISTRATION OF THERAPEUTIC SUBSTANCES, NEC",201,CARDIAC ARRHYTHMIA AND CONDUCTION DISORDERS,05,DISEASES AND DISORDERS OF THE CIRCULATORY SYSTEM,3,Major,Major,Medical,Medicaid,,,,,N,45088.26,25929.54
New York City,Manhattan,7002001,001438,Bellevue Hospital Center,30 to 49,112,F,White,Not Span/Hispanic,1,Emergency,Home or Self Care,2022,CIR017,Cardiac dysrhythmias,CNS002,LUMBAR PUNCTURE,201,CARDIAC ARRHYTHMIA AND CONDUCTION DISORDERS,05,DISEASES AND DISORDERS OF THE CIRCULATORY SYSTEM,3,Major,Major,Medical,Private Health Insurance,,,,,Y,20178.24,11604.18
New York City,Manhattan,7002054,001464,New York-Presbyterian Hospital - Columbia Presbyterian Center,70 or Older,100,F,Other Race,Spanish/Hispanic,7,Emergency,Home or Self Care,2022,CIR017,Cardiac dysrhythmias,ADM017,ADMINISTRATION OF NUTRITIONAL AND ELECTROLYTIC SUBSTANCES,201,CARDIAC ARRHYTHMIA AND CONDUCTION DISORDERS,05,DISEASES AND DISORDERS OF THE CIRCULATORY SYSTEM,2,Moderate,Moderate,Medical,Medicare,Medicaid,,,,Y,105206.41,22646.29
New York City,Manhattan,7002054,001464,New York-Presbyterian Hospital - Columbia Presbyterian Center,50 to 69,100,M,Other Race,Spanish/Hispanic,1,Emergency,Home or Self Care,2022,CIR017,Cardiac dysrhythmias,MAM006,PACEMAKER AND DEFIBRILLATOR INTERROGATION,201,CARDIAC ARRHYTHMIA AND CONDUCTION DISORDERS,05,DISEASES AND DISORDERS OF THE CIRCULATORY SYSTEM,2,Moderate,Major,Medical,Medicare,Medicaid,,,,Y,28925.74,6126.50
New York City,Manhattan,7002053,001463,NYU Langone Hospitals,70 or Older,113,M,Other Race,Not Span/Hispanic,1,Emergency,Left Against Medical Advice,2022,CIR017,Cardiac dysrhythmias,,,201,CARDIAC ARRHYTHMIA AND CONDUCTION DISORDERS,05,DISEASES AND DISORDERS OF THE CIRCULATORY SYSTEM,3,Major,Major,Medical,Medicare,Medicaid,,,,Y,20644.93,6180.19
New York City,Manhattan,7002053,001463,NYU Langone Hospitals,30 to 49,113,M,Other Race,Not Span/Hispanic,1,Emergency,Home or Self Care,2022,CIR017,Cardiac dysrhythmias,ESA006,CARDIOVERSION,201,CARDIAC ARRHYTHMIA AND CONDUCTION DISORDERS,05,DISEASES AND DISORDERS OF THE CIRCULATORY SYSTEM,1,Minor,Minor,Medical,Medicaid,,,,,Y,24020.77,6653.50
New York City,Manhattan,7002053,001463,NYU Langone Hospitals,70 or Older,112,M,White,Not Span/Hispanic,4,Emergency,Home or Self Care,2022,CIR017,Cardiac dysrhythmias,,,201,CARDIAC ARRHYTHMIA AND CONDUCTION DISORDERS,05,DISEASES AND DISORDERS OF THE CIRCULATORY SYSTEM,3,Major,Major,Medical,Medicare,Medicaid,,,,Y,98464.73,24955.88
New York City,Manhattan,7002053,001463,NYU Langone Hospitals,70 or Older,100,M,White,Not Span/Hispanic,2,Emergency,Home or Self Care,2022,CIR017,Cardiac dysrhythmias,ESA006,CARDIOVERSION,201,CARDIAC ARRHYTHMIA AND CONDUCTION DISORDERS,05,DISEASES AND DISORDERS OF THE CIRCULATORY SYSTEM,3,Major,Major,Medical,Medicare,Medicare,,,,Y,40782.46,12369.70
New York City,Manhattan,7002054,001464,New York-Presbyterian Hospital - Columbia Presbyterian Center,70 or Older,100,F,Black/African American,Not Span/Hispanic,4,Emergency,Skilled Nursing Home,2022,CIR017,Cardiac dysrhythmias,ESA006,CARDIOVERSION,201,CARDIAC ARRHYTHMIA AND CONDUCTION DISORDERS,05,DISEASES AND DISORDERS OF THE CIRCULATORY SYSTEM,3,Major,Moderate,Medical,Private Health Insurance,,,,,Y,78911.31,17193.65
New York City,Manhattan,7002054,001464,New York-Presbyterian Hospital - Columbia Presbyterian Center,30 to 49,114,F,Black/African American,Not Span/Hispanic,12,Emergency,Skilled Nursing Home,2022,CIR017,Cardiac dysrhythmias,ADM016,ADMINISTRATION OF ANTI-INFLAMMATORY AGENTS,201,CARDIAC ARRHYTHMIA AND CONDUCTION DISORDERS,05,DISEASES AND DISORDERS OF THE CIRCULATORY SYSTEM,3,Major,Major,Medical,Medicare,Medicaid,,,,Y,253376.94,82970.63
New York City,Manhattan,7002054,001464,New York-Presbyterian Hospital - Columbia Presbyterian Center,18 to 29,OOS,F,White,Not Span/Hispanic,8,Emergency,Home or Self Care,2022,CIR017,Cardiac dysrhythmias,ADM021,"ADMINISTRATION OF THERAPEUTIC SUBSTANCES, NEC",201,CARDIAC ARRHYTHMIA AND CONDUCTION DISORDERS,05,DISEASES AND DISORDERS OF THE CIRCULATORY SYSTEM,3,Major,Major,Medical,Private Health Insurance,,,,,Y,183521.78,82004.88
New York City,Manhattan,7002001,001438,Bellevue Hospital Center,50 to 69,104,F,Other Race,Spanish/Hispanic,4,Elective,Home or Self Care,2022,CIR017,Cardiac dysrhythmias,ADM021,"ADMINISTRATION OF THERAPEUTIC SUBSTANCES, NEC",201,CARDIAC ARRHYTHMIA AND CONDUCTION DISORDERS,05,DISEASES AND DISORDERS OF THE CIRCULATORY SYSTEM,2,Moderate,Major,Medical,Medicaid,,,,,N,34922.20,20083.20
New York City,Manhattan,7002001,001438,Bellevue Hospital Center,70 or Older,114,F,Other Race,Unknown,6,Urgent,Expired,2022,SYM012,Circulatory signs and symptoms,RES007,AIRWAY INTUBATION,201,CARDIAC ARRHYTHMIA AND CONDUCTION DISORDERS,05,DISEASES AND DISORDERS OF THE CIRCULATORY SYSTEM,4,Extreme,Extreme,Medical,Medicare,Medicaid,,,,N,93605.08,53830.78
Finger Lakes,Monroe,2701005,000413,Strong Memorial Hospital,70 or Older,146,M,White,Not Span/Hispanic,5,Emergency,Hospice - Home,2022,CIR017,Cardiac dysrhythmias,,,201,CARDIAC ARRHYTHMIA AND CONDUCTION DISORDERS,05,DISEASES AND DISORDERS OF THE CIRCULATORY SYSTEM,2,Moderate,Major,Medical,Medicare,Private Health Insurance,,,,Y,12731.88,6673.71
Finger Lakes,Monroe,2701005,000413,Strong Memorial Hospital,70 or Older,140,F,White,Not Span/Hispanic,10,Emergency,Home w/ Home Health Services,2022,CIR017,Cardiac dysrhythmias,ESA006,CARDIOVERSION,201,CARDIAC ARRHYTHMIA AND CONDUCTION DISORDERS,05,DISEASES AND DISORDERS OF THE CIRCULATORY SYSTEM,3,Major,Major,Medical,Medicare,Private Health Insurance,,,,Y,52558.59,20932.30
Finger Lakes,Monroe,2701005,000413,Strong Memorial Hospital,30 to 49,145,M,White,Not Span/Hispanic,3,Emergency,Home or Self Care,2022,SYM012,Circulatory signs and symptoms,,,201,CARDIAC ARRHYTHMIA AND CONDUCTION DISORDERS,05,DISEASES AND DISORDERS OF THE CIRCULATORY SYSTEM,1,Minor,Minor,Medical,Medicaid,,,,,Y,9337.74,4376.95
Finger Lakes,Monroe,2701005,000413,Strong Memorial Hospital,70 or Older,144,F,White,Not Span/Hispanic,3,Emergency,Home or Self Care,2022,CIR017,Cardiac dysrhythmias,ESA006,CARDIOVERSION,201,CARDIAC ARRHYTHMIA AND CONDUCTION DISORDERS,05,DISEASES AND DISORDERS OF THE CIRCULATORY SYSTEM,2,Moderate,Major,Medical,Medicare,,,,,Y,19896.06,6927.39
Finger Lakes,Monroe,2701005,000413,Strong Memorial Hospital,70 or Older,145,M,White,Not Span/Hispanic,1,Emergency,Home or Self Care,2022,CIR017,Cardiac dysrhythmias,,,201,CARDIAC ARRHYTHMIA AND CONDUCTION DISORDERS,05,DISEASES AND DISORDERS OF THE CIRCULATORY SYSTEM,2,Moderate,Major,Medical,Federal/State/Local/VA,,,,,Y,7855.70,3043.02
Finger Lakes,Monroe,2701005,000413,Strong Memorial Hospital,70 or Older,145,M,White,Not Span/Hispanic,3,Emergency,Skilled Nursing Home,2022,CIR017,Cardiac dysrhythmias,,,201,CARDIAC ARRHYTHMIA AND CONDUCTION DISORDERS,05,DISEASES AND DISORDERS OF THE CIRCULATORY SYSTEM,2,Moderate,Moderate,Medical,Medicare,,,,,Y,11499.51,5052.83
Finger Lakes,Monroe,2701005,000413,Strong Memorial Hospital,0 to 17,148,F,White,Not Span/Hispanic,1,Emergency,Home or Self Care,2022,SYM012,Circulatory signs and symptoms,,,201,CARDIAC ARRHYTHMIA AND CONDUCTION DISORDERS,05,DISEASES AND DISORDERS OF THE CIRCULATORY SYSTEM,1,Minor,Minor,Medical,Medicaid,,,,,Y,5509.38,2080.79
Finger Lakes,Monroe,2701005,000413,Strong Memorial Hospital,70 or Older,144,F,White,Not Span/Hispanic,1,Emergency,Home or Self Care,2022,CIR017,Cardiac dysrhythmias,,,201,CARDIAC ARRHYTHMIA AND CONDUCTION DISORDERS,05,DISEASES AND DISORDERS OF THE CIRCULATORY SYSTEM,3,Major,Moderate,Medical,Medicare,Private Health Insurance,,,,Y,11309.24,3679.11