Hospital Service Area,Hospital County,Operating Certificate Number,Permanent Facility Id,Facility Name,Age Group,Zip Code - 3 digits,Gender,Race,Ethnicity,Length of Stay,Type of Admission,Patient Disposition,Discharge Year,CCS Diagnosis Code,CCS Diagnosis Description,CCS Procedure Code,CCS Procedure Description,APR DRG Code,APR DRG Description,APR MDC Code,APR MDC Description,APR Severity of Illness Code,APR Severity of Illness Description,APR Risk of Mortality,APR Medical Surgical Description,Payment Typology 1,Payment Typology 2,Payment Typology 3,Birth Weight,Abortion Edit Indicator,Emergency Department Indicator,Total Charges,Total Costs
New York City,Manhattan,7002054,001464,New York-Presbyterian Hospital - Columbia Presbyterian Center,50 to 69,106,F,White,Not Span/Hispanic,1,Urgent,Home or Self Care,2022,CIR012,Nonspecific chest pain,,,203,CHEST PAIN,05,DISEASES AND DISORDERS OF THE CIRCULATORY SYSTEM,1,Minor,Minor,Medical,Private Health Insurance,,,,,N,20363.12,9560.34
New York City,Manhattan,7002001,001438,Bellevue Hospital Center,50 to 69,113,F,Other Race,Spanish/Hispanic,1,Emergency,Home or Self Care,2022,CIR012,Nonspecific chest pain,,,203,CHEST PAIN,05,DISEASES AND DISORDERS OF THE CIRCULATORY SYSTEM,2,Moderate,Minor,Medical,Medicaid,,,,,Y,10999.73,6325.77
New York City,Manhattan,7002054,001464,New York-Presbyterian Hospital - Columbia Presbyterian Center,30 to 49,104,M,Other Race,Unknown,1,Emergency,Left Against Medical Advice,2022,CIR012,Nonspecific chest pain,,,203,CHEST PAIN,05,DISEASES AND DISORDERS OF THE CIRCULATORY SYSTEM,2,Moderate,Moderate,Medical,Medicaid,,,,,Y,22946.48,5209.71
New York City,Manhattan,7002054,001464,New York-Presbyterian Hospital - Columbia Presbyterian Center,50 to 69,112,M,Black/African American,Not Span/Hispanic,3,Emergency,Home or Self Care,2022,CIR012,Nonspecific chest pain,,,203,CHEST PAIN,05,DISEASES AND DISORDERS OF THE CIRCULATORY SYSTEM,2,Moderate,Moderate,Medical,Medicare,,,,,Y,68617.96,14408.15
New York City,Manhattan,7002054,001464,New York-Presbyterian Hospital - Columbia Presbyterian Center,30 to 49,100,F,Black/African American,Not Span/Hispanic,2,Emergency,Home or Self Care,2022,MUS028,Other specified bone disease and musculoskeletal deformities,ADM021,"ADMINISTRATION OF THERAPEUTIC SUBSTANCES, NEC",203,CHEST PAIN,05,DISEASES AND DISORDERS OF THE CIRCULATORY SYSTEM,2,Moderate,Minor,Medical,Medicaid,,,,,Y,42897.94,9679.01
New York City,Manhattan,7002054,001464,New York-Presbyterian Hospital - Columbia Presbyterian Center,30 to 49,100,M,Other Race,Spanish/Hispanic,1,Emergency,Home or Self Care,2022,CIR012,Nonspecific chest pain,,,203,CHEST PAIN,05,DISEASES AND DISORDERS OF THE CIRCULATORY SYSTEM,1,Minor,Minor,Medical,Medicaid,,,,,Y,28303.79,6045.97
New York City,Manhattan,7002054,001464,New York-Presbyterian Hospital - Columbia Presbyterian Center,50 to 69,OOS,F,White,Not Span/Hispanic,2,Emergency,Home or Self Care,2022,CIR012,Nonspecific chest pain,,,203,CHEST PAIN,05,DISEASES AND DISORDERS OF THE CIRCULATORY SYSTEM,1,Minor,Minor,Medical,Medicaid,,,,,Y,33516.20,7180.97
New York City,Manhattan,7002054,001464,New York-Presbyterian Hospital - Columbia Presbyterian Center,30 to 49,100,M,Black/African American,Not Span/Hispanic,1,Urgent,Home or Self Care,2022,CIR012,Nonspecific chest pain,,,203,CHEST PAIN,05,DISEASES AND DISORDERS OF THE CIRCULATORY SYSTEM,2,Moderate,Minor,Medical,Medicaid,,,,,Y,27623.96,5819.15
New York City,Manhattan,7002001,001438,Bellevue Hospital Center,50 to 69,104,F,Other Race,Unknown,1,Emergency,Home or Self Care,2022,CIR012,Nonspecific chest pain,ADM021,"ADMINISTRATION OF THERAPEUTIC SUBSTANCES, NEC",203,CHEST PAIN,05,DISEASES AND DISORDERS OF THE CIRCULATORY SYSTEM,1,Minor,Minor,Medical,Medicaid,,,,,Y,10015.05,5759.50
New York City,Manhattan,7002001,001438,Bellevue Hospital Center,50 to 69,100,M,Other Race,Spanish/Hispanic,8,Emergency,Skilled Nursing Home,2022,CIR012,Nonspecific chest pain,MHT005,"MENTAL HEALTH PROCEDURES, NEC",203,CHEST PAIN,05,DISEASES AND DISORDERS OF THE CIRCULATORY SYSTEM,3,Major,Moderate,Medical,Medicaid,,,,,Y,60487.32,34785.29
New York City,Manhattan,7002001,001438,Bellevue Hospital Center,50 to 69,114,F,Other Race,Spanish/Hispanic,2,Emergency,Home or Self Care,2022,CIR012,Nonspecific chest pain,IMG008,ULTRASONOGRAPHY,203,CHEST PAIN,05,DISEASES AND DISORDERS OF THE CIRCULATORY SYSTEM,1,Minor,Minor,Medical,Self-Pay,,,,,Y,18971.22,10910.05
New York City,Manhattan,7002001,001438,Bellevue Hospital Center,50 to 69,100,M,Other Race,Spanish/Hispanic,1,Emergency,Home or Self Care,2022,CIR012,Nonspecific chest pain,ADM021,"ADMINISTRATION OF THERAPEUTIC SUBSTANCES, NEC",203,CHEST PAIN,05,DISEASES AND DISORDERS OF THE CIRCULATORY SYSTEM,1,Minor,Minor,Medical,Medicaid,,,,,Y,10598.59,6095.08
New York City,Manhattan,7002001,001438,Bellevue Hospital Center,70 or Older,100,M,Other Race,Spanish/Hispanic,6,Emergency,Home or Self Care,2022,CIR012,Nonspecific chest pain,NCM004,POSITRON EMISSION TOMOGRAPHIC (PET) IMAGING,203,CHEST PAIN,05,DISEASES AND DISORDERS OF THE CIRCULATORY SYSTEM,2,Moderate,Minor,Medical,Medicare,Medicaid,,,,Y,65950.22,37926.92
New York City,Manhattan,7002001,001438,Bellevue Hospital Center,70 or Older,112,M,Other Race,Spanish/Hispanic,1,Emergency,Home or Self Care,2022,CIR012,Nonspecific chest pain,ADM021,"ADMINISTRATION OF THERAPEUTIC SUBSTANCES, NEC",203,CHEST PAIN,05,DISEASES AND DISORDERS OF THE CIRCULATORY SYSTEM,1,Minor,Minor,Medical,Medicare,Medicaid,,,,Y,14223.74,8179.85
New York City,Manhattan,7002001,001438,Bellevue Hospital Center,30 to 49,112,M,Black/African American,Unknown,1,Emergency,Home or Self Care,2022,CIR012,Nonspecific chest pain,ADM021,"ADMINISTRATION OF THERAPEUTIC SUBSTANCES, NEC",203,CHEST PAIN,05,DISEASES AND DISORDERS OF THE CIRCULATORY SYSTEM,2,Moderate,Minor,Medical,Private Health Insurance,,,,,Y,11226.86,6456.39
Finger Lakes,Monroe,2701005,000413,Strong Memorial Hospital,50 to 69,146,M,Black/African American,Not Span/Hispanic,4,Emergency,Home or Self Care,2022,CIR012,Nonspecific chest pain,,,203,CHEST PAIN,05,DISEASES AND DISORDERS OF THE CIRCULATORY SYSTEM,3,Major,Major,Medical,Blue Cross/Blue Shield,Medicare,,,,Y,25882.35,9003.38
New York City,Manhattan,7002001,001438,Bellevue Hospital Center,50 to 69,104,M,Other Race,Unknown,1,Emergency,Home or Self Care,2022,CIR012,Nonspecific chest pain,ADM021,"ADMINISTRATION OF THERAPEUTIC SUBSTANCES, NEC",203,CHEST PAIN,05,DISEASES AND DISORDERS OF THE CIRCULATORY SYSTEM,1,Minor,Minor,Medical,Medicaid,,,,,Y,10561.54,6073.77
New York City,Manhattan,7002001,001438,Bellevue Hospital Center,70 or Older,,M,Other Race,Spanish/Hispanic,1,Emergency,Home or Self Care,2022,MUS028,Other specified bone disease and musculoskeletal deformities,IMG006,COMPUTERIZED TOMOGRAPHY (CT) WITH CONTRAST,203,CHEST PAIN,05,DISEASES AND DISORDERS OF THE CIRCULATORY SYSTEM,1,Minor,Minor,Medical,Medicare,Medicaid,,,,Y,11783.45,6776.47
New York City,Manhattan,7002001,001438,Bellevue Hospital Center,50 to 69,113,M,White,Not Span/Hispanic,4,Emergency,Home or Self Care,2022,CIR012,Nonspecific chest pain,IMG008,ULTRASONOGRAPHY,203,CHEST PAIN,05,DISEASES AND DISORDERS OF THE CIRCULATORY SYSTEM,1,Minor,Minor,Medical,Medicaid,,,,,Y,46160.04,26545.90
New York City,Manhattan,7002054,001464,New York-Presbyterian Hospital - Columbia Presbyterian Center,50 to 69,104,M,Other Race,Spanish/Hispanic,1,Emergency,Home or Self Care,2022,CIR012,Nonspecific chest pain,,,203,CHEST PAIN,05,DISEASES AND DISORDERS OF THE CIRCULATORY SYSTEM,1,Minor,Moderate,Medical,Medicaid,,,,,Y,20928.96,
New York City,Manhattan,7002054,001464,New York-Presbyterian Hospital - Columbia Presbyterian Center,50 to 69,100,M,Other Race,Spanish/Hispanic,1,Emergency,Home or Self Care,2022,CIR012,Nonspecific chest pain,ADM021,"ADMINISTRATION OF THERAPEUTIC SUBSTANCES, NEC",203,CHEST PAIN,05,DISEASES AND DISORDERS OF THE CIRCULATORY SYSTEM,1,Minor,Moderate,Medical,Medicaid,,,,,Y,27376.55,5781.05
New York City,Manhattan,7002054,001464,New York-Presbyterian Hospital - Columbia Presbyterian Center,70 or Older,100,F,Other Race,Spanish/Hispanic,1,Emergency,Home w/ Home Health Services,2022,CIR012,Nonspecific chest pain,,,203,CHEST PAIN,05,DISEASES AND DISORDERS OF THE CIRCULATORY SYSTEM,1,Minor,Minor,Medical,Medicare,Medicaid,,,,Y,32796.59,7077.58
New York City,Manhattan,7002001,001438,Bellevue Hospital Center,50 to 69,115,M,Other Race,Unknown,2,Urgent,Home or Self Care,2022,CIR012,Nonspecific chest pain,ADM021,"ADMINISTRATION OF THERAPEUTIC SUBSTANCES, NEC",203,CHEST PAIN,05,DISEASES AND DISORDERS OF THE CIRCULATORY SYSTEM,2,Moderate,Moderate,Medical,Self-Pay,,,,,N,14409.46,8286.65
New York City,Manhattan,7002001,001438,Bellevue Hospital Center,70 or Older,112,F,Black/African American,Unknown,2,Emergency,Home or Self Care,2022,CIR012,Nonspecific chest pain,ADM007,INTRAVENOUS INDUCTION OF LABOR,203,CHEST PAIN,05,DISEASES AND DISORDERS OF THE CIRCULATORY SYSTEM,2,Moderate,Minor,Medical,Medicare,Medicaid,,,,Y,17068.58,9815.87
New York City,Manhattan,7002054,001464,New York-Presbyterian Hospital - Columbia Presbyterian Center,70 or Older,100,F,Black/African American,Not Span/Hispanic,4,Emergency,Home or Self Care,2022,MUS028,Other specified bone disease and musculoskeletal deformities,,,203,CHEST PAIN,05,DISEASES AND DISORDERS OF THE CIRCULATORY SYSTEM,2,Moderate,Moderate,Medical,Medicare,Medicaid,,,,Y,65833.23,14300.61
New York City,Manhattan,7002054,001464,New York-Presbyterian Hospital - Columbia Presbyterian Center,30 to 49,104,M,Other Race,Unknown,3,Emergency,Home or Self Care,2022,CIR012,Nonspecific chest pain,,,203,CHEST PAIN,05,DISEASES AND DISORDERS OF THE CIRCULATORY SYSTEM,2,Moderate,Moderate,Medical,Medicaid,,,,,Y,40256.13,8557.44
New York City,Manhattan,7002054,001464,New York-Presbyterian Hospital - Columbia Presbyterian Center,50 to 69,100,F,Black/African American,Spanish/Hispanic,2,Emergency,Home or Self Care,2022,MUS028,Other specified bone disease and musculoskeletal deformities,ADM017,ADMINISTRATION OF NUTRITIONAL AND ELECTROLYTIC SUBSTANCES,203,CHEST PAIN,05,DISEASES AND DISORDERS OF THE CIRCULATORY SYSTEM,2,Moderate,Minor,Medical,Medicare,Medicaid,,,,Y,49316.06,11476.48
New York City,Manhattan,7002054,001464,New York-Presbyterian Hospital - Columbia Presbyterian Center,30 to 49,100,M,Other Race,Unknown,1,Emergency,Home or Self Care,2022,MUS028,Other specified bone disease and musculoskeletal deformities,,,203,CHEST PAIN,05,DISEASES AND DISORDERS OF THE CIRCULATORY SYSTEM,2,Moderate,Minor,Medical,Medicaid,,,,,Y,23296.12,4664.17
New York City,Manhattan,7002001,001438,Bellevue Hospital Center,50 to 69,112,M,Other Race,Unknown,5,Elective,Home or Self Care,2022,CIR012,Nonspecific chest pain,ADM021,"ADMINISTRATION OF THERAPEUTIC SUBSTANCES, NEC",203,CHEST PAIN,05,DISEASES AND DISORDERS OF THE CIRCULATORY SYSTEM,1,Minor,Minor,Medical,Private Health Insurance,,,,,N,49380.94,28398.19
New York City,Manhattan,7002053,001463,NYU Langone Hospitals,30 to 49,103,F,White,Not Span/Hispanic,3,Emergency,Home w/ Home Health Services,2022,CIR012,Nonspecific chest pain,ADM017,ADMINISTRATION OF NUTRITIONAL AND ELECTROLYTIC SUBSTANCES,203,CHEST PAIN,05,DISEASES AND DISORDERS OF THE CIRCULATORY SYSTEM,3,Major,Moderate,Medical,Blue Cross/Blue Shield,Medicaid,,,,Y,59866.49,16137.27
New York City,Manhattan,7002053,001463,NYU Langone Hospitals,50 to 69,112,F,White,Not Span/Hispanic,1,Emergency,Home or Self Care,2022,CIR012,Nonspecific chest pain,,,203,CHEST PAIN,05,DISEASES AND DISORDERS OF THE CIRCULATORY SYSTEM,2,Moderate,Moderate,Medical,Private Health Insurance,,,,,Y,36751.30,7025.32
New York City,Manhattan,7002001,001438,Bellevue Hospital Center,30 to 49,112,F,Black/African American,Unknown,2,Urgent,Home or Self Care,2022,MUS028,Other specified bone disease and musculoskeletal deformities,IMG008,ULTRASONOGRAPHY,203,CHEST PAIN,05,DISEASES AND DISORDERS OF THE CIRCULATORY SYSTEM,2,Moderate,Moderate,Medical,Medicare,Medicaid,,,,N,17120.54,9845.75
New York City,Manhattan,7002001,001438,Bellevue Hospital Center,50 to 69,114,M,Other Race,Spanish/Hispanic,1,Emergency,Home or Self Care,2022,CIR012,Nonspecific chest pain,IMG009,PLAIN RADIOGRAPHY,203,CHEST PAIN,05,DISEASES AND DISORDERS OF THE CIRCULATORY SYSTEM,1,Minor,Minor,Medical,Medicaid,,,,,Y,9670.04,5561.09
New York City,Manhattan,7002054,001464,New York-Presbyterian Hospital - Columbia Presbyterian Center,30 to 49,100,M,Other Race,Spanish/Hispanic,1,Emergency,Home or Self Care,2022,CIR012,Nonspecific chest pain,,,203,CHEST PAIN,05,DISEASES AND DISORDERS OF THE CIRCULATORY SYSTEM,2,Moderate,Minor,Medical,Medicaid,,,,,Y,40325.85,8190.69
New York City,Manhattan,7002054,001464,New York-Presbyterian Hospital - Columbia Presbyterian Center,50 to 69,114,M,Other Race,Not Span/Hispanic,5,Emergency,Home or Self Care,2022,CIR012,Nonspecific chest pain,,,203,CHEST PAIN,05,DISEASES AND DISORDERS OF THE CIRCULATORY SYSTEM,2,Moderate,Moderate,Medical,Medicare,Private Health Insurance,,,,Y,87885.78,18689.55
New York City,Manhattan,7002054,001464,New York-Presbyterian Hospital - Columbia Presbyterian Center,30 to 49,112,F,Black/African American,Not Span/Hispanic,1,Emergency,Left Against Medical Advice,2022,CIR012,Nonspecific chest pain,,,203,CHEST PAIN,05,DISEASES AND DISORDERS OF THE CIRCULATORY SYSTEM,1,Minor,Minor,Medical,Medicaid,,,,,Y,21427.68,4292.83
Long Island,Nassau,2951001,000541,North Shore University Hospital,50 to 69,115,M,Black/African American,Not Span/Hispanic,4,Emergency,Home or Self Care,2022,CIR012,Nonspecific chest pain,ESA001,HEMODIALYSIS,203,CHEST PAIN,05,DISEASES AND DISORDERS OF THE CIRCULATORY SYSTEM,3,Major,Major,Medical,Medicare,Medicaid,,,,Y,59200.87,16917.41
Long Island,Nassau,2951001,000541,North Shore University Hospital,70 or Older,113,M,White,Not Span/Hispanic,1,Emergency,Left Against Medical Advice,2022,CIR012,Nonspecific chest pain,,,203,CHEST PAIN,05,DISEASES AND DISORDERS OF THE CIRCULATORY SYSTEM,1,Minor,Minor,Medical,Medicare,,,,,Y,15783.00,2665.83
Long Island,Nassau,2951001,000541,North Shore University Hospital,30 to 49,112,F,White,Not Span/Hispanic,4,Emergency,Home w/ Home Health Services,2022,CIR012,Nonspecific chest pain,,,203,CHEST PAIN,05,DISEASES AND DISORDERS OF THE CIRCULATORY SYSTEM,3,Major,Moderate,Medical,Medicaid,Medicaid,,,,Y,58169.36,9477.87
Long Island,Nassau,2951001,000541,North Shore University Hospital,50 to 69,113,M,White,Not Span/Hispanic,2,Emergency,Home w/ Home Health Services,2022,CIR012,Nonspecific chest pain,,,203,CHEST PAIN,05,DISEASES AND DISORDERS OF THE CIRCULATORY SYSTEM,2,Moderate,Minor,Medical,Medicare,,,,,Y,31936.05,5305.74
Long Island,Nassau,2951001,000541,North Shore University Hospital,50 to 69,114,M,Black/African American,Not Span/Hispanic,1,Emergency,Home or Self Care,2022,CIR012,Nonspecific chest pain,,,203,CHEST PAIN,05,DISEASES AND DISORDERS OF THE CIRCULATORY SYSTEM,1,Minor,Minor,Medical,Medicare,Medicare,,,,Y,18775.37,3012.40
Long Island,Nassau,2951001,000541,North Shore University Hospital,50 to 69,114,F,Other Race,Spanish/Hispanic,3,Emergency,Home or Self Care,2022,CIR012,Nonspecific chest pain,,,203,CHEST PAIN,05,DISEASES AND DISORDERS OF THE CIRCULATORY SYSTEM,1,Minor,Minor,Medical,Blue Cross/Blue Shield,Medicaid,,,,Y,45410.19,7359.65
Long Island,Nassau,2951001,000541,North Shore University Hospital,30 to 49,112,F,Black/African American,Not Span/Hispanic,3,Emergency,Home or Self Care,2022,CIR012,Nonspecific chest pain,,,203,CHEST PAIN,05,DISEASES AND DISORDERS OF THE CIRCULATORY SYSTEM,2,Moderate,Moderate,Medical,Medicaid,Medicaid,,,,Y,49832.88,7724.34
Long Island,Nassau,2951001,000541,North Shore University Hospital,18 to 29,,M,Black/African American,Not Span/Hispanic,1,Emergency,Left Against Medical Advice,2022,CIR012,Nonspecific chest pain,,,203,CHEST PAIN,05,DISEASES AND DISORDERS OF THE CIRCULATORY SYSTEM,1,Minor,Minor,Medical,Self-Pay,,,,,Y,37352.84,4558.18
Long Island,Nassau,2951001,000541,North Shore University Hospital,50 to 69,113,F,Other Race,Spanish/Hispanic,1,Emergency,Home or Self Care,2022,CIR012,Nonspecific chest pain,,,203,CHEST PAIN,05,DISEASES AND DISORDERS OF THE CIRCULATORY SYSTEM,1,Minor,Minor,Medical,Medicaid,Medicaid,,,,Y,37047.40,6507.61
Long Island,Nassau,2951001,000541,North Shore University Hospital,18 to 29,OOS,M,White,Not Span/Hispanic,1,Emergency,Home or Self Care,2022,CIR012,Nonspecific chest pain,,,203,CHEST PAIN,05,DISEASES AND DISORDERS OF THE CIRCULATORY SYSTEM,1,Minor,Minor,Medical,Private Health Insurance,,,,,Y,43358.15,5614.65
Long Island,Nassau,2951001,000541,North Shore University Hospital,50 to 69,117,M,Other Race,Not Span/Hispanic,1,Emergency,Home or Self Care,2022,CIR012,Nonspecific chest pain,,,203,CHEST PAIN,05,DISEASES AND DISORDERS OF THE CIRCULATORY SYSTEM,2,Moderate,Moderate,Medical,Blue Cross/Blue Shield,,,,,Y,15435.22,2675.54
Long Island,Nassau,2951001,000541,North Shore University Hospital,30 to 49,110,M,Other Race,Spanish/Hispanic,5,Emergency,Home or Self Care,2022,CIR012,Nonspecific chest pain,,,203,CHEST PAIN,05,DISEASES AND DISORDERS OF THE CIRCULATORY SYSTEM,1,Minor,Minor,Medical,Medicaid,,,,,Y,76325.71,12572.87
Long Island,Nassau,2951001,000541,North Shore University Hospital,50 to 69,114,F,Black/African American,Not Span/Hispanic,10,Emergency,Skilled Nursing Home,2022,MUS028,Other specified bone disease and musculoskeletal deformities,ESA001,HEMODIALYSIS,203,CHEST PAIN,05,DISEASES AND DISORDERS OF THE CIRCULATORY SYSTEM,3,Major,Moderate,Medical,Medicare,Medicare,Medicaid,,,Y,174726.91,40645.57
Long Island,Nassau,2951001,000541,North Shore University Hospital,50 to 69,112,F,Black/African American,Not Span/Hispanic,18,Emergency,Skilled Nursing Home,2022,CIR012,Nonspecific chest pain,OTR004,ISOLATION PROCEDURES,203,CHEST PAIN,05,DISEASES AND DISORDERS OF THE CIRCULATORY SYSTEM,3,Major,Major,Medical,Miscellaneous/Other,Medicare,Medicare,,,Y,217052.89,37306.90
Long Island,Nassau,2951001,000541,North Shore University Hospital,70 or Older,114,M,Black/African American,Not Span/Hispanic,1,Emergency,Home or Self Care,2022,CIR012,Nonspecific chest pain,,,203,CHEST PAIN,05,DISEASES AND DISORDERS OF THE CIRCULATORY SYSTEM,2,Moderate,Moderate,Medical,Medicare,Private Health Insurance,,,,Y,20036.77,3410.65
Long Island,Nassau,2951001,000541,North Shore University Hospital,30 to 49,113,F,Other Race,Spanish/Hispanic,2,Emergency,Home or Self Care,2022,CIR012,Nonspecific chest pain,,,203,CHEST PAIN,05,DISEASES AND DISORDERS OF THE CIRCULATORY SYSTEM,1,Minor,Minor,Medical,Medicaid,,,,,Y,54486.57,6505.04
New York City,Manhattan,7002001,001438,Bellevue Hospital Center,50 to 69,100,F,Black/African American,Unknown,1,Emergency,Home or Self Care,2022,CIR012,Nonspecific chest pain,IMG008,ULTRASONOGRAPHY,203,CHEST PAIN,05,DISEASES AND DISORDERS OF THE CIRCULATORY SYSTEM,1,Minor,Minor,Medical,Medicare,Private Health Insurance,,,,Y,11299.68,6498.27
New York City,Manhattan,7002001,001438,Bellevue Hospital Center,50 to 69,100,F,Black/African American,Not Span/Hispanic,2,Emergency,Home or Self Care,2022,MUS028,Other specified bone disease and musculoskeletal deformities,ADM014,REGIONAL ANESTHESIA,203,CHEST PAIN,05,DISEASES AND DISORDERS OF THE CIRCULATORY SYSTEM,2,Moderate,Moderate,Medical,Medicaid,,,,,Y,19760.89,11364.17
New York City,Manhattan,7002001,001438,Bellevue Hospital Center,50 to 69,112,M,Other Race,Not Span/Hispanic,1,Emergency,Home or Self Care,2022,CIR012,Nonspecific chest pain,ADM021,"ADMINISTRATION OF THERAPEUTIC SUBSTANCES, NEC",203,CHEST PAIN,05,DISEASES AND DISORDERS OF THE CIRCULATORY SYSTEM,1,Minor,Minor,Medical,Medicaid,,,,,Y,27598.50,15871.46
New York City,Manhattan,7002001,001438,Bellevue Hospital Center,70 or Older,112,F,Other Race,Unknown,1,Emergency,Home or Self Care,2022,CIR012,Nonspecific chest pain,IMG006,COMPUTERIZED TOMOGRAPHY (CT) WITH CONTRAST,203,CHEST PAIN,05,DISEASES AND DISORDERS OF THE CIRCULATORY SYSTEM,2,Moderate,Moderate,Medical,Medicare,Medicaid,,,,Y,14594.91,8393.30
New York City,Manhattan,7002054,001464,New York-Presbyterian Hospital - Columbia Presbyterian Center,70 or Older,100,M,Other Race,Spanish/Hispanic,1,Emergency,Home or Self Care,2022,CIR012,Nonspecific chest pain,,,203,CHEST PAIN,05,DISEASES AND DISORDERS OF THE CIRCULATORY SYSTEM,2,Moderate,Moderate,Medical,Medicare,Medicaid,,,,Y,25052.98,5227.40
New York City,Manhattan,7002001,001438,Bellevue Hospital Center,50 to 69,104,M,Other Race,Spanish/Hispanic,4,Emergency,Home or Self Care,2022,CIR012,Nonspecific chest pain,SUD002,PHARMACOTHERAPY FOR SUBSTANCE USE,203,CHEST PAIN,05,DISEASES AND DISORDERS OF THE CIRCULATORY SYSTEM,3,Major,Major,Medical,Medicaid,,,,,Y,36008.19,20707.73
New York City,Manhattan,7002053,001463,NYU Langone Hospitals,30 to 49,104,F,Multi-racial,Spanish/Hispanic,2,Emergency,Home w/ Home Health Services,2022,CIR012,Nonspecific chest pain,,,203,CHEST PAIN,05,DISEASES AND DISORDERS OF THE CIRCULATORY SYSTEM,2,Moderate,Moderate,Medical,Medicaid,,,,,Y,69458.13,19122.93
New York City,Manhattan,7002054,001464,New York-Presbyterian Hospital - Columbia Presbyterian Center,50 to 69,104,F,Black/African American,Not Span/Hispanic,1,Emergency,Home or Self Care,2022,CIR012,Nonspecific chest pain,MAM004,CARDIAC STRESS TESTS,203,CHEST PAIN,05,DISEASES AND DISORDERS OF THE CIRCULATORY SYSTEM,1,Minor,Minor,Medical,Private Health Insurance,,,,,Y,27371.11,7191.16
New York City,Manhattan,7002054,001464,New York-Presbyterian Hospital - Columbia Presbyterian Center,70 or Older,100,F,White,Not Span/Hispanic,1,Emergency,Home or Self Care,2022,MUS028,Other specified bone disease and musculoskeletal deformities,,,203,CHEST PAIN,05,DISEASES AND DISORDERS OF THE CIRCULATORY SYSTEM,3,Major,Major,Medical,Medicare,,,,,Y,20175.00,4252.69
New York City,Manhattan,7002001,001438,Bellevue Hospital Center,50 to 69,OOS,F,Black/African American,Unknown,1,Emergency,Left Against Medical Advice,2022,CIR012,Nonspecific chest pain,ADM021,"ADMINISTRATION OF THERAPEUTIC SUBSTANCES, NEC",203,CHEST PAIN,05,DISEASES AND DISORDERS OF THE CIRCULATORY SYSTEM,1,Minor,Minor,Medical,Medicaid,,,,,Y,9928.97,5709.99
New York City,Manhattan,7002001,001438,Bellevue Hospital Center,70 or Older,100,F,Black/African American,Unknown,9,Emergency,Skilled Nursing Home,2022,CIR012,Nonspecific chest pain,IMG007,COMPUTERIZED TOMOGRAPHY (CT) WITHOUT CONTRAST,203,CHEST PAIN,05,DISEASES AND DISORDERS OF THE CIRCULATORY SYSTEM,2,Moderate,Moderate,Medical,Medicare,Medicare,,,,Y,89527.64,51485.91
New York City,Manhattan,7002001,001438,Bellevue Hospital Center,50 to 69,113,F,Other Race,Unknown,8,Urgent,Home or Self Care,2022,CIR012,Nonspecific chest pain,ADM017,ADMINISTRATION OF NUTRITIONAL AND ELECTROLYTIC SUBSTANCES,203,CHEST PAIN,05,DISEASES AND DISORDERS OF THE CIRCULATORY SYSTEM,1,Minor,Minor,Medical,Medicaid,,,,,N,63354.92,36434.40
Capital/Adirond,Warren,5601000,001005,Glens Falls Hospital,50 to 69,128,M,White,Not Span/Hispanic,6,Emergency,Home or Self Care,2022,CIR012,Nonspecific chest pain,,,203,CHEST PAIN,05,DISEASES AND DISORDERS OF THE CIRCULATORY SYSTEM,1,Minor,Minor,Medical,Medicare,,,,,Y,23035.41,7645.18
New York City,Manhattan,7002001,001438,Bellevue Hospital Center,30 to 49,104,M,Other Race,Spanish/Hispanic,1,Urgent,Home or Self Care,2022,CIR012,Nonspecific chest pain,IMG008,ULTRASONOGRAPHY,203,CHEST PAIN,05,DISEASES AND DISORDERS OF THE CIRCULATORY SYSTEM,2,Moderate,Moderate,Medical,Medicaid,,,,,N,8797.18,5059.12
New York City,Manhattan,7002001,001438,Bellevue Hospital Center,50 to 69,104,M,White,Unknown,1,Urgent,Left Against Medical Advice,2022,CIR012,Nonspecific chest pain,IMG009,PLAIN RADIOGRAPHY,203,CHEST PAIN,05,DISEASES AND DISORDERS OF THE CIRCULATORY SYSTEM,1,Minor,Minor,Medical,Medicare,,,,,N,6110.00,3513.76