Hospital Service Area,Hospital County,Operating Certificate Number,Permanent Facility Id,Facility Name,Age Group,Zip Code - 3 digits,Gender,Race,Ethnicity,Length of Stay,Type of Admission,Patient Disposition,Discharge Year,CCS Diagnosis Code,CCS Diagnosis Description,CCS Procedure Code,CCS Procedure Description,APR DRG Code,APR DRG Description,APR MDC Code,APR MDC Description,APR Severity of Illness Code,APR Severity of Illness Description,APR Risk of Mortality,APR Medical Surgical Description,Payment Typology 1,Payment Typology 2,Payment Typology 3,Birth Weight,Abortion Edit Indicator,Emergency Department Indicator,Total Charges,Total Costs
New York City,Manhattan,7002054,001464,New York-Presbyterian Hospital - Columbia Presbyterian Center,30 to 49,,F,Multi-racial,Not Span/Hispanic,2,Elective,Home or Self Care,2022,DIG024,Postprocedural or postoperative digestive system complication,GIS019,GASTRO-JEJUNAL BYPASS (INCLUDING BARIATRIC),220,"MAJOR STOMACH, ESOPHAGEAL AND DUODENAL PROCEDURES",06,DISEASES AND DISORDERS OF THE DIGESTIVE SYSTEM,1,Minor,Minor,Surgical,Medicaid,,,,,N,102166.90,30102.46
New York City,Manhattan,7002054,001464,New York-Presbyterian Hospital - Columbia Presbyterian Center,30 to 49,100,F,Other Race,Spanish/Hispanic,2,Elective,Home or Self Care,2022,DIG024,Postprocedural or postoperative digestive system complication,GIS019,GASTRO-JEJUNAL BYPASS (INCLUDING BARIATRIC),220,"MAJOR STOMACH, ESOPHAGEAL AND DUODENAL PROCEDURES",06,DISEASES AND DISORDERS OF THE DIGESTIVE SYSTEM,3,Major,Major,Surgical,Medicare,Medicaid,,,,N,60389.32,16609.21
New York City,Manhattan,7002054,001464,New York-Presbyterian Hospital - Columbia Presbyterian Center,30 to 49,109,F,Other Race,Spanish/Hispanic,2,Elective,Home or Self Care,2022,DIG010,Abdominal hernia,RES011,DIAPHRAGMATIC HERNIA REPAIR,220,"MAJOR STOMACH, ESOPHAGEAL AND DUODENAL PROCEDURES",06,DISEASES AND DISORDERS OF THE DIGESTIVE SYSTEM,1,Minor,Minor,Surgical,Private Health Insurance,,,,,N,80354.38,23433.29
New York City,Manhattan,7002054,001464,New York-Presbyterian Hospital - Columbia Presbyterian Center,70 or Older,OOS,M,White,Unknown,2,Elective,Home or Self Care,2022,DIG010,Abdominal hernia,RES011,DIAPHRAGMATIC HERNIA REPAIR,220,"MAJOR STOMACH, ESOPHAGEAL AND DUODENAL PROCEDURES",06,DISEASES AND DISORDERS OF THE DIGESTIVE SYSTEM,1,Minor,Minor,Surgical,Medicare,,,,,N,90913.53,25863.32
New York City,Manhattan,7002053,001463,NYU Langone Hospitals,50 to 69,115,M,White,Not Span/Hispanic,1,Elective,Home w/ Home Health Services,2022,DIG024,Postprocedural or postoperative digestive system complication,GIS025,OTHER GI SYSTEM DEVICE PROCEDURES,220,"MAJOR STOMACH, ESOPHAGEAL AND DUODENAL PROCEDURES",06,DISEASES AND DISORDERS OF THE DIGESTIVE SYSTEM,1,Minor,Moderate,Surgical,Medicare,Private Health Insurance,,,,N,163021.81,24906.43
New York City,Manhattan,7002054,001464,New York-Presbyterian Hospital - Columbia Presbyterian Center,70 or Older,109,M,Other Race,Unknown,1,Elective,Home w/ Home Health Services,2022,NEO021,Gastrointestinal cancers - all other types,GIS010,GASTRECTOMY,220,"MAJOR STOMACH, ESOPHAGEAL AND DUODENAL PROCEDURES",06,DISEASES AND DISORDERS OF THE DIGESTIVE SYSTEM,1,Minor,Minor,Surgical,Medicare,Private Health Insurance,,,,N,63044.97,18845.44
New York City,Manhattan,7002054,001464,New York-Presbyterian Hospital - Columbia Presbyterian Center,0 to 17,104,M,Other Race,Spanish/Hispanic,6,Emergency,Home or Self Care,2022,DIG021,Gastrointestinal hemorrhage,CAR028,INFERIOR VENA CAVA (IVC) FILTER PROCEDURES,220,"MAJOR STOMACH, ESOPHAGEAL AND DUODENAL PROCEDURES",06,DISEASES AND DISORDERS OF THE DIGESTIVE SYSTEM,3,Major,Major,Surgical,Medicaid,,,,,Y,154649.78,49065.31
New York City,Manhattan,7002053,001463,NYU Langone Hospitals,50 to 69,100,M,Black/African American,Not Span/Hispanic,3,Elective,Home or Self Care,2022,NEO013,Gastrointestinal cancers - stomach,GIS010,GASTRECTOMY,220,"MAJOR STOMACH, ESOPHAGEAL AND DUODENAL PROCEDURES",06,DISEASES AND DISORDERS OF THE DIGESTIVE SYSTEM,1,Minor,Minor,Surgical,Private Health Insurance,,,,,N,182995.78,34413.15
New York City,Manhattan,7002053,001463,NYU Langone Hospitals,50 to 69,OOS,F,White,Not Span/Hispanic,1,Emergency,Home or Self Care,2022,DIG024,Postprocedural or postoperative digestive system complication,GIS025,OTHER GI SYSTEM DEVICE PROCEDURES,220,"MAJOR STOMACH, ESOPHAGEAL AND DUODENAL PROCEDURES",06,DISEASES AND DISORDERS OF THE DIGESTIVE SYSTEM,3,Major,Moderate,Surgical,Private Health Insurance,Medicare,,,,Y,106659.07,17697.99
New York City,Manhattan,7002053,001463,NYU Langone Hospitals,50 to 69,111,M,White,Not Span/Hispanic,46,Elective,Inpatient Rehabilitation Facility,2022,NEO014,Gastrointestinal cancers - small intestine,GIS012,DUODENAL RESECTION,220,"MAJOR STOMACH, ESOPHAGEAL AND DUODENAL PROCEDURES",06,DISEASES AND DISORDERS OF THE DIGESTIVE SYSTEM,4,Extreme,Extreme,Surgical,Private Health Insurance,,,,,N,2491791.15,472925.14
New York City,Manhattan,7002001,001438,Bellevue Hospital Center,50 to 69,112,M,Other Race,Unknown,1,Elective,Home or Self Care,2022,DIG004,Esophageal disorders,GIS026,"UPPER GI THERAPEUTIC PROCEDURES, NEC (OPEN AND LAPAROSCOPIC)",220,"MAJOR STOMACH, ESOPHAGEAL AND DUODENAL PROCEDURES",06,DISEASES AND DISORDERS OF THE DIGESTIVE SYSTEM,1,Minor,Moderate,Surgical,Private Health Insurance,,,,,N,27086.35,15576.93
New York City,Manhattan,7002054,001464,New York-Presbyterian Hospital - Columbia Presbyterian Center,30 to 49,104,F,White,Spanish/Hispanic,2,Elective,Home or Self Care,2022,DIG010,Abdominal hernia,RES011,DIAPHRAGMATIC HERNIA REPAIR,220,"MAJOR STOMACH, ESOPHAGEAL AND DUODENAL PROCEDURES",06,DISEASES AND DISORDERS OF THE DIGESTIVE SYSTEM,1,Minor,Minor,Surgical,Medicaid,,,,,N,81643.41,21623.52
New York City,Manhattan,7002054,001464,New York-Presbyterian Hospital - Columbia Presbyterian Center,50 to 69,,F,Black/African American,Spanish/Hispanic,1,Emergency,Home or Self Care,2022,DIG012,Intestinal obstruction and ileus,GIS022,GI SYSTEM LYSIS OF ADHESIONS,220,"MAJOR STOMACH, ESOPHAGEAL AND DUODENAL PROCEDURES",06,DISEASES AND DISORDERS OF THE DIGESTIVE SYSTEM,1,Minor,Minor,Surgical,Medicaid,,,,,Y,56235.73,15362.55
Finger Lakes,Monroe,2701005,000413,Strong Memorial Hospital,50 to 69,,F,White,Unknown,2,Elective,Home or Self Care,2022,DIG010,Abdominal hernia,RES011,DIAPHRAGMATIC HERNIA REPAIR,220,"MAJOR STOMACH, ESOPHAGEAL AND DUODENAL PROCEDURES",06,DISEASES AND DISORDERS OF THE DIGESTIVE SYSTEM,1,Minor,Minor,Surgical,Blue Cross/Blue Shield,,,,,N,49673.80,24443.31
Finger Lakes,Monroe,2701005,000413,Strong Memorial Hospital,30 to 49,144,F,Multi-racial,Unknown,1,Elective,Home or Self Care,2022,DIG004,Esophageal disorders,GIS026,"UPPER GI THERAPEUTIC PROCEDURES, NEC (OPEN AND LAPAROSCOPIC)",220,"MAJOR STOMACH, ESOPHAGEAL AND DUODENAL PROCEDURES",06,DISEASES AND DISORDERS OF THE DIGESTIVE SYSTEM,1,Minor,Minor,Surgical,Private Health Insurance,,,,,N,36225.52,16948.86
New York City,Manhattan,7002053,001463,NYU Langone Hospitals,50 to 69,OOS,F,White,Not Span/Hispanic,3,Elective,Home or Self Care,2022,DIG004,Esophageal disorders,GIS014,ESOPHAGECTOMY,220,"MAJOR STOMACH, ESOPHAGEAL AND DUODENAL PROCEDURES",06,DISEASES AND DISORDERS OF THE DIGESTIVE SYSTEM,1,Minor,Minor,Surgical,Private Health Insurance,,,,,N,221019.31,39141.99
New York City,Manhattan,7002054,001464,New York-Presbyterian Hospital - Columbia Presbyterian Center,30 to 49,104,F,Black/African American,Not Span/Hispanic,6,Emergency,Home or Self Care,2022,NEO070,Secondary malignancies,GIS010,GASTRECTOMY,220,"MAJOR STOMACH, ESOPHAGEAL AND DUODENAL PROCEDURES",06,DISEASES AND DISORDERS OF THE DIGESTIVE SYSTEM,1,Minor,Moderate,Surgical,Private Health Insurance,,,,,Y,121975.88,29421.72
New York City,Manhattan,7002054,001464,New York-Presbyterian Hospital - Columbia Presbyterian Center,30 to 49,104,F,Other Race,Spanish/Hispanic,2,Elective,Home or Self Care,2022,DIG024,Postprocedural or postoperative digestive system complication,GIS019,GASTRO-JEJUNAL BYPASS (INCLUDING BARIATRIC),220,"MAJOR STOMACH, ESOPHAGEAL AND DUODENAL PROCEDURES",06,DISEASES AND DISORDERS OF THE DIGESTIVE SYSTEM,3,Major,Minor,Surgical,Medicaid,,,,,N,90026.40,26675.55
New York City,Manhattan,7002054,001464,New York-Presbyterian Hospital - Columbia Presbyterian Center,30 to 49,OOS,M,Other Race,Spanish/Hispanic,15,Emergency,Home or Self Care,2022,DIG024,Postprocedural or postoperative digestive system complication,GIS019,GASTRO-JEJUNAL BYPASS (INCLUDING BARIATRIC),220,"MAJOR STOMACH, ESOPHAGEAL AND DUODENAL PROCEDURES",06,DISEASES AND DISORDERS OF THE DIGESTIVE SYSTEM,4,Extreme,Major,Surgical,Medicaid,,,,,Y,284526.90,66225.26
New York City,Manhattan,7002054,001464,New York-Presbyterian Hospital - Columbia Presbyterian Center,50 to 69,112,F,White,Not Span/Hispanic,2,Elective,Home or Self Care,2022,DIG024,Postprocedural or postoperative digestive system complication,GIS025,OTHER GI SYSTEM DEVICE PROCEDURES,220,"MAJOR STOMACH, ESOPHAGEAL AND DUODENAL PROCEDURES",06,DISEASES AND DISORDERS OF THE DIGESTIVE SYSTEM,2,Moderate,Minor,Surgical,Medicare,Private Health Insurance,,,,N,121807.28,33928.09
New York City,Manhattan,7002054,001464,New York-Presbyterian Hospital - Columbia Presbyterian Center,70 or Older,112,F,White,Not Span/Hispanic,2,Emergency,Home w/ Home Health Services,2022,DIG010,Abdominal hernia,RES011,DIAPHRAGMATIC HERNIA REPAIR,220,"MAJOR STOMACH, ESOPHAGEAL AND DUODENAL PROCEDURES",06,DISEASES AND DISORDERS OF THE DIGESTIVE SYSTEM,1,Minor,Moderate,Surgical,Medicare,Medicaid,,,,Y,85568.90,23000.61
New York City,Manhattan,7002053,001463,NYU Langone Hospitals,70 or Older,106,F,Black/African American,Not Span/Hispanic,4,Elective,Home w/ Home Health Services,2022,NEO013,Gastrointestinal cancers - stomach,GIS010,GASTRECTOMY,220,"MAJOR STOMACH, ESOPHAGEAL AND DUODENAL PROCEDURES",06,DISEASES AND DISORDERS OF THE DIGESTIVE SYSTEM,2,Moderate,Moderate,Surgical,Medicare,,,,,N,222080.51,42433.73
New York City,Manhattan,7002053,001463,NYU Langone Hospitals,50 to 69,113,F,White,Not Span/Hispanic,1,Elective,Home or Self Care,2022,DIG005,Gastroduodenal ulcer,GIS019,GASTRO-JEJUNAL BYPASS (INCLUDING BARIATRIC),220,"MAJOR STOMACH, ESOPHAGEAL AND DUODENAL PROCEDURES",06,DISEASES AND DISORDERS OF THE DIGESTIVE SYSTEM,2,Moderate,Minor,Surgical,Medicaid,,,,,N,149233.89,22468.56
New York City,Manhattan,7002053,001463,NYU Langone Hospitals,50 to 69,112,M,White,Not Span/Hispanic,14,Emergency,Home or Self Care,2022,DIG008,Other specified and unspecified disorders of stomach and duodenum,GIS019,GASTRO-JEJUNAL BYPASS (INCLUDING BARIATRIC),220,"MAJOR STOMACH, ESOPHAGEAL AND DUODENAL PROCEDURES",06,DISEASES AND DISORDERS OF THE DIGESTIVE SYSTEM,3,Major,Moderate,Surgical,Medicaid,,,,,Y,467874.70,106922.97
New York City,Manhattan,7002053,001463,NYU Langone Hospitals,50 to 69,112,F,White,Not Span/Hispanic,4,Elective,Home or Self Care,2022,DIG010,Abdominal hernia,RES011,DIAPHRAGMATIC HERNIA REPAIR,220,"MAJOR STOMACH, ESOPHAGEAL AND DUODENAL PROCEDURES",06,DISEASES AND DISORDERS OF THE DIGESTIVE SYSTEM,2,Moderate,Minor,Surgical,Private Health Insurance,,,,,N,229427.52,43517.12
New York City,Manhattan,7002053,001463,NYU Langone Hospitals,70 or Older,100,F,White,Not Span/Hispanic,1,Elective,Home or Self Care,2022,DIG010,Abdominal hernia,RES011,DIAPHRAGMATIC HERNIA REPAIR,220,"MAJOR STOMACH, ESOPHAGEAL AND DUODENAL PROCEDURES",06,DISEASES AND DISORDERS OF THE DIGESTIVE SYSTEM,1,Minor,Minor,Surgical,Medicare,Blue Cross/Blue Shield,,,,N,159793.26,24947.65
New York City,Manhattan,7002053,001463,NYU Langone Hospitals,70 or Older,,F,White,Not Span/Hispanic,2,Elective,Home or Self Care,2022,DIG010,Abdominal hernia,RES011,DIAPHRAGMATIC HERNIA REPAIR,220,"MAJOR STOMACH, ESOPHAGEAL AND DUODENAL PROCEDURES",06,DISEASES AND DISORDERS OF THE DIGESTIVE SYSTEM,1,Minor,Minor,Surgical,Medicare,Blue Cross/Blue Shield,,,,N,151248.14,26824.72
New York City,Manhattan,7002053,001463,NYU Langone Hospitals,70 or Older,117,M,White,Not Span/Hispanic,5,Elective,Home or Self Care,2022,NEO013,Gastrointestinal cancers - stomach,GIS014,ESOPHAGECTOMY,220,"MAJOR STOMACH, ESOPHAGEAL AND DUODENAL PROCEDURES",06,DISEASES AND DISORDERS OF THE DIGESTIVE SYSTEM,3,Major,Moderate,Surgical,Medicare,Private Health Insurance,,,,N,357214.24,66405.11
Finger Lakes,Monroe,2701005,000413,Strong Memorial Hospital,50 to 69,144,M,White,Not Span/Hispanic,25,Emergency,Home w/ Home Health Services,2022,DIG024,Postprocedural or postoperative digestive system complication,GIS010,GASTRECTOMY,220,"MAJOR STOMACH, ESOPHAGEAL AND DUODENAL PROCEDURES",06,DISEASES AND DISORDERS OF THE DIGESTIVE SYSTEM,4,Extreme,Extreme,Surgical,Blue Cross/Blue Shield,Medicare,,,,Y,295228.05,117340.76
Finger Lakes,Monroe,2701005,000413,Strong Memorial Hospital,50 to 69,131,M,White,Not Span/Hispanic,7,Elective,Home w/ Home Health Services,2022,NEO012,Gastrointestinal cancers - esophagus,GIS010,GASTRECTOMY,220,"MAJOR STOMACH, ESOPHAGEAL AND DUODENAL PROCEDURES",06,DISEASES AND DISORDERS OF THE DIGESTIVE SYSTEM,2,Moderate,Major,Surgical,Medicare,Blue Cross/Blue Shield,,,,N,131637.68,60800.23
Finger Lakes,Monroe,2701005,000413,Strong Memorial Hospital,18 to 29,146,M,Black/African American,Spanish/Hispanic,5,Emergency,Home or Self Care,2022,INJ010,"Internal organ injury, initial encounter",GIS021,GI SYSTEM REPAIR (EXCLUDING ANORECTAL),220,"MAJOR STOMACH, ESOPHAGEAL AND DUODENAL PROCEDURES",06,DISEASES AND DISORDERS OF THE DIGESTIVE SYSTEM,3,Major,Minor,Surgical,Medicaid,,,,,Y,54943.16,22704.49
Finger Lakes,Monroe,2701005,000413,Strong Memorial Hospital,50 to 69,144,M,White,Not Span/Hispanic,8,Elective,Home w/ Home Health Services,2022,NEO014,Gastrointestinal cancers - small intestine,GIS026,"UPPER GI THERAPEUTIC PROCEDURES, NEC (OPEN AND LAPAROSCOPIC)",220,"MAJOR STOMACH, ESOPHAGEAL AND DUODENAL PROCEDURES",06,DISEASES AND DISORDERS OF THE DIGESTIVE SYSTEM,3,Major,Minor,Surgical,Medicaid,,,,,N,72011.00,34553.44
Finger Lakes,Monroe,2701005,000413,Strong Memorial Hospital,50 to 69,144,M,White,Not Span/Hispanic,8,Elective,Home w/ Home Health Services,2022,NEO013,Gastrointestinal cancers - stomach,GIS010,GASTRECTOMY,220,"MAJOR STOMACH, ESOPHAGEAL AND DUODENAL PROCEDURES",06,DISEASES AND DISORDERS OF THE DIGESTIVE SYSTEM,3,Major,Minor,Surgical,Medicare,Private Health Insurance,,,,N,103075.33,48021.60
New York City,Manhattan,7002054,001464,New York-Presbyterian Hospital - Columbia Presbyterian Center,50 to 69,114,F,White,Not Span/Hispanic,1,Elective,Home or Self Care,2022,DIG010,Abdominal hernia,GIS026,"UPPER GI THERAPEUTIC PROCEDURES, NEC (OPEN AND LAPAROSCOPIC)",220,"MAJOR STOMACH, ESOPHAGEAL AND DUODENAL PROCEDURES",06,DISEASES AND DISORDERS OF THE DIGESTIVE SYSTEM,1,Minor,Minor,Surgical,Medicaid,,,,,N,55176.51,20554.07
New York City,Manhattan,7002054,001464,New York-Presbyterian Hospital - Columbia Presbyterian Center,50 to 69,100,F,Black/African American,Not Span/Hispanic,7,Elective,Home w/ Home Health Services,2022,DIG010,Abdominal hernia,RES011,DIAPHRAGMATIC HERNIA REPAIR,220,"MAJOR STOMACH, ESOPHAGEAL AND DUODENAL PROCEDURES",06,DISEASES AND DISORDERS OF THE DIGESTIVE SYSTEM,2,Moderate,Minor,Surgical,Medicare,Medicaid,,,,N,171402.03,45545.48
New York City,Manhattan,7002054,001464,New York-Presbyterian Hospital - Columbia Presbyterian Center,70 or Older,104,M,Other Race,Spanish/Hispanic,4,Elective,Home or Self Care,2022,NEO013,Gastrointestinal cancers - stomach,GIS019,GASTRO-JEJUNAL BYPASS (INCLUDING BARIATRIC),220,"MAJOR STOMACH, ESOPHAGEAL AND DUODENAL PROCEDURES",06,DISEASES AND DISORDERS OF THE DIGESTIVE SYSTEM,2,Moderate,Moderate,Surgical,Medicare,Medicaid,,,,N,111459.30,27114.20
Finger Lakes,Monroe,2701005,000413,Strong Memorial Hospital,50 to 69,,M,Other Race,Not Span/Hispanic,5,Elective,Home or Self Care,2022,NEO012,Gastrointestinal cancers - esophagus,GIS014,ESOPHAGECTOMY,220,"MAJOR STOMACH, ESOPHAGEAL AND DUODENAL PROCEDURES",06,DISEASES AND DISORDERS OF THE DIGESTIVE SYSTEM,3,Major,Minor,Surgical,Private Health Insurance,,,,,N,117812.04,55392.08
New York City,Manhattan,7002053,001463,NYU Langone Hospitals,30 to 49,100,F,Black/African American,Not Span/Hispanic,1,Elective,Home w/ Home Health Services,2022,DIG004,Esophageal disorders,GIS019,GASTRO-JEJUNAL BYPASS (INCLUDING BARIATRIC),220,"MAJOR STOMACH, ESOPHAGEAL AND DUODENAL PROCEDURES",06,DISEASES AND DISORDERS OF THE DIGESTIVE SYSTEM,1,Minor,Minor,Surgical,Private Health Insurance,,,,,N,212123.58,32048.80
New York City,Manhattan,7002053,001463,NYU Langone Hospitals,50 to 69,103,F,White,Not Span/Hispanic,2,Urgent,Home or Self Care,2022,DIG024,Postprocedural or postoperative digestive system complication,GIS019,GASTRO-JEJUNAL BYPASS (INCLUDING BARIATRIC),220,"MAJOR STOMACH, ESOPHAGEAL AND DUODENAL PROCEDURES",06,DISEASES AND DISORDERS OF THE DIGESTIVE SYSTEM,2,Moderate,Moderate,Surgical,Private Health Insurance,,,,,N,138400.26,24560.93
New York City,Manhattan,7002053,001463,NYU Langone Hospitals,30 to 49,115,F,White,Not Span/Hispanic,5,Emergency,Home w/ Home Health Services,2022,DIG024,Postprocedural or postoperative digestive system complication,GIS025,OTHER GI SYSTEM DEVICE PROCEDURES,220,"MAJOR STOMACH, ESOPHAGEAL AND DUODENAL PROCEDURES",06,DISEASES AND DISORDERS OF THE DIGESTIVE SYSTEM,2,Moderate,Minor,Surgical,Blue Cross/Blue Shield,,,,,N,128771.59,32979.46
New York City,Manhattan,7002001,001438,Bellevue Hospital Center,70 or Older,112,F,Other Race,Spanish/Hispanic,1,Elective,Home or Self Care,2022,DIG004,Esophageal disorders,GIS026,"UPPER GI THERAPEUTIC PROCEDURES, NEC (OPEN AND LAPAROSCOPIC)",220,"MAJOR STOMACH, ESOPHAGEAL AND DUODENAL PROCEDURES",06,DISEASES AND DISORDERS OF THE DIGESTIVE SYSTEM,1,Minor,Minor,Surgical,Medicare,Medicaid,,,,N,26855.13,15443.96
New York City,Manhattan,7002054,001464,New York-Presbyterian Hospital - Columbia Presbyterian Center,70 or Older,105,M,White,Not Span/Hispanic,10,Elective,Home w/ Home Health Services,2022,NEO072,Neoplasms of unspecified nature or uncertain behavior,GIS010,GASTRECTOMY,220,"MAJOR STOMACH, ESOPHAGEAL AND DUODENAL PROCEDURES",06,DISEASES AND DISORDERS OF THE DIGESTIVE SYSTEM,3,Major,Moderate,Surgical,Medicare,,,,,N,277157.18,120331.96
New York City,Manhattan,7002054,001464,New York-Presbyterian Hospital - Columbia Presbyterian Center,70 or Older,OOS,F,White,Not Span/Hispanic,3,Elective,Home or Self Care,2022,DIG010,Abdominal hernia,RES011,DIAPHRAGMATIC HERNIA REPAIR,220,"MAJOR STOMACH, ESOPHAGEAL AND DUODENAL PROCEDURES",06,DISEASES AND DISORDERS OF THE DIGESTIVE SYSTEM,1,Minor,Minor,Surgical,Medicare,Medicaid,,,,N,120393.86,33646.28
New York City,Manhattan,7002054,001464,New York-Presbyterian Hospital - Columbia Presbyterian Center,70 or Older,112,F,Other Race,Unknown,4,Elective,Home or Self Care,2022,DIG010,Abdominal hernia,RES011,DIAPHRAGMATIC HERNIA REPAIR,220,"MAJOR STOMACH, ESOPHAGEAL AND DUODENAL PROCEDURES",06,DISEASES AND DISORDERS OF THE DIGESTIVE SYSTEM,1,Minor,Minor,Surgical,Medicare,,,,,N,89669.36,23948.55
New York City,Manhattan,7002054,001464,New York-Presbyterian Hospital - Columbia Presbyterian Center,50 to 69,OOS,F,White,Not Span/Hispanic,4,Elective,Home or Self Care,2022,DIG004,Esophageal disorders,GIS019,GASTRO-JEJUNAL BYPASS (INCLUDING BARIATRIC),220,"MAJOR STOMACH, ESOPHAGEAL AND DUODENAL PROCEDURES",06,DISEASES AND DISORDERS OF THE DIGESTIVE SYSTEM,1,Minor,Moderate,Surgical,Private Health Insurance,,,,,N,114074.20,27782.94
New York City,Manhattan,7002054,001464,New York-Presbyterian Hospital - Columbia Presbyterian Center,70 or Older,106,M,White,Not Span/Hispanic,13,Urgent,Medicare Cert Long Term Care Hospital,2022,DIG010,Abdominal hernia,RES011,DIAPHRAGMATIC HERNIA REPAIR,220,"MAJOR STOMACH, ESOPHAGEAL AND DUODENAL PROCEDURES",06,DISEASES AND DISORDERS OF THE DIGESTIVE SYSTEM,2,Moderate,Major,Surgical,Medicare,Private Health Insurance,,,,N,385416.85,139895.85
New York City,Manhattan,7002054,001464,New York-Presbyterian Hospital - Columbia Presbyterian Center,70 or Older,112,F,White,Spanish/Hispanic,10,Emergency,Home or Self Care,2022,SYM006,Abdominal pain and other digestive/abdomen signs and symptoms,GIS019,GASTRO-JEJUNAL BYPASS (INCLUDING BARIATRIC),220,"MAJOR STOMACH, ESOPHAGEAL AND DUODENAL PROCEDURES",06,DISEASES AND DISORDERS OF THE DIGESTIVE SYSTEM,2,Moderate,Minor,Surgical,Medicare,,,,,Y,175242.22,42912.78
New York City,Manhattan,7002054,001464,New York-Presbyterian Hospital - Columbia Presbyterian Center,70 or Older,100,M,Other Race,Unknown,2,Elective,Home or Self Care,2022,DIG010,Abdominal hernia,RES011,DIAPHRAGMATIC HERNIA REPAIR,220,"MAJOR STOMACH, ESOPHAGEAL AND DUODENAL PROCEDURES",06,DISEASES AND DISORDERS OF THE DIGESTIVE SYSTEM,1,Minor,Minor,Surgical,Medicare,,,,,N,76302.22,30967.28
Long Island,Nassau,2951001,000541,North Shore University Hospital,50 to 69,103,M,White,Not Span/Hispanic,2,Elective,Home or Self Care,2022,DIG010,Abdominal hernia,GIS019,GASTRO-JEJUNAL BYPASS (INCLUDING BARIATRIC),220,"MAJOR STOMACH, ESOPHAGEAL AND DUODENAL PROCEDURES",06,DISEASES AND DISORDERS OF THE DIGESTIVE SYSTEM,1,Minor,Minor,Surgical,Blue Cross/Blue Shield,Medicare,,,,N,84498.22,16330.36
Long Island,Nassau,2951001,000541,North Shore University Hospital,50 to 69,113,F,White,Not Span/Hispanic,1,Elective,Home or Self Care,2022,DIG010,Abdominal hernia,RES011,DIAPHRAGMATIC HERNIA REPAIR,220,"MAJOR STOMACH, ESOPHAGEAL AND DUODENAL PROCEDURES",06,DISEASES AND DISORDERS OF THE DIGESTIVE SYSTEM,1,Minor,Minor,Surgical,Private Health Insurance,,,,,N,47935.09,9015.90
New York City,Manhattan,7002001,001438,Bellevue Hospital Center,70 or Older,112,M,Black/African American,Unknown,3,Elective,Home w/ Home Health Services,2022,DIG004,Esophageal disorders,GIS026,"UPPER GI THERAPEUTIC PROCEDURES, NEC (OPEN AND LAPAROSCOPIC)",220,"MAJOR STOMACH, ESOPHAGEAL AND DUODENAL PROCEDURES",06,DISEASES AND DISORDERS OF THE DIGESTIVE SYSTEM,1,Minor,Moderate,Surgical,Medicare,,,,,N,49181.22,28283.33
New York City,Manhattan,7002054,001464,New York-Presbyterian Hospital - Columbia Presbyterian Center,50 to 69,113,M,White,Not Span/Hispanic,2,Elective,Home or Self Care,2022,DIG025,Other specified and unspecified gastrointestinal disorders,CNS014,"CNS PROCEDURES, NEC",220,"MAJOR STOMACH, ESOPHAGEAL AND DUODENAL PROCEDURES",06,DISEASES AND DISORDERS OF THE DIGESTIVE SYSTEM,2,Moderate,Major,Surgical,Medicare,Medicaid,,,,N,98883.89,27761.68
New York City,Manhattan,7002054,001464,New York-Presbyterian Hospital - Columbia Presbyterian Center,70 or Older,105,M,White,Not Span/Hispanic,4,Elective,Expired,2022,DIG008,Other specified and unspecified disorders of stomach and duodenum,GIS019,GASTRO-JEJUNAL BYPASS (INCLUDING BARIATRIC),220,"MAJOR STOMACH, ESOPHAGEAL AND DUODENAL PROCEDURES",06,DISEASES AND DISORDERS OF THE DIGESTIVE SYSTEM,4,Extreme,Extreme,Surgical,Medicare,Private Health Insurance,,,,N,237729.49,74122.22
New York City,Manhattan,7002053,001463,NYU Langone Hospitals,70 or Older,111,M,White,Not Span/Hispanic,13,Elective,Home w/ Home Health Services,2022,NEO013,Gastrointestinal cancers - stomach,GIS010,GASTRECTOMY,220,"MAJOR STOMACH, ESOPHAGEAL AND DUODENAL PROCEDURES",06,DISEASES AND DISORDERS OF THE DIGESTIVE SYSTEM,4,Extreme,Major,Surgical,Medicare,Private Health Insurance,,,,N,487072.42,107404.88
New York City,Manhattan,7002053,001463,NYU Langone Hospitals,70 or Older,113,F,White,Not Span/Hispanic,1,Elective,Home or Self Care,2022,DIG010,Abdominal hernia,RES011,DIAPHRAGMATIC HERNIA REPAIR,220,"MAJOR STOMACH, ESOPHAGEAL AND DUODENAL PROCEDURES",06,DISEASES AND DISORDERS OF THE DIGESTIVE SYSTEM,1,Minor,Minor,Surgical,Medicare,,,,,N,158310.53,24757.59
New York City,Manhattan,7002001,001438,Bellevue Hospital Center,50 to 69,100,F,White,Unknown,1,Elective,Home or Self Care,2022,DIG010,Abdominal hernia,RES011,DIAPHRAGMATIC HERNIA REPAIR,220,"MAJOR STOMACH, ESOPHAGEAL AND DUODENAL PROCEDURES",06,DISEASES AND DISORDERS OF THE DIGESTIVE SYSTEM,1,Minor,Minor,Surgical,Medicaid,,,,,N,28404.67,16335.07