Hospital Service Area,Hospital County,Operating Certificate Number,Permanent Facility Id,Facility Name,Age Group,Zip Code - 3 digits,Gender,Race,Ethnicity,Length of Stay,Type of Admission,Patient Disposition,Discharge Year,CCS Diagnosis Code,CCS Diagnosis Description,CCS Procedure Code,CCS Procedure Description,APR DRG Code,APR DRG Description,APR MDC Code,APR MDC Description,APR Severity of Illness Code,APR Severity of Illness Description,APR Risk of Mortality,APR Medical Surgical Description,Payment Typology 1,Payment Typology 2,Payment Typology 3,Birth Weight,Abortion Edit Indicator,Emergency Department Indicator,Total Charges,Total Costs
New York City,Manhattan,7002054,001464,New York-Presbyterian Hospital - Columbia Presbyterian Center,30 to 49,100,F,Other Race,Spanish/Hispanic,2,Emergency,Home or Self Care,2022,DIG009,Appendicitis and other appendiceal conditions,GIS008,APPENDECTOMY,234,APPENDECTOMY WITHOUT COMPLEX PRINCIPAL DIAGNOSIS,06,DISEASES AND DISORDERS OF THE DIGESTIVE SYSTEM,1,Minor,Minor,Surgical,Medicaid,,,,,Y,57589.91,14653.78
New York City,Manhattan,7002054,001464,New York-Presbyterian Hospital - Columbia Presbyterian Center,18 to 29,100,F,White,Spanish/Hispanic,1,Emergency,Home or Self Care,2022,DIG009,Appendicitis and other appendiceal conditions,GIS008,APPENDECTOMY,234,APPENDECTOMY WITHOUT COMPLEX PRINCIPAL DIAGNOSIS,06,DISEASES AND DISORDERS OF THE DIGESTIVE SYSTEM,2,Moderate,Moderate,Surgical,Self-Pay,,,,,Y,49954.84,13342.55
New York City,Manhattan,7002001,001438,Bellevue Hospital Center,30 to 49,112,F,Other Race,Spanish/Hispanic,1,Emergency,Home or Self Care,2022,DIG009,Appendicitis and other appendiceal conditions,GIS008,APPENDECTOMY,234,APPENDECTOMY WITHOUT COMPLEX PRINCIPAL DIAGNOSIS,06,DISEASES AND DISORDERS OF THE DIGESTIVE SYSTEM,2,Moderate,Minor,Surgical,Medicaid,,,,,Y,21990.42,12646.34
New York City,Manhattan,7002001,001438,Bellevue Hospital Center,0 to 17,112,F,Other Race,Unknown,1,Emergency,Home or Self Care,2022,DIG009,Appendicitis and other appendiceal conditions,GIS008,APPENDECTOMY,234,APPENDECTOMY WITHOUT COMPLEX PRINCIPAL DIAGNOSIS,06,DISEASES AND DISORDERS OF THE DIGESTIVE SYSTEM,1,Minor,Minor,Surgical,Private Health Insurance,,,,,Y,25825.20,14851.66
New York City,Manhattan,7002001,001438,Bellevue Hospital Center,30 to 49,114,F,Black/African American,Unknown,1,Emergency,Home or Self Care,2022,DIG009,Appendicitis and other appendiceal conditions,GIS008,APPENDECTOMY,234,APPENDECTOMY WITHOUT COMPLEX PRINCIPAL DIAGNOSIS,06,DISEASES AND DISORDERS OF THE DIGESTIVE SYSTEM,2,Moderate,Minor,Surgical,Medicaid,,,,,Y,24812.26,14269.13
New York City,Manhattan,7002053,001463,NYU Langone Hospitals,30 to 49,112,F,White,Not Span/Hispanic,1,Emergency,Home or Self Care,2022,DIG009,Appendicitis and other appendiceal conditions,GIS008,APPENDECTOMY,234,APPENDECTOMY WITHOUT COMPLEX PRINCIPAL DIAGNOSIS,06,DISEASES AND DISORDERS OF THE DIGESTIVE SYSTEM,2,Moderate,Minor,Surgical,Private Health Insurance,,,,,Y,74451.69,13001.38
New York City,Manhattan,7002053,001463,NYU Langone Hospitals,50 to 69,OOS,F,White,Not Span/Hispanic,1,Emergency,Home or Self Care,2022,DIG009,Appendicitis and other appendiceal conditions,GIS008,APPENDECTOMY,234,APPENDECTOMY WITHOUT COMPLEX PRINCIPAL DIAGNOSIS,06,DISEASES AND DISORDERS OF THE DIGESTIVE SYSTEM,1,Minor,Minor,Surgical,Private Health Insurance,,,,,Y,70335.74,12588.36
New York City,Manhattan,7002053,001463,NYU Langone Hospitals,50 to 69,112,M,White,Not Span/Hispanic,4,Emergency,Home or Self Care,2022,DIG009,Appendicitis and other appendiceal conditions,GIS008,APPENDECTOMY,234,APPENDECTOMY WITHOUT COMPLEX PRINCIPAL DIAGNOSIS,06,DISEASES AND DISORDERS OF THE DIGESTIVE SYSTEM,3,Major,Major,Surgical,Private Health Insurance,,,,,Y,119870.43,28293.05
New York City,Manhattan,7002001,001438,Bellevue Hospital Center,30 to 49,112,F,Other Race,Unknown,1,Emergency,Home or Self Care,2022,DIG009,Appendicitis and other appendiceal conditions,GIS008,APPENDECTOMY,234,APPENDECTOMY WITHOUT COMPLEX PRINCIPAL DIAGNOSIS,06,DISEASES AND DISORDERS OF THE DIGESTIVE SYSTEM,1,Minor,Minor,Surgical,Private Health Insurance,Private Health Insurance,,,,Y,23043.01,13251.67
New York City,Manhattan,7002001,001438,Bellevue Hospital Center,30 to 49,114,F,Other Race,Spanish/Hispanic,1,Emergency,Home or Self Care,2022,DIG009,Appendicitis and other appendiceal conditions,GIS008,APPENDECTOMY,234,APPENDECTOMY WITHOUT COMPLEX PRINCIPAL DIAGNOSIS,06,DISEASES AND DISORDERS OF THE DIGESTIVE SYSTEM,3,Major,Major,Surgical,Private Health Insurance,,,,,Y,30499.57,17539.81
New York City,Manhattan,7002054,001464,New York-Presbyterian Hospital - Columbia Presbyterian Center,18 to 29,100,M,Other Race,Unknown,1,Emergency,Home or Self Care,2022,DIG009,Appendicitis and other appendiceal conditions,GIS008,APPENDECTOMY,234,APPENDECTOMY WITHOUT COMPLEX PRINCIPAL DIAGNOSIS,06,DISEASES AND DISORDERS OF THE DIGESTIVE SYSTEM,1,Minor,Minor,Surgical,Private Health Insurance,,,,,Y,44892.99,12241.97
New York City,Manhattan,7002001,001438,Bellevue Hospital Center,30 to 49,113,F,Other Race,Spanish/Hispanic,1,Emergency,Home or Self Care,2022,DIG009,Appendicitis and other appendiceal conditions,GIS008,APPENDECTOMY,234,APPENDECTOMY WITHOUT COMPLEX PRINCIPAL DIAGNOSIS,06,DISEASES AND DISORDERS OF THE DIGESTIVE SYSTEM,1,Minor,Minor,Surgical,Medicaid,,,,,Y,25342.87,14574.28
New York City,Manhattan,7002054,001464,New York-Presbyterian Hospital - Columbia Presbyterian Center,0 to 17,109,F,White,Not Span/Hispanic,2,Emergency,Home or Self Care,2022,DIG009,Appendicitis and other appendiceal conditions,GIS008,APPENDECTOMY,234,APPENDECTOMY WITHOUT COMPLEX PRINCIPAL DIAGNOSIS,06,DISEASES AND DISORDERS OF THE DIGESTIVE SYSTEM,1,Minor,Minor,Surgical,Private Health Insurance,,,,,Y,72469.68,19521.59
New York City,Manhattan,7002054,001464,New York-Presbyterian Hospital - Columbia Presbyterian Center,0 to 17,104,F,White,Spanish/Hispanic,1,Emergency,Home or Self Care,2022,DIG009,Appendicitis and other appendiceal conditions,GIS008,APPENDECTOMY,234,APPENDECTOMY WITHOUT COMPLEX PRINCIPAL DIAGNOSIS,06,DISEASES AND DISORDERS OF THE DIGESTIVE SYSTEM,1,Minor,Minor,Surgical,Medicaid,,,,,Y,42363.03,11366.13
New York City,Manhattan,7002053,001463,NYU Langone Hospitals,30 to 49,,M,White,Not Span/Hispanic,1,Elective,Home or Self Care,2022,DIG009,Appendicitis and other appendiceal conditions,GIS008,APPENDECTOMY,234,APPENDECTOMY WITHOUT COMPLEX PRINCIPAL DIAGNOSIS,06,DISEASES AND DISORDERS OF THE DIGESTIVE SYSTEM,1,Minor,Minor,Surgical,Private Health Insurance,,,,,N,87589.98,15247.81
New York City,Manhattan,7002053,001463,NYU Langone Hospitals,0 to 17,112,F,White,Not Span/Hispanic,1,Emergency,Home or Self Care,2022,DIG009,Appendicitis and other appendiceal conditions,GIS008,APPENDECTOMY,234,APPENDECTOMY WITHOUT COMPLEX PRINCIPAL DIAGNOSIS,06,DISEASES AND DISORDERS OF THE DIGESTIVE SYSTEM,2,Moderate,Moderate,Surgical,Medicaid,,,,,Y,61708.49,11555.45
New York City,Manhattan,7002053,001463,NYU Langone Hospitals,0 to 17,112,F,White,Not Span/Hispanic,1,Emergency,Home or Self Care,2022,DIG009,Appendicitis and other appendiceal conditions,GIS008,APPENDECTOMY,234,APPENDECTOMY WITHOUT COMPLEX PRINCIPAL DIAGNOSIS,06,DISEASES AND DISORDERS OF THE DIGESTIVE SYSTEM,1,Minor,Minor,Surgical,Medicaid,,,,,Y,68903.51,12537.37
New York City,Manhattan,7002054,001464,New York-Presbyterian Hospital - Columbia Presbyterian Center,0 to 17,112,M,White,Not Span/Hispanic,1,Emergency,Home or Self Care,2022,DIG009,Appendicitis and other appendiceal conditions,GIS008,APPENDECTOMY,234,APPENDECTOMY WITHOUT COMPLEX PRINCIPAL DIAGNOSIS,06,DISEASES AND DISORDERS OF THE DIGESTIVE SYSTEM,1,Minor,Minor,Surgical,Medicaid,,,,,Y,57660.79,15835.78
New York City,Manhattan,7002001,001438,Bellevue Hospital Center,0 to 17,113,M,Other Race,Spanish/Hispanic,1,Emergency,Home or Self Care,2022,DIG009,Appendicitis and other appendiceal conditions,GIS008,APPENDECTOMY,234,APPENDECTOMY WITHOUT COMPLEX PRINCIPAL DIAGNOSIS,06,DISEASES AND DISORDERS OF THE DIGESTIVE SYSTEM,1,Minor,Minor,Surgical,Medicaid,,,,,Y,22748.56,13082.33
Finger Lakes,Monroe,2701005,000413,Strong Memorial Hospital,0 to 17,144,F,White,Not Span/Hispanic,1,Emergency,Home or Self Care,2022,DIG009,Appendicitis and other appendiceal conditions,GIS008,APPENDECTOMY,234,APPENDECTOMY WITHOUT COMPLEX PRINCIPAL DIAGNOSIS,06,DISEASES AND DISORDERS OF THE DIGESTIVE SYSTEM,1,Minor,Minor,Surgical,Blue Cross/Blue Shield,,,,,Y,22267.66,9483.53
Finger Lakes,Monroe,2701005,000413,Strong Memorial Hospital,0 to 17,145,M,White,Not Span/Hispanic,1,Emergency,Home or Self Care,2022,DIG009,Appendicitis and other appendiceal conditions,GIS008,APPENDECTOMY,234,APPENDECTOMY WITHOUT COMPLEX PRINCIPAL DIAGNOSIS,06,DISEASES AND DISORDERS OF THE DIGESTIVE SYSTEM,1,Minor,Minor,Surgical,Blue Cross/Blue Shield,,,,,Y,20960.07,9641.72
Finger Lakes,Monroe,2701005,000413,Strong Memorial Hospital,0 to 17,146,M,Black/African American,Not Span/Hispanic,2,Emergency,Home or Self Care,2022,DIG009,Appendicitis and other appendiceal conditions,GIS008,APPENDECTOMY,234,APPENDECTOMY WITHOUT COMPLEX PRINCIPAL DIAGNOSIS,06,DISEASES AND DISORDERS OF THE DIGESTIVE SYSTEM,2,Moderate,Moderate,Surgical,Medicaid,,,,,Y,24869.73,11802.32
Finger Lakes,Monroe,2701005,000413,Strong Memorial Hospital,0 to 17,144,M,White,Not Span/Hispanic,1,Emergency,Home or Self Care,2022,DIG009,Appendicitis and other appendiceal conditions,GIS008,APPENDECTOMY,234,APPENDECTOMY WITHOUT COMPLEX PRINCIPAL DIAGNOSIS,06,DISEASES AND DISORDERS OF THE DIGESTIVE SYSTEM,1,Minor,Minor,Surgical,Medicaid,,,,,Y,21044.64,8733.63
New York City,Manhattan,7002053,001463,NYU Langone Hospitals,30 to 49,112,M,Black/African American,Not Span/Hispanic,1,Emergency,Home or Self Care,2022,DIG009,Appendicitis and other appendiceal conditions,GIS008,APPENDECTOMY,234,APPENDECTOMY WITHOUT COMPLEX PRINCIPAL DIAGNOSIS,06,DISEASES AND DISORDERS OF THE DIGESTIVE SYSTEM,2,Moderate,Minor,Surgical,Blue Cross/Blue Shield,,,,,Y,72654.78,13678.04
New York City,Manhattan,7002053,001463,NYU Langone Hospitals,0 to 17,113,M,White,Not Span/Hispanic,1,Emergency,Home or Self Care,2022,DIG009,Appendicitis and other appendiceal conditions,GIS008,APPENDECTOMY,234,APPENDECTOMY WITHOUT COMPLEX PRINCIPAL DIAGNOSIS,06,DISEASES AND DISORDERS OF THE DIGESTIVE SYSTEM,2,Moderate,Moderate,Surgical,Medicaid,,,,,Y,63482.30,10425.96
New York City,Manhattan,7002053,001463,NYU Langone Hospitals,30 to 49,113,M,White,Not Span/Hispanic,1,Emergency,Home or Self Care,2022,DIG009,Appendicitis and other appendiceal conditions,GIS008,APPENDECTOMY,234,APPENDECTOMY WITHOUT COMPLEX PRINCIPAL DIAGNOSIS,06,DISEASES AND DISORDERS OF THE DIGESTIVE SYSTEM,2,Moderate,Moderate,Surgical,Private Health Insurance,,,,,Y,71591.44,12886.76
New York City,Manhattan,7002001,001438,Bellevue Hospital Center,0 to 17,113,M,Other Race,Spanish/Hispanic,1,Emergency,Home or Self Care,2022,DIG009,Appendicitis and other appendiceal conditions,GIS008,APPENDECTOMY,234,APPENDECTOMY WITHOUT COMPLEX PRINCIPAL DIAGNOSIS,06,DISEASES AND DISORDERS OF THE DIGESTIVE SYSTEM,1,Minor,Minor,Surgical,Medicaid,,,,,Y,23491.77,13509.74
New York City,Manhattan,7002001,001438,Bellevue Hospital Center,30 to 49,114,F,Other Race,Spanish/Hispanic,1,Emergency,Home or Self Care,2022,DIG009,Appendicitis and other appendiceal conditions,GIS008,APPENDECTOMY,234,APPENDECTOMY WITHOUT COMPLEX PRINCIPAL DIAGNOSIS,06,DISEASES AND DISORDERS OF THE DIGESTIVE SYSTEM,1,Minor,Minor,Surgical,Medicaid,,,,,Y,22446.61,12908.69
New York City,Manhattan,7002001,001438,Bellevue Hospital Center,30 to 49,100,F,Other Race,Spanish/Hispanic,1,Emergency,Home or Self Care,2022,DIG009,Appendicitis and other appendiceal conditions,GIS008,APPENDECTOMY,234,APPENDECTOMY WITHOUT COMPLEX PRINCIPAL DIAGNOSIS,06,DISEASES AND DISORDERS OF THE DIGESTIVE SYSTEM,1,Minor,Minor,Surgical,Private Health Insurance,,,,,Y,22151.12,12738.75
New York City,Manhattan,7002053,001463,NYU Langone Hospitals,18 to 29,100,F,White,Not Span/Hispanic,5,Emergency,Home or Self Care,2022,DIG009,Appendicitis and other appendiceal conditions,GIS008,APPENDECTOMY,234,APPENDECTOMY WITHOUT COMPLEX PRINCIPAL DIAGNOSIS,06,DISEASES AND DISORDERS OF THE DIGESTIVE SYSTEM,3,Major,Moderate,Surgical,Private Health Insurance,,,,,Y,179528.43,35688.08
New York City,Manhattan,7002053,001463,NYU Langone Hospitals,0 to 17,100,M,White,Not Span/Hispanic,1,Emergency,Home or Self Care,2022,DIG009,Appendicitis and other appendiceal conditions,GIS008,APPENDECTOMY,234,APPENDECTOMY WITHOUT COMPLEX PRINCIPAL DIAGNOSIS,06,DISEASES AND DISORDERS OF THE DIGESTIVE SYSTEM,1,Minor,Minor,Surgical,Private Health Insurance,,,,,Y,60395.91,10093.83
New York City,Manhattan,7002053,001463,NYU Langone Hospitals,18 to 29,,F,Other Race,Not Span/Hispanic,1,Emergency,Home or Self Care,2022,DIG009,Appendicitis and other appendiceal conditions,GIS008,APPENDECTOMY,234,APPENDECTOMY WITHOUT COMPLEX PRINCIPAL DIAGNOSIS,06,DISEASES AND DISORDERS OF THE DIGESTIVE SYSTEM,2,Moderate,Moderate,Surgical,Private Health Insurance,,,,,Y,62326.09,11646.79
New York City,Manhattan,7002054,001464,New York-Presbyterian Hospital - Columbia Presbyterian Center,50 to 69,100,F,Other Race,Spanish/Hispanic,1,Emergency,Home or Self Care,2022,DIG009,Appendicitis and other appendiceal conditions,GIS008,APPENDECTOMY,234,APPENDECTOMY WITHOUT COMPLEX PRINCIPAL DIAGNOSIS,06,DISEASES AND DISORDERS OF THE DIGESTIVE SYSTEM,2,Moderate,Minor,Surgical,Medicaid,,,,,Y,47803.63,
New York City,Manhattan,7002054,001464,New York-Presbyterian Hospital - Columbia Presbyterian Center,50 to 69,100,F,Other Race,Spanish/Hispanic,1,Emergency,Home or Self Care,2022,DIG009,Appendicitis and other appendiceal conditions,GIS008,APPENDECTOMY,234,APPENDECTOMY WITHOUT COMPLEX PRINCIPAL DIAGNOSIS,06,DISEASES AND DISORDERS OF THE DIGESTIVE SYSTEM,1,Minor,Minor,Surgical,Private Health Insurance,,,,,Y,45321.85,11927.46
New York City,Manhattan,7002054,001464,New York-Presbyterian Hospital - Columbia Presbyterian Center,30 to 49,114,F,Other Race,Unknown,1,Emergency,Home or Self Care,2022,DIG009,Appendicitis and other appendiceal conditions,GIS008,APPENDECTOMY,234,APPENDECTOMY WITHOUT COMPLEX PRINCIPAL DIAGNOSIS,06,DISEASES AND DISORDERS OF THE DIGESTIVE SYSTEM,1,Minor,Minor,Surgical,Blue Cross/Blue Shield,,,,,Y,49519.21,12918.51
New York City,Manhattan,7002054,001464,New York-Presbyterian Hospital - Columbia Presbyterian Center,30 to 49,104,F,Other Race,Spanish/Hispanic,1,Emergency,Home or Self Care,2022,DIG009,Appendicitis and other appendiceal conditions,GIS008,APPENDECTOMY,234,APPENDECTOMY WITHOUT COMPLEX PRINCIPAL DIAGNOSIS,06,DISEASES AND DISORDERS OF THE DIGESTIVE SYSTEM,1,Minor,Minor,Surgical,Medicaid,,,,,Y,61153.39,15597.76
New York City,Manhattan,7002053,001463,NYU Langone Hospitals,30 to 49,112,M,Multi-racial,Not Span/Hispanic,1,Emergency,Home or Self Care,2022,DIG009,Appendicitis and other appendiceal conditions,GIS008,APPENDECTOMY,234,APPENDECTOMY WITHOUT COMPLEX PRINCIPAL DIAGNOSIS,06,DISEASES AND DISORDERS OF THE DIGESTIVE SYSTEM,1,Minor,Minor,Surgical,Private Health Insurance,,,,,Y,81016.06,14056.73
New York City,Manhattan,7002053,001463,NYU Langone Hospitals,0 to 17,112,F,White,Not Span/Hispanic,1,Emergency,Home or Self Care,2022,DIG009,Appendicitis and other appendiceal conditions,GIS008,APPENDECTOMY,234,APPENDECTOMY WITHOUT COMPLEX PRINCIPAL DIAGNOSIS,06,DISEASES AND DISORDERS OF THE DIGESTIVE SYSTEM,2,Moderate,Minor,Surgical,Medicaid,,,,,Y,88087.70,14400.07
New York City,Manhattan,7002053,001463,NYU Langone Hospitals,50 to 69,104,F,Other Race,Not Span/Hispanic,1,Emergency,Home or Self Care,2022,DIG009,Appendicitis and other appendiceal conditions,GIS008,APPENDECTOMY,234,APPENDECTOMY WITHOUT COMPLEX PRINCIPAL DIAGNOSIS,06,DISEASES AND DISORDERS OF THE DIGESTIVE SYSTEM,2,Moderate,Moderate,Surgical,Medicare,Blue Cross/Blue Shield,,,,Y,74231.78,12927.72
New York City,Manhattan,7002053,001463,NYU Langone Hospitals,0 to 17,100,M,Other Race,Not Span/Hispanic,1,Emergency,Home or Self Care,2022,DIG009,Appendicitis and other appendiceal conditions,GIS008,APPENDECTOMY,234,APPENDECTOMY WITHOUT COMPLEX PRINCIPAL DIAGNOSIS,06,DISEASES AND DISORDERS OF THE DIGESTIVE SYSTEM,2,Moderate,Moderate,Surgical,Blue Cross/Blue Shield,,,,,Y,56601.50,11010.08
New York City,Manhattan,7002001,001438,Bellevue Hospital Center,18 to 29,112,F,Other Race,Spanish/Hispanic,1,Emergency,Home or Self Care,2022,DIG009,Appendicitis and other appendiceal conditions,GIS008,APPENDECTOMY,234,APPENDECTOMY WITHOUT COMPLEX PRINCIPAL DIAGNOSIS,06,DISEASES AND DISORDERS OF THE DIGESTIVE SYSTEM,1,Minor,Minor,Surgical,Medicaid,,,,,Y,22499.71,12939.22
Finger Lakes,Monroe,2701005,000413,Strong Memorial Hospital,0 to 17,145,F,White,Not Span/Hispanic,1,Emergency,Home or Self Care,2022,DIG009,Appendicitis and other appendiceal conditions,GIS008,APPENDECTOMY,234,APPENDECTOMY WITHOUT COMPLEX PRINCIPAL DIAGNOSIS,06,DISEASES AND DISORDERS OF THE DIGESTIVE SYSTEM,1,Minor,Minor,Surgical,Medicaid,,,,,Y,18953.79,8533.65
Finger Lakes,Monroe,2701005,000413,Strong Memorial Hospital,0 to 17,146,M,Other Race,Spanish/Hispanic,1,Emergency,Home or Self Care,2022,DIG009,Appendicitis and other appendiceal conditions,GIS008,APPENDECTOMY,234,APPENDECTOMY WITHOUT COMPLEX PRINCIPAL DIAGNOSIS,06,DISEASES AND DISORDERS OF THE DIGESTIVE SYSTEM,1,Minor,Minor,Surgical,Medicaid,,,,,Y,22772.52,10416.22
New York City,Manhattan,7002054,001464,New York-Presbyterian Hospital - Columbia Presbyterian Center,50 to 69,100,F,Other Race,Spanish/Hispanic,1,Emergency,Home or Self Care,2022,DIG009,Appendicitis and other appendiceal conditions,GIS008,APPENDECTOMY,234,APPENDECTOMY WITHOUT COMPLEX PRINCIPAL DIAGNOSIS,06,DISEASES AND DISORDERS OF THE DIGESTIVE SYSTEM,1,Minor,Minor,Surgical,Medicaid,,,,,Y,49645.75,
New York City,Manhattan,7002054,001464,New York-Presbyterian Hospital - Columbia Presbyterian Center,0 to 17,100,M,Other Race,Spanish/Hispanic,1,Emergency,Home or Self Care,2022,DIG009,Appendicitis and other appendiceal conditions,GIS008,APPENDECTOMY,234,APPENDECTOMY WITHOUT COMPLEX PRINCIPAL DIAGNOSIS,06,DISEASES AND DISORDERS OF THE DIGESTIVE SYSTEM,1,Minor,Minor,Surgical,Private Health Insurance,Private Health Insurance,,,,Y,58151.15,16271.43
New York City,Manhattan,7002054,001464,New York-Presbyterian Hospital - Columbia Presbyterian Center,50 to 69,100,F,Other Race,Spanish/Hispanic,1,Emergency,Home or Self Care,2022,DIG009,Appendicitis and other appendiceal conditions,GIS008,APPENDECTOMY,234,APPENDECTOMY WITHOUT COMPLEX PRINCIPAL DIAGNOSIS,06,DISEASES AND DISORDERS OF THE DIGESTIVE SYSTEM,1,Minor,Minor,Surgical,Private Health Insurance,,,,,Y,44950.20,
New York City,Manhattan,7002054,001464,New York-Presbyterian Hospital - Columbia Presbyterian Center,18 to 29,100,M,White,Not Span/Hispanic,2,Emergency,Home or Self Care,2022,DIG009,Appendicitis and other appendiceal conditions,GIS008,APPENDECTOMY,234,APPENDECTOMY WITHOUT COMPLEX PRINCIPAL DIAGNOSIS,06,DISEASES AND DISORDERS OF THE DIGESTIVE SYSTEM,1,Minor,Minor,Surgical,Blue Cross/Blue Shield,,,,,Y,54877.27,14173.24
New York City,Manhattan,7002054,001464,New York-Presbyterian Hospital - Columbia Presbyterian Center,50 to 69,100,M,White,Not Span/Hispanic,1,Emergency,Home or Self Care,2022,DIG009,Appendicitis and other appendiceal conditions,GIS008,APPENDECTOMY,234,APPENDECTOMY WITHOUT COMPLEX PRINCIPAL DIAGNOSIS,06,DISEASES AND DISORDERS OF THE DIGESTIVE SYSTEM,2,Moderate,Minor,Surgical,Private Health Insurance,,,,,Y,52151.89,14336.17
New York City,Manhattan,7002054,001464,New York-Presbyterian Hospital - Columbia Presbyterian Center,18 to 29,100,M,Other Race,Not Span/Hispanic,1,Emergency,Home or Self Care,2022,DIG009,Appendicitis and other appendiceal conditions,GIS008,APPENDECTOMY,234,APPENDECTOMY WITHOUT COMPLEX PRINCIPAL DIAGNOSIS,06,DISEASES AND DISORDERS OF THE DIGESTIVE SYSTEM,1,Minor,Minor,Surgical,Private Health Insurance,,,,,Y,48419.28,12786.15
New York City,Manhattan,7002054,001464,New York-Presbyterian Hospital - Columbia Presbyterian Center,18 to 29,109,F,White,Not Span/Hispanic,1,Emergency,Home or Self Care,2022,DIG009,Appendicitis and other appendiceal conditions,GIS008,APPENDECTOMY,234,APPENDECTOMY WITHOUT COMPLEX PRINCIPAL DIAGNOSIS,06,DISEASES AND DISORDERS OF THE DIGESTIVE SYSTEM,1,Minor,Minor,Surgical,Private Health Insurance,Medicaid,,,,Y,55739.24,15740.65
New York City,Manhattan,7002001,001438,Bellevue Hospital Center,70 or Older,112,F,Black/African American,Not Span/Hispanic,8,Elective,Home or Self Care,2022,NEO070,Secondary malignancies,GIS008,APPENDECTOMY,234,APPENDECTOMY WITHOUT COMPLEX PRINCIPAL DIAGNOSIS,06,DISEASES AND DISORDERS OF THE DIGESTIVE SYSTEM,3,Major,Major,Surgical,Medicaid,,,,,N,97204.41,55900.70
New York City,Manhattan,7002001,001438,Bellevue Hospital Center,30 to 49,OOS,M,Other Race,Unknown,1,Emergency,Home or Self Care,2022,DIG009,Appendicitis and other appendiceal conditions,GIS008,APPENDECTOMY,234,APPENDECTOMY WITHOUT COMPLEX PRINCIPAL DIAGNOSIS,06,DISEASES AND DISORDERS OF THE DIGESTIVE SYSTEM,1,Minor,Minor,Surgical,Private Health Insurance,,,,,Y,26504.31,15242.20
New York City,Manhattan,7002054,001464,New York-Presbyterian Hospital - Columbia Presbyterian Center,30 to 49,100,M,Other Race,Spanish/Hispanic,1,Emergency,Home or Self Care,2022,DIG009,Appendicitis and other appendiceal conditions,GIS008,APPENDECTOMY,234,APPENDECTOMY WITHOUT COMPLEX PRINCIPAL DIAGNOSIS,06,DISEASES AND DISORDERS OF THE DIGESTIVE SYSTEM,1,Minor,Minor,Surgical,Blue Cross/Blue Shield,,,,,Y,46033.41,12455.89
New York City,Manhattan,7002054,001464,New York-Presbyterian Hospital - Columbia Presbyterian Center,18 to 29,100,M,Other Race,Spanish/Hispanic,1,Emergency,Home or Self Care,2022,DIG009,Appendicitis and other appendiceal conditions,GIS008,APPENDECTOMY,234,APPENDECTOMY WITHOUT COMPLEX PRINCIPAL DIAGNOSIS,06,DISEASES AND DISORDERS OF THE DIGESTIVE SYSTEM,1,Minor,Minor,Surgical,Medicaid,,,,,Y,53100.75,13600.10
Long Island,Nassau,2951001,000541,North Shore University Hospital,18 to 29,113,F,Other Race,Spanish/Hispanic,1,Emergency,Home or Self Care,2022,DIG009,Appendicitis and other appendiceal conditions,GIS008,APPENDECTOMY,234,APPENDECTOMY WITHOUT COMPLEX PRINCIPAL DIAGNOSIS,06,DISEASES AND DISORDERS OF THE DIGESTIVE SYSTEM,2,Moderate,Moderate,Surgical,Medicaid,,,,,Y,44833.63,7313.33
Long Island,Nassau,2951001,000541,North Shore University Hospital,18 to 29,110,M,White,Not Span/Hispanic,1,Emergency,Home or Self Care,2022,DIG009,Appendicitis and other appendiceal conditions,GIS008,APPENDECTOMY,234,APPENDECTOMY WITHOUT COMPLEX PRINCIPAL DIAGNOSIS,06,DISEASES AND DISORDERS OF THE DIGESTIVE SYSTEM,1,Minor,Minor,Surgical,Private Health Insurance,,,,,Y,56818.89,9731.52
Long Island,Nassau,2951001,000541,North Shore University Hospital,18 to 29,115,F,Black/African American,Not Span/Hispanic,1,Emergency,Home or Self Care,2022,DIG009,Appendicitis and other appendiceal conditions,GIS008,APPENDECTOMY,234,APPENDECTOMY WITHOUT COMPLEX PRINCIPAL DIAGNOSIS,06,DISEASES AND DISORDERS OF THE DIGESTIVE SYSTEM,1,Minor,Minor,Surgical,Private Health Insurance,,,,,Y,51764.08,8767.40
Long Island,Nassau,2951001,000541,North Shore University Hospital,18 to 29,110,M,Other Race,Not Span/Hispanic,1,Emergency,Home or Self Care,2022,DIG009,Appendicitis and other appendiceal conditions,GIS008,APPENDECTOMY,234,APPENDECTOMY WITHOUT COMPLEX PRINCIPAL DIAGNOSIS,06,DISEASES AND DISORDERS OF THE DIGESTIVE SYSTEM,1,Minor,Minor,Surgical,Blue Cross/Blue Shield,,,,,Y,49362.81,8233.44
Long Island,Nassau,2951001,000541,North Shore University Hospital,30 to 49,110,M,Other Race,Spanish/Hispanic,1,Emergency,Home or Self Care,2022,DIG009,Appendicitis and other appendiceal conditions,GIS008,APPENDECTOMY,234,APPENDECTOMY WITHOUT COMPLEX PRINCIPAL DIAGNOSIS,06,DISEASES AND DISORDERS OF THE DIGESTIVE SYSTEM,1,Minor,Minor,Surgical,Medicaid,Medicaid,,,,Y,50843.05,8736.08