Hospital Service Area,Hospital County,Operating Certificate Number,Permanent Facility Id,Facility Name,Age Group,Zip Code - 3 digits,Gender,Race,Ethnicity,Length of Stay,Type of Admission,Patient Disposition,Discharge Year,CCS Diagnosis Code,CCS Diagnosis Description,CCS Procedure Code,CCS Procedure Description,APR DRG Code,APR DRG Description,APR MDC Code,APR MDC Description,APR Severity of Illness Code,APR Severity of Illness Description,APR Risk of Mortality,APR Medical Surgical Description,Payment Typology 1,Payment Typology 2,Payment Typology 3,Birth Weight,Abortion Edit Indicator,Emergency Department Indicator,Total Charges,Total Costs
New York City,Manhattan,7002054,001464,New York-Presbyterian Hospital - Columbia Presbyterian Center,50 to 69,100,M,White,Spanish/Hispanic,29,Emergency,Home or Self Care,2022,DIG004,Esophageal disorders,GIS004,GI SYSTEM ENDOSCOPY WITHOUT BIOPSY (DIAGNOSTIC),242,MAJOR ESOPHAGEAL DISORDERS,06,DISEASES AND DISORDERS OF THE DIGESTIVE SYSTEM,3,Major,Major,Medical,Medicaid,,,,,Y,525647.74,155127.50
New York City,Manhattan,7002054,001464,New York-Presbyterian Hospital - Columbia Presbyterian Center,0 to 17,104,M,Black/African American,Not Span/Hispanic,1,Elective,Home or Self Care,2022,MAL002,Digestive congenital anomalies,GIS025,OTHER GI SYSTEM DEVICE PROCEDURES,242,MAJOR ESOPHAGEAL DISORDERS,06,DISEASES AND DISORDERS OF THE DIGESTIVE SYSTEM,3,Major,Minor,Medical,Private Health Insurance,,,01400,,N,36791.07,12514.72
New York City,Manhattan,7002054,001464,New York-Presbyterian Hospital - Columbia Presbyterian Center,18 to 29,100,F,Other Race,Spanish/Hispanic,6,Emergency,Home or Self Care,2022,DIG004,Esophageal disorders,MAM011,ELECTROENCEPHALOGRAM (EEG),242,MAJOR ESOPHAGEAL DISORDERS,06,DISEASES AND DISORDERS OF THE DIGESTIVE SYSTEM,2,Moderate,Moderate,Medical,Medicaid,,,,,Y,120367.01,36060.27
Finger Lakes,Monroe,2701005,000413,Strong Memorial Hospital,30 to 49,146,M,White,Not Span/Hispanic,4,Emergency,Home or Self Care,2022,CIR039,Other specified diseases of veins and lymphatics,GIS027,"UPPER GI THERAPEUTIC PROCEDURES, NEC (ENDOSCOPIC)",242,MAJOR ESOPHAGEAL DISORDERS,06,DISEASES AND DISORDERS OF THE DIGESTIVE SYSTEM,3,Major,Major,Medical,Medicaid,,,,,Y,30315.03,10444.78
Finger Lakes,Monroe,2701005,000413,Strong Memorial Hospital,18 to 29,146,M,Black/African American,Not Span/Hispanic,1,Emergency,Home or Self Care,2022,DIG004,Esophageal disorders,,,242,MAJOR ESOPHAGEAL DISORDERS,06,DISEASES AND DISORDERS OF THE DIGESTIVE SYSTEM,2,Moderate,Moderate,Medical,Medicaid,,,,,Y,10532.77,3359.38
Finger Lakes,Monroe,2701005,000413,Strong Memorial Hospital,50 to 69,146,M,White,Not Span/Hispanic,4,Emergency,Court/Law Enforcement,2022,DIG004,Esophageal disorders,ADM021,"ADMINISTRATION OF THERAPEUTIC SUBSTANCES, NEC",242,MAJOR ESOPHAGEAL DISORDERS,06,DISEASES AND DISORDERS OF THE DIGESTIVE SYSTEM,3,Major,Moderate,Medical,Private Health Insurance,,,,,Y,20536.66,8472.14
Finger Lakes,Monroe,2701005,000413,Strong Memorial Hospital,50 to 69,145,F,White,Not Span/Hispanic,3,Elective,Home or Self Care,2022,DIG004,Esophageal disorders,GIS001,ESOPHAGOGASTRODUODENOSCOPY (EGD) WITH BIOPSY,242,MAJOR ESOPHAGEAL DISORDERS,06,DISEASES AND DISORDERS OF THE DIGESTIVE SYSTEM,2,Moderate,Moderate,Medical,Medicare,Medicaid,,,,N,28125.14,13164.71
Finger Lakes,Monroe,2701005,000413,Strong Memorial Hospital,30 to 49,144,M,White,Not Span/Hispanic,36,Emergency,Home w/ Home Health Services,2022,DIG006,Gastrointestinal and biliary perforation,GIS027,"UPPER GI THERAPEUTIC PROCEDURES, NEC (ENDOSCOPIC)",242,MAJOR ESOPHAGEAL DISORDERS,06,DISEASES AND DISORDERS OF THE DIGESTIVE SYSTEM,4,Extreme,Extreme,Medical,Medicaid,,,,,Y,319004.64,134384.35
New York City,Manhattan,7002053,001463,NYU Langone Hospitals,50 to 69,119,F,White,Not Span/Hispanic,6,Emergency,Home or Self Care,2022,CIR039,Other specified diseases of veins and lymphatics,ADM001,TRANSFUSION OF BLOOD AND BLOOD PRODUCTS,242,MAJOR ESOPHAGEAL DISORDERS,06,DISEASES AND DISORDERS OF THE DIGESTIVE SYSTEM,3,Major,Major,Medical,Private Health Insurance,,,,,N,188504.31,51694.86
New York City,Manhattan,7002001,001438,Bellevue Hospital Center,50 to 69,113,M,Other Race,Not Span/Hispanic,4,Emergency,Home or Self Care,2022,CIR039,Other specified diseases of veins and lymphatics,ADM001,TRANSFUSION OF BLOOD AND BLOOD PRODUCTS,242,MAJOR ESOPHAGEAL DISORDERS,06,DISEASES AND DISORDERS OF THE DIGESTIVE SYSTEM,3,Major,Major,Medical,Medicare,Medicaid,,,,Y,45008.77,25883.82
Finger Lakes,Monroe,2701005,000413,Strong Memorial Hospital,30 to 49,146,M,White,Not Span/Hispanic,6,Emergency,Home or Self Care,2022,DIG004,Esophageal disorders,,,242,MAJOR ESOPHAGEAL DISORDERS,06,DISEASES AND DISORDERS OF THE DIGESTIVE SYSTEM,3,Major,Moderate,Medical,Blue Cross/Blue Shield,,,,,Y,30624.64,10837.94
New York City,Manhattan,7002053,001463,NYU Langone Hospitals,70 or Older,112,M,Other Race,Spanish/Hispanic,13,Emergency,Skilled Nursing Home,2022,DIG004,Esophageal disorders,OTR004,ISOLATION PROCEDURES,242,MAJOR ESOPHAGEAL DISORDERS,06,DISEASES AND DISORDERS OF THE DIGESTIVE SYSTEM,3,Major,Extreme,Medical,Medicare,Medicaid,,,,Y,205343.37,67976.96
New York City,Manhattan,7002054,001464,New York-Presbyterian Hospital - Columbia Presbyterian Center,50 to 69,100,M,Other Race,Spanish/Hispanic,1,Emergency,Home or Self Care,2022,DIG004,Esophageal disorders,,,242,MAJOR ESOPHAGEAL DISORDERS,06,DISEASES AND DISORDERS OF THE DIGESTIVE SYSTEM,1,Minor,Moderate,Medical,Medicare,,,,,Y,22425.08,4855.26
New York City,Manhattan,7002001,001438,Bellevue Hospital Center,50 to 69,100,M,Black/African American,Not Span/Hispanic,4,Emergency,Home or Self Care,2022,DIG004,Esophageal disorders,GNR004,ENDOSCOPIC CONTROL OF BLEEDING,242,MAJOR ESOPHAGEAL DISORDERS,06,DISEASES AND DISORDERS OF THE DIGESTIVE SYSTEM,3,Major,Moderate,Medical,Medicaid,,,,,Y,47849.48,27517.47
Long Island,Nassau,2951001,000541,North Shore University Hospital,70 or Older,113,F,White,Not Span/Hispanic,4,Emergency,Home w/ Home Health Services,2022,DIG004,Esophageal disorders,GIS001,ESOPHAGOGASTRODUODENOSCOPY (EGD) WITH BIOPSY,242,MAJOR ESOPHAGEAL DISORDERS,06,DISEASES AND DISORDERS OF THE DIGESTIVE SYSTEM,3,Major,Moderate,Medical,Medicare,Medicare,,,,Y,79917.44,16129.25
Long Island,Nassau,2951001,000541,North Shore University Hospital,50 to 69,118,F,Other Race,Not Span/Hispanic,13,Emergency,Expired,2022,CIR039,Other specified diseases of veins and lymphatics,GIS027,"UPPER GI THERAPEUTIC PROCEDURES, NEC (ENDOSCOPIC)",242,MAJOR ESOPHAGEAL DISORDERS,06,DISEASES AND DISORDERS OF THE DIGESTIVE SYSTEM,4,Extreme,Extreme,Medical,Blue Cross/Blue Shield,,,,,Y,281436.76,52753.33
Long Island,Nassau,2951001,000541,North Shore University Hospital,50 to 69,115,F,White,Not Span/Hispanic,5,Emergency,Home or Self Care,2022,DIG004,Esophageal disorders,GNR004,ENDOSCOPIC CONTROL OF BLEEDING,242,MAJOR ESOPHAGEAL DISORDERS,06,DISEASES AND DISORDERS OF THE DIGESTIVE SYSTEM,3,Major,Major,Medical,Blue Cross/Blue Shield,,,,,Y,113132.13,25322.79
Long Island,Nassau,2951001,000541,North Shore University Hospital,70 or Older,113,M,White,Not Span/Hispanic,4,Emergency,Home or Self Care,2022,DIG004,Esophageal disorders,,,242,MAJOR ESOPHAGEAL DISORDERS,06,DISEASES AND DISORDERS OF THE DIGESTIVE SYSTEM,3,Major,Major,Medical,Medicare,Private Health Insurance,,,,Y,62497.57,9819.18
Long Island,Nassau,2951001,000541,North Shore University Hospital,70 or Older,115,F,Black/African American,Not Span/Hispanic,9,Emergency,Home w/ Home Health Services,2022,DIG004,Esophageal disorders,ADM001,TRANSFUSION OF BLOOD AND BLOOD PRODUCTS,242,MAJOR ESOPHAGEAL DISORDERS,06,DISEASES AND DISORDERS OF THE DIGESTIVE SYSTEM,4,Extreme,Major,Medical,Medicare,Blue Cross/Blue Shield,,,,Y,196752.06,38133.44
New York City,Manhattan,7002053,001463,NYU Langone Hospitals,30 to 49,100,M,White,Not Span/Hispanic,3,Emergency,Home or Self Care,2022,DIG004,Esophageal disorders,GIS001,ESOPHAGOGASTRODUODENOSCOPY (EGD) WITH BIOPSY,242,MAJOR ESOPHAGEAL DISORDERS,06,DISEASES AND DISORDERS OF THE DIGESTIVE SYSTEM,2,Moderate,Minor,Medical,Blue Cross/Blue Shield,,,,,Y,79008.66,20207.66
New York City,Manhattan,7002001,001438,Bellevue Hospital Center,30 to 49,112,M,Other Race,Spanish/Hispanic,3,Emergency,Home or Self Care,2022,DIG004,Esophageal disorders,ADM001,TRANSFUSION OF BLOOD AND BLOOD PRODUCTS,242,MAJOR ESOPHAGEAL DISORDERS,06,DISEASES AND DISORDERS OF THE DIGESTIVE SYSTEM,2,Moderate,Moderate,Medical,Medicaid,,,,,Y,31557.55,18148.24
Western NY,Cattaraugus,0401001,000066,Olean General Hospital,50 to 69,147,M,White,Not Span/Hispanic,4,Emergency,Skilled Nursing Home,2022,DIG004,Esophageal disorders,GIS004,GI SYSTEM ENDOSCOPY WITHOUT BIOPSY (DIAGNOSTIC),242,MAJOR ESOPHAGEAL DISORDERS,06,DISEASES AND DISORDERS OF THE DIGESTIVE SYSTEM,3,Major,Major,Medical,Medicare,Medicaid,,,,Y,12080.01,4448.69
Western NY,Cattaraugus,0401001,000066,Olean General Hospital,30 to 49,147,F,White,Not Span/Hispanic,2,Emergency,Home or Self Care,2022,DIG004,Esophageal disorders,GIS004,GI SYSTEM ENDOSCOPY WITHOUT BIOPSY (DIAGNOSTIC),242,MAJOR ESOPHAGEAL DISORDERS,06,DISEASES AND DISORDERS OF THE DIGESTIVE SYSTEM,2,Moderate,Minor,Medical,Medicaid,,,,,Y,11346.23,4041.66
New York City,Manhattan,7002001,001438,Bellevue Hospital Center,50 to 69,112,M,Other Race,Not Span/Hispanic,5,Emergency,Home or Self Care,2022,CIR039,Other specified diseases of veins and lymphatics,ESA003,MECHANICAL VENTILATION,242,MAJOR ESOPHAGEAL DISORDERS,06,DISEASES AND DISORDERS OF THE DIGESTIVE SYSTEM,4,Extreme,Extreme,Medical,Medicaid,,,,,Y,59425.32,34174.55
Finger Lakes,Monroe,2701005,000413,Strong Memorial Hospital,30 to 49,146,F,Other Race,Spanish/Hispanic,1,Emergency,Home or Self Care,2022,DIG004,Esophageal disorders,,,242,MAJOR ESOPHAGEAL DISORDERS,06,DISEASES AND DISORDERS OF THE DIGESTIVE SYSTEM,3,Major,Moderate,Medical,Medicaid,,,,,Y,5301.57,2038.19
Finger Lakes,Monroe,2701005,000413,Strong Memorial Hospital,30 to 49,146,M,White,Not Span/Hispanic,5,Emergency,Home or Self Care,2022,CIR039,Other specified diseases of veins and lymphatics,GIS027,"UPPER GI THERAPEUTIC PROCEDURES, NEC (ENDOSCOPIC)",242,MAJOR ESOPHAGEAL DISORDERS,06,DISEASES AND DISORDERS OF THE DIGESTIVE SYSTEM,3,Major,Major,Medical,Blue Cross/Blue Shield,,,,,Y,31440.54,12500.43
Finger Lakes,Monroe,2701005,000413,Strong Memorial Hospital,50 to 69,144,F,White,Not Span/Hispanic,4,Emergency,Home w/ Home Health Services,2022,DIG004,Esophageal disorders,GIS004,GI SYSTEM ENDOSCOPY WITHOUT BIOPSY (DIAGNOSTIC),242,MAJOR ESOPHAGEAL DISORDERS,06,DISEASES AND DISORDERS OF THE DIGESTIVE SYSTEM,3,Major,Major,Medical,Medicare,,,,,Y,26944.48,9904.96
Long Island,Nassau,2951001,000541,North Shore University Hospital,70 or Older,113,F,White,Not Span/Hispanic,7,Emergency,Home w/ Home Health Services,2022,DIG004,Esophageal disorders,GIS004,GI SYSTEM ENDOSCOPY WITHOUT BIOPSY (DIAGNOSTIC),242,MAJOR ESOPHAGEAL DISORDERS,06,DISEASES AND DISORDERS OF THE DIGESTIVE SYSTEM,2,Moderate,Minor,Medical,Medicare,Medicare,,,,Y,106024.00,19805.07
Long Island,Nassau,2951001,000541,North Shore University Hospital,70 or Older,110,F,White,Not Span/Hispanic,3,Emergency,Home or Self Care,2022,DIG004,Esophageal disorders,GIS004,GI SYSTEM ENDOSCOPY WITHOUT BIOPSY (DIAGNOSTIC),242,MAJOR ESOPHAGEAL DISORDERS,06,DISEASES AND DISORDERS OF THE DIGESTIVE SYSTEM,2,Moderate,Minor,Medical,Medicare,Private Health Insurance,,,,Y,60559.07,11797.62
Long Island,Nassau,2951001,000541,North Shore University Hospital,50 to 69,113,M,White,Not Span/Hispanic,9,Emergency,Home or Self Care,2022,DIG004,Esophageal disorders,ENT002,ENT DIAGNOSTIC ENDOSCOPY (EXCLUDING LARYNGOSCOPY),242,MAJOR ESOPHAGEAL DISORDERS,06,DISEASES AND DISORDERS OF THE DIGESTIVE SYSTEM,4,Extreme,Major,Medical,Blue Cross/Blue Shield,,,,,Y,137368.50,22824.84
New York City,Manhattan,7002001,001438,Bellevue Hospital Center,50 to 69,146,M,White,Unknown,9,Emergency,Home or Self Care,2022,DIG004,Esophageal disorders,GIS004,GI SYSTEM ENDOSCOPY WITHOUT BIOPSY (DIAGNOSTIC),242,MAJOR ESOPHAGEAL DISORDERS,06,DISEASES AND DISORDERS OF THE DIGESTIVE SYSTEM,3,Major,Major,Medical,Medicaid,,,,,Y,76051.95,43736.26
Hudson Valley,Dutchess,1302001,000181,Vassar Brothers Medical Center,30 to 49,105,M,Other Race,Spanish/Hispanic,6,Emergency,Home or Self Care,2022,CIR039,Other specified diseases of veins and lymphatics,GIS027,"UPPER GI THERAPEUTIC PROCEDURES, NEC (ENDOSCOPIC)",242,MAJOR ESOPHAGEAL DISORDERS,06,DISEASES AND DISORDERS OF THE DIGESTIVE SYSTEM,3,Major,Major,Medical,Medicaid,,,,,Y,49922.84,14586.30
Western NY,Cattaraugus,0401001,000066,Olean General Hospital,70 or Older,147,F,White,Not Span/Hispanic,6,Emergency,Skilled Nursing Home,2022,DIG004,Esophageal disorders,GIS001,ESOPHAGOGASTRODUODENOSCOPY (EGD) WITH BIOPSY,242,MAJOR ESOPHAGEAL DISORDERS,06,DISEASES AND DISORDERS OF THE DIGESTIVE SYSTEM,2,Moderate,Minor,Medical,Medicare,Private Health Insurance,,,,Y,10262.26,5397.21
New York City,Manhattan,7002054,001464,New York-Presbyterian Hospital - Columbia Presbyterian Center,50 to 69,104,M,Other Race,Spanish/Hispanic,3,Emergency,Home or Self Care,2022,DIG004,Esophageal disorders,GNR004,ENDOSCOPIC CONTROL OF BLEEDING,242,MAJOR ESOPHAGEAL DISORDERS,06,DISEASES AND DISORDERS OF THE DIGESTIVE SYSTEM,3,Major,Moderate,Medical,Medicare,Medicaid,,,,Y,65697.13,15175.45
New York City,Manhattan,7002054,001464,New York-Presbyterian Hospital - Columbia Presbyterian Center,30 to 49,112,M,Black/African American,Not Span/Hispanic,1,Emergency,Home or Self Care,2022,DIG004,Esophageal disorders,,,242,MAJOR ESOPHAGEAL DISORDERS,06,DISEASES AND DISORDERS OF THE DIGESTIVE SYSTEM,1,Minor,Minor,Medical,Private Health Insurance,,,,,Y,16939.71,3682.52
New York City,Manhattan,7002054,001464,New York-Presbyterian Hospital - Columbia Presbyterian Center,30 to 49,100,M,White,Not Span/Hispanic,7,Emergency,Home or Self Care,2022,DIG004,Esophageal disorders,,,242,MAJOR ESOPHAGEAL DISORDERS,06,DISEASES AND DISORDERS OF THE DIGESTIVE SYSTEM,2,Moderate,Minor,Medical,Medicaid,,,,,Y,96685.25,20340.50
New York City,Manhattan,7002001,001438,Bellevue Hospital Center,70 or Older,111,F,White,Spanish/Hispanic,3,Emergency,Home or Self Care,2022,CIR039,Other specified diseases of veins and lymphatics,GIS027,"UPPER GI THERAPEUTIC PROCEDURES, NEC (ENDOSCOPIC)",242,MAJOR ESOPHAGEAL DISORDERS,06,DISEASES AND DISORDERS OF THE DIGESTIVE SYSTEM,4,Extreme,Major,Medical,Medicaid,,,,,Y,33436.64,19228.88
Finger Lakes,Monroe,2701005,000413,Strong Memorial Hospital,50 to 69,146,M,Black/African American,Not Span/Hispanic,6,Emergency,Home or Self Care,2022,DIG004,Esophageal disorders,GIS001,ESOPHAGOGASTRODUODENOSCOPY (EGD) WITH BIOPSY,242,MAJOR ESOPHAGEAL DISORDERS,06,DISEASES AND DISORDERS OF THE DIGESTIVE SYSTEM,3,Major,Major,Medical,Medicare,Medicaid,,,,Y,44584.59,15103.31
Finger Lakes,Monroe,2701005,000413,Strong Memorial Hospital,70 or Older,145,M,White,Not Span/Hispanic,3,Emergency,Home or Self Care,2022,DIG004,Esophageal disorders,GNR004,ENDOSCOPIC CONTROL OF BLEEDING,242,MAJOR ESOPHAGEAL DISORDERS,06,DISEASES AND DISORDERS OF THE DIGESTIVE SYSTEM,3,Major,Minor,Medical,Medicare,,,,,Y,19412.10,7707.77
New York City,Manhattan,7002054,001464,New York-Presbyterian Hospital - Columbia Presbyterian Center,50 to 69,100,F,White,Not Span/Hispanic,7,Emergency,Left Against Medical Advice,2022,CIR039,Other specified diseases of veins and lymphatics,GIS004,GI SYSTEM ENDOSCOPY WITHOUT BIOPSY (DIAGNOSTIC),242,MAJOR ESOPHAGEAL DISORDERS,06,DISEASES AND DISORDERS OF THE DIGESTIVE SYSTEM,3,Major,Moderate,Medical,Medicaid,,,,,Y,148914.36,37324.71
Finger Lakes,Monroe,2701005,000413,Strong Memorial Hospital,70 or Older,146,F,Black/African American,Not Span/Hispanic,2,Emergency,Left Against Medical Advice,2022,DIG004,Esophageal disorders,GIS001,ESOPHAGOGASTRODUODENOSCOPY (EGD) WITH BIOPSY,242,MAJOR ESOPHAGEAL DISORDERS,06,DISEASES AND DISORDERS OF THE DIGESTIVE SYSTEM,2,Moderate,Minor,Medical,Medicare,Medicaid,,,,Y,25804.63,7688.18
Capital/Adirond,Warren,5601000,001005,Glens Falls Hospital,18 to 29,128,M,White,Not Span/Hispanic,5,Emergency,Home or Self Care,2022,DIG004,Esophageal disorders,GIS001,ESOPHAGOGASTRODUODENOSCOPY (EGD) WITH BIOPSY,242,MAJOR ESOPHAGEAL DISORDERS,06,DISEASES AND DISORDERS OF THE DIGESTIVE SYSTEM,3,Major,Minor,Medical,Medicaid,,,,,Y,28455.45,15143.93
New York City,Manhattan,7002054,001464,New York-Presbyterian Hospital - Columbia Presbyterian Center,30 to 49,104,F,Other Race,Unknown,2,Emergency,Left Against Medical Advice,2022,DIG004,Esophageal disorders,,,242,MAJOR ESOPHAGEAL DISORDERS,06,DISEASES AND DISORDERS OF THE DIGESTIVE SYSTEM,3,Major,Major,Medical,Medicaid,,,,,Y,31162.62,6810.23
Long Island,Nassau,2951001,000541,North Shore University Hospital,30 to 49,113,F,Other Race,Not Span/Hispanic,8,Emergency,Home or Self Care,2022,DIG004,Esophageal disorders,GIS001,ESOPHAGOGASTRODUODENOSCOPY (EGD) WITH BIOPSY,242,MAJOR ESOPHAGEAL DISORDERS,06,DISEASES AND DISORDERS OF THE DIGESTIVE SYSTEM,2,Moderate,Moderate,Medical,Medicaid,,,,,Y,127527.52,23726.13
Long Island,Nassau,2951001,000541,North Shore University Hospital,30 to 49,113,F,Other Race,Not Span/Hispanic,1,Emergency,Home or Self Care,2022,DIG004,Esophageal disorders,,,242,MAJOR ESOPHAGEAL DISORDERS,06,DISEASES AND DISORDERS OF THE DIGESTIVE SYSTEM,2,Moderate,Minor,Medical,Medicaid,,,,,Y,21502.45,3616.11
Long Island,Nassau,2951001,000541,North Shore University Hospital,70 or Older,110,F,White,Not Span/Hispanic,21,Emergency,Hospice - Medical Facility,2022,DIG004,Esophageal disorders,,,242,MAJOR ESOPHAGEAL DISORDERS,06,DISEASES AND DISORDERS OF THE DIGESTIVE SYSTEM,3,Major,Major,Medical,Medicare,Private Health Insurance,,,,Y,312034.60,60983.54
Long Island,Nassau,2951001,000541,North Shore University Hospital,18 to 29,110,M,White,Not Span/Hispanic,3,Emergency,Home or Self Care,2022,DIG004,Esophageal disorders,GIS001,ESOPHAGOGASTRODUODENOSCOPY (EGD) WITH BIOPSY,242,MAJOR ESOPHAGEAL DISORDERS,06,DISEASES AND DISORDERS OF THE DIGESTIVE SYSTEM,3,Major,Moderate,Medical,Blue Cross/Blue Shield,,,,,Y,68730.55,11899.57
Hudson Valley,Dutchess,1302001,000181,Vassar Brothers Medical Center,50 to 69,126,M,White,Not Span/Hispanic,2,Emergency,Home or Self Care,2022,DIG004,Esophageal disorders,GIS001,ESOPHAGOGASTRODUODENOSCOPY (EGD) WITH BIOPSY,242,MAJOR ESOPHAGEAL DISORDERS,06,DISEASES AND DISORDERS OF THE DIGESTIVE SYSTEM,2,Moderate,Minor,Medical,"Managed Care, Unspecified",,,,,Y,20834.99,5798.35
Hudson Valley,Dutchess,1302001,000181,Vassar Brothers Medical Center,30 to 49,126,F,White,Spanish/Hispanic,9,Emergency,Home or Self Care,2022,CIR039,Other specified diseases of veins and lymphatics,GIS004,GI SYSTEM ENDOSCOPY WITHOUT BIOPSY (DIAGNOSTIC),242,MAJOR ESOPHAGEAL DISORDERS,06,DISEASES AND DISORDERS OF THE DIGESTIVE SYSTEM,3,Major,Major,Medical,Medicaid,,,,,Y,56335.61,18339.69
Hudson Valley,Dutchess,1302001,000181,Vassar Brothers Medical Center,30 to 49,125,M,White,Not Span/Hispanic,1,Emergency,Home or Self Care,2022,DIG004,Esophageal disorders,GIS001,ESOPHAGOGASTRODUODENOSCOPY (EGD) WITH BIOPSY,242,MAJOR ESOPHAGEAL DISORDERS,06,DISEASES AND DISORDERS OF THE DIGESTIVE SYSTEM,2,Moderate,Minor,Medical,"Managed Care, Unspecified",,,,,Y,12201.09,3872.40
Western NY,Cattaraugus,0401001,000066,Olean General Hospital,70 or Older,147,F,White,Not Span/Hispanic,9,Emergency,Skilled Nursing Home,2022,DIG004,Esophageal disorders,GIS001,ESOPHAGOGASTRODUODENOSCOPY (EGD) WITH BIOPSY,242,MAJOR ESOPHAGEAL DISORDERS,06,DISEASES AND DISORDERS OF THE DIGESTIVE SYSTEM,2,Moderate,Moderate,Medical,Medicare,Medicaid,,,,Y,16224.37,7718.93
Western NY,Cattaraugus,0401001,000066,Olean General Hospital,50 to 69,141,F,White,Not Span/Hispanic,2,Emergency,Home or Self Care,2022,DIG004,Esophageal disorders,GIS001,ESOPHAGOGASTRODUODENOSCOPY (EGD) WITH BIOPSY,242,MAJOR ESOPHAGEAL DISORDERS,06,DISEASES AND DISORDERS OF THE DIGESTIVE SYSTEM,3,Major,Minor,Medical,Private Health Insurance,Medicare,,,,Y,10396.70,3904.58
New York City,Manhattan,7002053,001463,NYU Langone Hospitals,18 to 29,100,M,White,Not Span/Hispanic,3,Emergency,Home or Self Care,2022,DIG004,Esophageal disorders,GNR004,ENDOSCOPIC CONTROL OF BLEEDING,242,MAJOR ESOPHAGEAL DISORDERS,06,DISEASES AND DISORDERS OF THE DIGESTIVE SYSTEM,3,Major,Major,Medical,Private Health Insurance,,,,,Y,68893.56,18733.36
New York City,Manhattan,7002053,001463,NYU Langone Hospitals,70 or Older,100,F,White,Not Span/Hispanic,3,Emergency,Skilled Nursing Home,2022,DIG004,Esophageal disorders,ADM001,TRANSFUSION OF BLOOD AND BLOOD PRODUCTS,242,MAJOR ESOPHAGEAL DISORDERS,06,DISEASES AND DISORDERS OF THE DIGESTIVE SYSTEM,3,Major,Major,Medical,Medicare,Medicare,,,,Y,74940.58,19101.24
New York City,Manhattan,7002053,001463,NYU Langone Hospitals,50 to 69,104,M,Other Race,Not Span/Hispanic,4,Emergency,Home w/ Home Health Services,2022,DIG004,Esophageal disorders,GIS001,ESOPHAGOGASTRODUODENOSCOPY (EGD) WITH BIOPSY,242,MAJOR ESOPHAGEAL DISORDERS,06,DISEASES AND DISORDERS OF THE DIGESTIVE SYSTEM,3,Major,Minor,Medical,Medicaid,,,,,Y,74119.75,22410.96
New York City,Manhattan,7002053,001463,NYU Langone Hospitals,50 to 69,100,F,Other Race,Unknown,2,Emergency,Home or Self Care,2022,DIG004,Esophageal disorders,GIS001,ESOPHAGOGASTRODUODENOSCOPY (EGD) WITH BIOPSY,242,MAJOR ESOPHAGEAL DISORDERS,06,DISEASES AND DISORDERS OF THE DIGESTIVE SYSTEM,1,Minor,Minor,Medical,Private Health Insurance,Medicare,,,,Y,52862.20,13250.52
New York City,Manhattan,7002053,001463,NYU Langone Hospitals,50 to 69,104,F,Other Race,Not Span/Hispanic,4,Emergency,Home w/ Home Health Services,2022,DIG004,Esophageal disorders,GIS004,GI SYSTEM ENDOSCOPY WITHOUT BIOPSY (DIAGNOSTIC),242,MAJOR ESOPHAGEAL DISORDERS,06,DISEASES AND DISORDERS OF THE DIGESTIVE SYSTEM,2,Moderate,Moderate,Medical,Medicaid,,,,,Y,90234.48,29662.95
Finger Lakes,Monroe,2701005,000413,Strong Memorial Hospital,50 to 69,146,M,White,Not Span/Hispanic,3,Emergency,Home or Self Care,2022,CIR039,Other specified diseases of veins and lymphatics,GIS006,PARACENTESIS,242,MAJOR ESOPHAGEAL DISORDERS,06,DISEASES AND DISORDERS OF THE DIGESTIVE SYSTEM,3,Major,Major,Medical,Medicare,Medicaid,,,,Y,17582.13,6163.02
New York City,Manhattan,7002054,001464,New York-Presbyterian Hospital - Columbia Presbyterian Center,70 or Older,112,M,Other Race,Spanish/Hispanic,5,Emergency,Home or Self Care,2022,DIG004,Esophageal disorders,,,242,MAJOR ESOPHAGEAL DISORDERS,06,DISEASES AND DISORDERS OF THE DIGESTIVE SYSTEM,3,Major,Moderate,Medical,Private Health Insurance,Medicare,,,,Y,85532.08,18291.15
New York City,Manhattan,7002001,001438,Bellevue Hospital Center,30 to 49,113,M,Other Race,Spanish/Hispanic,4,Emergency,Home or Self Care,2022,DIG004,Esophageal disorders,SUD001,SUBSTANCE USE DETOXIFICATION,242,MAJOR ESOPHAGEAL DISORDERS,06,DISEASES AND DISORDERS OF THE DIGESTIVE SYSTEM,3,Major,Moderate,Medical,Medicaid,,,,,Y,36135.06,20780.69
New York City,Manhattan,7002001,001438,Bellevue Hospital Center,18 to 29,OOS,M,Other Race,Unknown,2,Emergency,Home or Self Care,2022,DIG004,Esophageal disorders,ADM021,"ADMINISTRATION OF THERAPEUTIC SUBSTANCES, NEC",242,MAJOR ESOPHAGEAL DISORDERS,06,DISEASES AND DISORDERS OF THE DIGESTIVE SYSTEM,2,Moderate,Moderate,Medical,Medicaid,,,,,Y,20159.84,11593.60
New York City,Manhattan,7002054,001464,New York-Presbyterian Hospital - Columbia Presbyterian Center,70 or Older,112,F,White,Not Span/Hispanic,2,Emergency,Home or Self Care,2022,DIG004,Esophageal disorders,GIS004,GI SYSTEM ENDOSCOPY WITHOUT BIOPSY (DIAGNOSTIC),242,MAJOR ESOPHAGEAL DISORDERS,06,DISEASES AND DISORDERS OF THE DIGESTIVE SYSTEM,1,Minor,Minor,Medical,Medicare,Blue Cross/Blue Shield,,,,Y,44710.27,10932.65