Hospital Service Area,Hospital County,Operating Certificate Number,Permanent Facility Id,Facility Name,Age Group,Zip Code - 3 digits,Gender,Race,Ethnicity,Length of Stay,Type of Admission,Patient Disposition,Discharge Year,CCS Diagnosis Code,CCS Diagnosis Description,CCS Procedure Code,CCS Procedure Description,APR DRG Code,APR DRG Description,APR MDC Code,APR MDC Description,APR Severity of Illness Code,APR Severity of Illness Description,APR Risk of Mortality,APR Medical Surgical Description,Payment Typology 1,Payment Typology 2,Payment Typology 3,Birth Weight,Abortion Edit Indicator,Emergency Department Indicator,Total Charges,Total Costs
New York City,Manhattan,7002053,001463,NYU Langone Hospitals,70 or Older,100,F,White,Not Span/Hispanic,4,Elective,Inpatient Rehabilitation Facility,2022,DIG025,Other specified and unspecified gastrointestinal disorders,GIS002,COLONOSCOPY AND PROCTOSCOPY WITH BIOPSY,246,GASTROINTESTINAL VASCULAR INSUFFICIENCY,06,DISEASES AND DISORDERS OF THE DIGESTIVE SYSTEM,3,Major,Major,Medical,Medicare,Medicare,,,,N,67717.61,22109.84
Finger Lakes,Monroe,2701005,000413,Strong Memorial Hospital,70 or Older,131,M,White,Not Span/Hispanic,3,Urgent,Home or Self Care,2022,DIG025,Other specified and unspecified gastrointestinal disorders,,,246,GASTROINTESTINAL VASCULAR INSUFFICIENCY,06,DISEASES AND DISORDERS OF THE DIGESTIVE SYSTEM,2,Moderate,Major,Medical,Medicare,,,,,N,6470.96,3775.21
New York City,Manhattan,7002001,001438,Bellevue Hospital Center,50 to 69,113,F,Other Race,Not Span/Hispanic,2,Emergency,Home or Self Care,2022,DIG025,Other specified and unspecified gastrointestinal disorders,GIS002,COLONOSCOPY AND PROCTOSCOPY WITH BIOPSY,246,GASTROINTESTINAL VASCULAR INSUFFICIENCY,06,DISEASES AND DISORDERS OF THE DIGESTIVE SYSTEM,1,Minor,Minor,Medical,Private Health Insurance,,,,,Y,21709.50,12484.79
New York City,Manhattan,7002054,001464,New York-Presbyterian Hospital - Columbia Presbyterian Center,70 or Older,100,F,Black/African American,Not Span/Hispanic,4,Emergency,Skilled Nursing Home,2022,DIG025,Other specified and unspecified gastrointestinal disorders,GIS001,ESOPHAGOGASTRODUODENOSCOPY (EGD) WITH BIOPSY,246,GASTROINTESTINAL VASCULAR INSUFFICIENCY,06,DISEASES AND DISORDERS OF THE DIGESTIVE SYSTEM,2,Moderate,Major,Medical,Private Health Insurance,,,,,Y,87538.26,21725.02
New York City,Manhattan,7002053,001463,NYU Langone Hospitals,70 or Older,112,M,White,Spanish/Hispanic,29,Emergency,Hospice - Home,2022,DIG025,Other specified and unspecified gastrointestinal disorders,ADM001,TRANSFUSION OF BLOOD AND BLOOD PRODUCTS,246,GASTROINTESTINAL VASCULAR INSUFFICIENCY,06,DISEASES AND DISORDERS OF THE DIGESTIVE SYSTEM,4,Extreme,Extreme,Medical,Medicare,Medicaid,,,,Y,463415.66,160320.82
Finger Lakes,Monroe,2701005,000413,Strong Memorial Hospital,50 to 69,146,M,White,Not Span/Hispanic,9,Emergency,Home or Self Care,2022,DIG025,Other specified and unspecified gastrointestinal disorders,,,246,GASTROINTESTINAL VASCULAR INSUFFICIENCY,06,DISEASES AND DISORDERS OF THE DIGESTIVE SYSTEM,3,Major,Major,Medical,Medicare,Medicaid,,,,Y,38406.41,16029.33
New York City,Manhattan,7002053,001463,NYU Langone Hospitals,70 or Older,100,F,Other Race,Not Span/Hispanic,4,Emergency,Home or Self Care,2022,DIG025,Other specified and unspecified gastrointestinal disorders,OTR004,ISOLATION PROCEDURES,246,GASTROINTESTINAL VASCULAR INSUFFICIENCY,06,DISEASES AND DISORDERS OF THE DIGESTIVE SYSTEM,3,Major,Major,Medical,Medicare,Medicaid,,,,Y,76238.08,22514.71
Long Island,Nassau,2951001,000541,North Shore University Hospital,50 to 69,115,F,White,Not Span/Hispanic,3,Emergency,Home or Self Care,2022,DIG025,Other specified and unspecified gastrointestinal disorders,,,246,GASTROINTESTINAL VASCULAR INSUFFICIENCY,06,DISEASES AND DISORDERS OF THE DIGESTIVE SYSTEM,2,Moderate,Major,Medical,Medicare,Medicare,,,,Y,52411.35,8047.11
New York City,Manhattan,7002054,001464,New York-Presbyterian Hospital - Columbia Presbyterian Center,50 to 69,100,F,Other Race,Spanish/Hispanic,3,Emergency,Home or Self Care,2022,DIG025,Other specified and unspecified gastrointestinal disorders,GIS002,COLONOSCOPY AND PROCTOSCOPY WITH BIOPSY,246,GASTROINTESTINAL VASCULAR INSUFFICIENCY,06,DISEASES AND DISORDERS OF THE DIGESTIVE SYSTEM,2,Moderate,Moderate,Medical,Self-Pay,,,,,Y,59734.91,14217.97
New York City,Manhattan,7002053,001463,NYU Langone Hospitals,18 to 29,112,F,White,Not Span/Hispanic,6,Emergency,Home or Self Care,2022,DIG025,Other specified and unspecified gastrointestinal disorders,GIS001,ESOPHAGOGASTRODUODENOSCOPY (EGD) WITH BIOPSY,246,GASTROINTESTINAL VASCULAR INSUFFICIENCY,06,DISEASES AND DISORDERS OF THE DIGESTIVE SYSTEM,2,Moderate,Minor,Medical,Private Health Insurance,,,,,Y,152563.35,42789.43
New York City,Manhattan,7002054,001464,New York-Presbyterian Hospital - Columbia Presbyterian Center,70 or Older,100,F,White,Spanish/Hispanic,4,Emergency,Home or Self Care,2022,DIG025,Other specified and unspecified gastrointestinal disorders,,,246,GASTROINTESTINAL VASCULAR INSUFFICIENCY,06,DISEASES AND DISORDERS OF THE DIGESTIVE SYSTEM,2,Moderate,Major,Medical,Medicare,Medicaid,,,,Y,62958.48,13238.42
New York City,Manhattan,7002054,001464,New York-Presbyterian Hospital - Columbia Presbyterian Center,0 to 17,100,F,Other Race,Unknown,11,Emergency,Home or Self Care,2022,DIG025,Other specified and unspecified gastrointestinal disorders,,,246,GASTROINTESTINAL VASCULAR INSUFFICIENCY,06,DISEASES AND DISORDERS OF THE DIGESTIVE SYSTEM,3,Major,Moderate,Medical,Private Health Insurance,,,,,Y,176326.16,40438.67
New York City,Manhattan,7002001,001438,Bellevue Hospital Center,70 or Older,111,F,Other Race,Spanish/Hispanic,3,Emergency,Home or Self Care,2022,DIG025,Other specified and unspecified gastrointestinal disorders,IMG006,COMPUTERIZED TOMOGRAPHY (CT) WITH CONTRAST,246,GASTROINTESTINAL VASCULAR INSUFFICIENCY,06,DISEASES AND DISORDERS OF THE DIGESTIVE SYSTEM,2,Moderate,Minor,Medical,Medicare,Medicaid,,,,Y,26979.88,15515.70
Finger Lakes,Monroe,2701005,000413,Strong Memorial Hospital,70 or Older,144,F,White,Not Span/Hispanic,18,Emergency,Home or Self Care,2022,DIG025,Other specified and unspecified gastrointestinal disorders,GIS002,COLONOSCOPY AND PROCTOSCOPY WITH BIOPSY,246,GASTROINTESTINAL VASCULAR INSUFFICIENCY,06,DISEASES AND DISORDERS OF THE DIGESTIVE SYSTEM,3,Major,Major,Medical,Medicare,,,,,Y,48365.71,24956.40
Long Island,Nassau,2951001,000541,North Shore University Hospital,70 or Older,113,F,White,Spanish/Hispanic,7,Emergency,Home or Self Care,2022,DIG025,Other specified and unspecified gastrointestinal disorders,,,246,GASTROINTESTINAL VASCULAR INSUFFICIENCY,06,DISEASES AND DISORDERS OF THE DIGESTIVE SYSTEM,2,Moderate,Major,Medical,Medicare,Medicare,,,,Y,109985.26,16640.93
Long Island,Nassau,2951001,000541,North Shore University Hospital,50 to 69,114,M,Black/African American,Not Span/Hispanic,2,Emergency,Home w/ Home Health Services,2022,DIG025,Other specified and unspecified gastrointestinal disorders,ESA001,HEMODIALYSIS,246,GASTROINTESTINAL VASCULAR INSUFFICIENCY,06,DISEASES AND DISORDERS OF THE DIGESTIVE SYSTEM,3,Major,Major,Medical,Medicare,Medicare,Medicaid,,,Y,50736.30,9663.61
Long Island,Nassau,2951001,000541,North Shore University Hospital,70 or Older,110,F,White,Not Span/Hispanic,5,Emergency,Home or Self Care,2022,DIG025,Other specified and unspecified gastrointestinal disorders,,,246,GASTROINTESTINAL VASCULAR INSUFFICIENCY,06,DISEASES AND DISORDERS OF THE DIGESTIVE SYSTEM,3,Major,Major,Medical,Medicare,Private Health Insurance,,,,Y,85401.58,12915.70
New York City,Manhattan,7002054,001464,New York-Presbyterian Hospital - Columbia Presbyterian Center,70 or Older,100,F,Black/African American,Not Span/Hispanic,2,Emergency,Home or Self Care,2022,DIG025,Other specified and unspecified gastrointestinal disorders,GIS002,COLONOSCOPY AND PROCTOSCOPY WITH BIOPSY,246,GASTROINTESTINAL VASCULAR INSUFFICIENCY,06,DISEASES AND DISORDERS OF THE DIGESTIVE SYSTEM,1,Minor,Minor,Medical,Medicare,,,,,Y,48615.75,11549.29
New York City,Manhattan,7002054,001464,New York-Presbyterian Hospital - Columbia Presbyterian Center,50 to 69,100,F,Other Race,Unknown,4,Emergency,Home or Self Care,2022,DIG025,Other specified and unspecified gastrointestinal disorders,ADM017,ADMINISTRATION OF NUTRITIONAL AND ELECTROLYTIC SUBSTANCES,246,GASTROINTESTINAL VASCULAR INSUFFICIENCY,06,DISEASES AND DISORDERS OF THE DIGESTIVE SYSTEM,2,Moderate,Minor,Medical,Private Health Insurance,,,,,Y,56208.81,11965.90
Finger Lakes,Monroe,2701005,000413,Strong Memorial Hospital,0 to 17,146,M,Other Race,Unknown,1,Emergency,Home or Self Care,2022,DIG025,Other specified and unspecified gastrointestinal disorders,,,246,GASTROINTESTINAL VASCULAR INSUFFICIENCY,06,DISEASES AND DISORDERS OF THE DIGESTIVE SYSTEM,2,Moderate,Major,Medical,Medicaid,,,,,Y,5413.01,
Finger Lakes,Monroe,2701005,000413,Strong Memorial Hospital,50 to 69,144,F,Other Race,Spanish/Hispanic,7,Emergency,Home w/ Home Health Services,2022,DIG025,Other specified and unspecified gastrointestinal disorders,ESA001,HEMODIALYSIS,246,GASTROINTESTINAL VASCULAR INSUFFICIENCY,06,DISEASES AND DISORDERS OF THE DIGESTIVE SYSTEM,3,Major,Major,Medical,Blue Cross/Blue Shield,Medicare,,,,Y,77493.04,21541.97
Capital/Adirond,Warren,5601000,001005,Glens Falls Hospital,50 to 69,128,F,White,Not Span/Hispanic,12,Emergency,Home or Self Care,2022,DIG025,Other specified and unspecified gastrointestinal disorders,GIS002,COLONOSCOPY AND PROCTOSCOPY WITH BIOPSY,246,GASTROINTESTINAL VASCULAR INSUFFICIENCY,06,DISEASES AND DISORDERS OF THE DIGESTIVE SYSTEM,3,Major,Major,Medical,Medicare,Medicaid,,,,Y,61585.08,28554.56
Capital/Adirond,Warren,5601000,001005,Glens Falls Hospital,70 or Older,128,M,White,Not Span/Hispanic,6,Emergency,Home or Self Care,2022,DIG025,Other specified and unspecified gastrointestinal disorders,,,246,GASTROINTESTINAL VASCULAR INSUFFICIENCY,06,DISEASES AND DISORDERS OF THE DIGESTIVE SYSTEM,2,Moderate,Moderate,Medical,Medicare,,,,,Y,28260.38,7429.56
New York City,Manhattan,7002054,001464,New York-Presbyterian Hospital - Columbia Presbyterian Center,50 to 69,100,M,Black/African American,Not Span/Hispanic,3,Emergency,Home or Self Care,2022,DIG025,Other specified and unspecified gastrointestinal disorders,,,246,GASTROINTESTINAL VASCULAR INSUFFICIENCY,06,DISEASES AND DISORDERS OF THE DIGESTIVE SYSTEM,3,Major,Major,Medical,Medicare,,,,,Y,50380.45,11270.03
Long Island,Nassau,2951001,000541,North Shore University Hospital,50 to 69,114,F,Black/African American,Not Span/Hispanic,7,Emergency,Home or Self Care,2022,DIG025,Other specified and unspecified gastrointestinal disorders,GIS002,COLONOSCOPY AND PROCTOSCOPY WITH BIOPSY,246,GASTROINTESTINAL VASCULAR INSUFFICIENCY,06,DISEASES AND DISORDERS OF THE DIGESTIVE SYSTEM,3,Major,Major,Medical,Blue Cross/Blue Shield,,,,,Y,135461.94,22647.45
Long Island,Nassau,2951001,000541,North Shore University Hospital,50 to 69,114,F,White,Not Span/Hispanic,2,Emergency,Home or Self Care,2022,DIG025,Other specified and unspecified gastrointestinal disorders,,,246,GASTROINTESTINAL VASCULAR INSUFFICIENCY,06,DISEASES AND DISORDERS OF THE DIGESTIVE SYSTEM,1,Minor,Major,Medical,Medicare,Blue Cross/Blue Shield,,,,Y,39661.70,5888.14
Long Island,Nassau,2951001,000541,North Shore University Hospital,50 to 69,114,F,Other Race,Spanish/Hispanic,10,Emergency,Home or Self Care,2022,DIG025,Other specified and unspecified gastrointestinal disorders,GIS004,GI SYSTEM ENDOSCOPY WITHOUT BIOPSY (DIAGNOSTIC),246,GASTROINTESTINAL VASCULAR INSUFFICIENCY,06,DISEASES AND DISORDERS OF THE DIGESTIVE SYSTEM,2,Moderate,Moderate,Medical,Medicare,Private Health Insurance,,,,Y,155779.63,28949.52
Long Island,Nassau,2951001,000541,North Shore University Hospital,50 to 69,113,F,Other Race,Not Span/Hispanic,2,Emergency,Home or Self Care,2022,DIG025,Other specified and unspecified gastrointestinal disorders,,,246,GASTROINTESTINAL VASCULAR INSUFFICIENCY,06,DISEASES AND DISORDERS OF THE DIGESTIVE SYSTEM,3,Major,Major,Medical,Medicare,Medicare,,,,Y,52663.29,7160.74
Long Island,Nassau,2951001,000541,North Shore University Hospital,30 to 49,116,M,White,Not Span/Hispanic,5,Emergency,Home or Self Care,2022,DIG025,Other specified and unspecified gastrointestinal disorders,,,246,GASTROINTESTINAL VASCULAR INSUFFICIENCY,06,DISEASES AND DISORDERS OF THE DIGESTIVE SYSTEM,3,Major,Major,Medical,Blue Cross/Blue Shield,Medicaid,,,,Y,83820.44,12348.96
Long Island,Nassau,2951001,000541,North Shore University Hospital,30 to 49,116,M,White,Not Span/Hispanic,4,Emergency,Home or Self Care,2022,DIG025,Other specified and unspecified gastrointestinal disorders,OTR004,ISOLATION PROCEDURES,246,GASTROINTESTINAL VASCULAR INSUFFICIENCY,06,DISEASES AND DISORDERS OF THE DIGESTIVE SYSTEM,3,Major,Major,Medical,Medicaid,Medicaid,Blue Cross/Blue Shield,,,Y,61292.07,9527.88
Hudson Valley,Dutchess,1302001,000181,Vassar Brothers Medical Center,70 or Older,126,F,White,Not Span/Hispanic,4,Emergency,Home or Self Care,2022,DIG025,Other specified and unspecified gastrointestinal disorders,HEP001,LIVER BIOPSY,246,GASTROINTESTINAL VASCULAR INSUFFICIENCY,06,DISEASES AND DISORDERS OF THE DIGESTIVE SYSTEM,3,Major,Major,Medical,Medicare,Blue Cross/Blue Shield,,,,Y,44786.86,11522.50
Hudson Valley,Dutchess,1302001,000181,Vassar Brothers Medical Center,70 or Older,125,F,White,Not Span/Hispanic,3,Emergency,Home or Self Care,2022,DIG025,Other specified and unspecified gastrointestinal disorders,GIS004,GI SYSTEM ENDOSCOPY WITHOUT BIOPSY (DIAGNOSTIC),246,GASTROINTESTINAL VASCULAR INSUFFICIENCY,06,DISEASES AND DISORDERS OF THE DIGESTIVE SYSTEM,1,Minor,Major,Medical,Medicare,,,,,Y,23120.80,6697.24
New York City,Manhattan,7002054,001464,New York-Presbyterian Hospital - Columbia Presbyterian Center,70 or Older,100,M,Other Race,Not Span/Hispanic,10,Emergency,Home w/ Home Health Services,2022,DIG025,Other specified and unspecified gastrointestinal disorders,URN006,BLADDER CATHETERIZATION AND DRAINAGE,246,GASTROINTESTINAL VASCULAR INSUFFICIENCY,06,DISEASES AND DISORDERS OF THE DIGESTIVE SYSTEM,3,Major,Major,Medical,Medicare,Private Health Insurance,,,,Y,122820.64,25853.18
Western NY,Cattaraugus,0401001,000066,Olean General Hospital,70 or Older,OOS,M,White,Not Span/Hispanic,4,Emergency,Home w/ Home Health Services,2022,DIG025,Other specified and unspecified gastrointestinal disorders,GIS002,COLONOSCOPY AND PROCTOSCOPY WITH BIOPSY,246,GASTROINTESTINAL VASCULAR INSUFFICIENCY,06,DISEASES AND DISORDERS OF THE DIGESTIVE SYSTEM,2,Moderate,Minor,Medical,Federal/State/Local/VA,,,,,Y,10032.56,4107.49
Western NY,Cattaraugus,0401001,000066,Olean General Hospital,70 or Older,147,F,White,Not Span/Hispanic,2,Emergency,Expired,2022,DIG025,Other specified and unspecified gastrointestinal disorders,CAR024,VENOUS AND ARTERIAL CATHETER PLACEMENT,246,GASTROINTESTINAL VASCULAR INSUFFICIENCY,06,DISEASES AND DISORDERS OF THE DIGESTIVE SYSTEM,2,Moderate,Major,Medical,Medicare,,,,,Y,17261.88,5234.70
New York City,Manhattan,7002053,001463,NYU Langone Hospitals,70 or Older,100,F,White,Not Span/Hispanic,4,Urgent,Home or Self Care,2022,DIG025,Other specified and unspecified gastrointestinal disorders,,,246,GASTROINTESTINAL VASCULAR INSUFFICIENCY,06,DISEASES AND DISORDERS OF THE DIGESTIVE SYSTEM,3,Major,Moderate,Medical,Medicare,Private Health Insurance,,,,N,60123.77,20667.15
New York City,Manhattan,7002053,001463,NYU Langone Hospitals,30 to 49,OOS,F,Other Race,Not Span/Hispanic,2,Emergency,Home or Self Care,2022,DIG025,Other specified and unspecified gastrointestinal disorders,GIS002,COLONOSCOPY AND PROCTOSCOPY WITH BIOPSY,246,GASTROINTESTINAL VASCULAR INSUFFICIENCY,06,DISEASES AND DISORDERS OF THE DIGESTIVE SYSTEM,3,Major,Moderate,Medical,Private Health Insurance,,,,,Y,66970.54,15208.93
New York City,Manhattan,7002053,001463,NYU Langone Hospitals,50 to 69,100,M,White,Not Span/Hispanic,3,Emergency,Home or Self Care,2022,DIG025,Other specified and unspecified gastrointestinal disorders,,,246,GASTROINTESTINAL VASCULAR INSUFFICIENCY,06,DISEASES AND DISORDERS OF THE DIGESTIVE SYSTEM,3,Major,Major,Medical,Private Health Insurance,,,,,Y,48312.29,15948.29
Finger Lakes,Monroe,2701005,000413,Strong Memorial Hospital,50 to 69,145,F,White,Not Span/Hispanic,7,Emergency,Home or Self Care,2022,DIG025,Other specified and unspecified gastrointestinal disorders,,,246,GASTROINTESTINAL VASCULAR INSUFFICIENCY,06,DISEASES AND DISORDERS OF THE DIGESTIVE SYSTEM,2,Moderate,Minor,Medical,Medicare,Blue Cross/Blue Shield,,,,Y,21052.25,10043.10
Finger Lakes,Monroe,2701005,000413,Strong Memorial Hospital,70 or Older,146,M,White,Not Span/Hispanic,18,Emergency,Skilled Nursing Home,2022,DIG025,Other specified and unspecified gastrointestinal disorders,GIS002,COLONOSCOPY AND PROCTOSCOPY WITH BIOPSY,246,GASTROINTESTINAL VASCULAR INSUFFICIENCY,06,DISEASES AND DISORDERS OF THE DIGESTIVE SYSTEM,3,Major,Extreme,Medical,Medicare,,,,,Y,65553.17,29545.25
New York City,Manhattan,7002053,001463,NYU Langone Hospitals,50 to 69,100,M,White,Not Span/Hispanic,2,Emergency,Home or Self Care,2022,DIG025,Other specified and unspecified gastrointestinal disorders,GIS002,COLONOSCOPY AND PROCTOSCOPY WITH BIOPSY,246,GASTROINTESTINAL VASCULAR INSUFFICIENCY,06,DISEASES AND DISORDERS OF THE DIGESTIVE SYSTEM,2,Moderate,Moderate,Medical,Blue Cross/Blue Shield,,,,,Y,71872.19,19976.39
Finger Lakes,Monroe,2701005,000413,Strong Memorial Hospital,30 to 49,144,F,White,Not Span/Hispanic,1,Emergency,Home or Self Care,2022,DIG025,Other specified and unspecified gastrointestinal disorders,GIS002,COLONOSCOPY AND PROCTOSCOPY WITH BIOPSY,246,GASTROINTESTINAL VASCULAR INSUFFICIENCY,06,DISEASES AND DISORDERS OF THE DIGESTIVE SYSTEM,1,Minor,Minor,Medical,Private Health Insurance,,,,,Y,20605.11,6081.65
Capital/Adirond,Warren,5601000,001005,Glens Falls Hospital,70 or Older,128,F,White,Not Span/Hispanic,5,Emergency,Home w/ Home Health Services,2022,DIG025,Other specified and unspecified gastrointestinal disorders,,,246,GASTROINTESTINAL VASCULAR INSUFFICIENCY,06,DISEASES AND DISORDERS OF THE DIGESTIVE SYSTEM,3,Major,Major,Medical,Medicare,Self-Pay,,,,Y,31011.65,10877.01
New York City,Manhattan,7002053,001463,NYU Langone Hospitals,0 to 17,112,F,Other Race,Not Span/Hispanic,29,Emergency,Home or Self Care,2022,DIG025,Other specified and unspecified gastrointestinal disorders,GIS025,OTHER GI SYSTEM DEVICE PROCEDURES,246,GASTROINTESTINAL VASCULAR INSUFFICIENCY,06,DISEASES AND DISORDERS OF THE DIGESTIVE SYSTEM,3,Major,Moderate,Medical,Private Health Insurance,,,,,Y,273735.36,90230.11
Hudson Valley,Dutchess,1302001,000181,Vassar Brothers Medical Center,50 to 69,125,F,White,Not Span/Hispanic,2,Emergency,Home or Self Care,2022,DIG025,Other specified and unspecified gastrointestinal disorders,,,246,GASTROINTESTINAL VASCULAR INSUFFICIENCY,06,DISEASES AND DISORDERS OF THE DIGESTIVE SYSTEM,1,Minor,Minor,Medical,Blue Cross/Blue Shield,,,,,Y,12014.28,2742.64
New York City,Manhattan,7002054,001464,New York-Presbyterian Hospital - Columbia Presbyterian Center,70 or Older,100,F,White,Not Span/Hispanic,4,Emergency,Home w/ Home Health Services,2022,DIG025,Other specified and unspecified gastrointestinal disorders,ADM017,ADMINISTRATION OF NUTRITIONAL AND ELECTROLYTIC SUBSTANCES,246,GASTROINTESTINAL VASCULAR INSUFFICIENCY,06,DISEASES AND DISORDERS OF THE DIGESTIVE SYSTEM,2,Moderate,Moderate,Medical,Medicare,,,,,Y,64122.38,13481.37
Long Island,Nassau,2951001,000541,North Shore University Hospital,70 or Older,117,F,White,Not Span/Hispanic,6,Emergency,Home w/ Home Health Services,2022,DIG025,Other specified and unspecified gastrointestinal disorders,,,246,GASTROINTESTINAL VASCULAR INSUFFICIENCY,06,DISEASES AND DISORDERS OF THE DIGESTIVE SYSTEM,3,Major,Moderate,Medical,Medicare,Private Health Insurance,,,,Y,94991.78,14858.16
Long Island,Nassau,2951001,000541,North Shore University Hospital,70 or Older,113,F,Other Race,Spanish/Hispanic,9,Emergency,Home or Self Care,2022,DIG025,Other specified and unspecified gastrointestinal disorders,GIS004,GI SYSTEM ENDOSCOPY WITHOUT BIOPSY (DIAGNOSTIC),246,GASTROINTESTINAL VASCULAR INSUFFICIENCY,06,DISEASES AND DISORDERS OF THE DIGESTIVE SYSTEM,2,Moderate,Major,Medical,Medicare,Medicare,Medicaid,,,Y,156356.21,41235.51
New York City,Manhattan,7002053,001463,NYU Langone Hospitals,18 to 29,112,F,Other Race,Not Span/Hispanic,3,Emergency,Home or Self Care,2022,DIG025,Other specified and unspecified gastrointestinal disorders,OTR004,ISOLATION PROCEDURES,246,GASTROINTESTINAL VASCULAR INSUFFICIENCY,06,DISEASES AND DISORDERS OF THE DIGESTIVE SYSTEM,3,Major,Moderate,Medical,Private Health Insurance,,,,,Y,50388.18,16571.10
New York City,Manhattan,7002054,001464,New York-Presbyterian Hospital - Columbia Presbyterian Center,70 or Older,100,F,Other Race,Spanish/Hispanic,2,Emergency,Home w/ Home Health Services,2022,DIG025,Other specified and unspecified gastrointestinal disorders,,,246,GASTROINTESTINAL VASCULAR INSUFFICIENCY,06,DISEASES AND DISORDERS OF THE DIGESTIVE SYSTEM,2,Moderate,Minor,Medical,Medicare,Medicaid,,,,Y,43287.54,8990.64
New York City,Manhattan,7002053,001463,NYU Langone Hospitals,70 or Older,100,F,Other Race,Not Span/Hispanic,2,Emergency,Home or Self Care,2022,DIG025,Other specified and unspecified gastrointestinal disorders,,,246,GASTROINTESTINAL VASCULAR INSUFFICIENCY,06,DISEASES AND DISORDERS OF THE DIGESTIVE SYSTEM,2,Moderate,Minor,Medical,Medicare,Private Health Insurance,,,,Y,46782.32,12197.10
New York City,Manhattan,7002053,001463,NYU Langone Hospitals,70 or Older,114,F,Other Race,Not Span/Hispanic,5,Emergency,Home w/ Home Health Services,2022,DIG025,Other specified and unspecified gastrointestinal disorders,GIS002,COLONOSCOPY AND PROCTOSCOPY WITH BIOPSY,246,GASTROINTESTINAL VASCULAR INSUFFICIENCY,06,DISEASES AND DISORDERS OF THE DIGESTIVE SYSTEM,3,Major,Major,Medical,Medicare,Medicaid,,,,Y,88392.12,27682.76
New York City,Manhattan,7002054,001464,New York-Presbyterian Hospital - Columbia Presbyterian Center,70 or Older,104,F,Black/African American,Not Span/Hispanic,1,Emergency,Home or Self Care,2022,DIG025,Other specified and unspecified gastrointestinal disorders,,,246,GASTROINTESTINAL VASCULAR INSUFFICIENCY,06,DISEASES AND DISORDERS OF THE DIGESTIVE SYSTEM,2,Moderate,Major,Medical,Medicare,,,,,Y,21558.63,4624.71
Hudson Valley,Dutchess,1302001,000181,Vassar Brothers Medical Center,70 or Older,126,F,White,Not Span/Hispanic,6,Emergency,Home or Self Care,2022,DIG025,Other specified and unspecified gastrointestinal disorders,GIS016,GI SYSTEM ENDOSCOPIC THERAPEUTIC PROCEDURES,246,GASTROINTESTINAL VASCULAR INSUFFICIENCY,06,DISEASES AND DISORDERS OF THE DIGESTIVE SYSTEM,3,Major,Moderate,Medical,Medicare,Medicaid,,,,Y,41885.56,13129.18
New York City,Manhattan,7002054,001464,New York-Presbyterian Hospital - Columbia Presbyterian Center,70 or Older,100,F,Other Race,Unknown,5,Emergency,Home w/ Home Health Services,2022,DIG025,Other specified and unspecified gastrointestinal disorders,ADM015,ADMINISTRATION OF ANTIBIOTICS,246,GASTROINTESTINAL VASCULAR INSUFFICIENCY,06,DISEASES AND DISORDERS OF THE DIGESTIVE SYSTEM,2,Moderate,Moderate,Medical,Medicare,Medicaid,,,,Y,79703.74,16965.45
Finger Lakes,Monroe,2701005,000413,Strong Memorial Hospital,70 or Older,144,F,White,Not Span/Hispanic,6,Emergency,Home w/ Home Health Services,2022,DIG025,Other specified and unspecified gastrointestinal disorders,GIS002,COLONOSCOPY AND PROCTOSCOPY WITH BIOPSY,246,GASTROINTESTINAL VASCULAR INSUFFICIENCY,06,DISEASES AND DISORDERS OF THE DIGESTIVE SYSTEM,2,Moderate,Minor,Medical,Medicare,,,,,Y,31104.71,11995.01
Finger Lakes,Monroe,2701005,000413,Strong Memorial Hospital,50 to 69,146,M,White,Not Span/Hispanic,5,Emergency,Home or Self Care,2022,DIG025,Other specified and unspecified gastrointestinal disorders,,,246,GASTROINTESTINAL VASCULAR INSUFFICIENCY,06,DISEASES AND DISORDERS OF THE DIGESTIVE SYSTEM,3,Major,Major,Medical,Medicare,,,,,Y,17102.22,7916.26