Hospital Service Area,Hospital County,Operating Certificate Number,Permanent Facility Id,Facility Name,Age Group,Zip Code - 3 digits,Gender,Race,Ethnicity,Length of Stay,Type of Admission,Patient Disposition,Discharge Year,CCS Diagnosis Code,CCS Diagnosis Description,CCS Procedure Code,CCS Procedure Description,APR DRG Code,APR DRG Description,APR MDC Code,APR MDC Description,APR Severity of Illness Code,APR Severity of Illness Description,APR Risk of Mortality,APR Medical Surgical Description,Payment Typology 1,Payment Typology 2,Payment Typology 3,Birth Weight,Abortion Edit Indicator,Emergency Department Indicator,Total Charges,Total Costs
New York City,Manhattan,7002054,001464,New York-Presbyterian Hospital - Columbia Presbyterian Center,0 to 17,109,M,White,Not Span/Hispanic,1,Emergency,Home or Self Care,2022,DIG024,Postprocedural or postoperative digestive system complication,GIS025,OTHER GI SYSTEM DEVICE PROCEDURES,252,"MALFUNCTION, REACTION AND COMPLICATION OF GASTROINTESTINAL DEVICE OR PROCEDURE",06,DISEASES AND DISORDERS OF THE DIGESTIVE SYSTEM,3,Major,Moderate,Medical,Blue Cross/Blue Shield,Medicaid,,,,Y,30825.68,8250.44
New York City,Manhattan,7002054,001464,New York-Presbyterian Hospital - Columbia Presbyterian Center,50 to 69,100,F,Black/African American,Not Span/Hispanic,23,Emergency,Home w/ Home Health Services,2022,DIG024,Postprocedural or postoperative digestive system complication,GIS006,PARACENTESIS,252,"MALFUNCTION, REACTION AND COMPLICATION OF GASTROINTESTINAL DEVICE OR PROCEDURE",06,DISEASES AND DISORDERS OF THE DIGESTIVE SYSTEM,3,Major,Major,Medical,Medicare,Medicaid,,,,Y,369884.53,91263.84
New York City,Manhattan,7002054,001464,New York-Presbyterian Hospital - Columbia Presbyterian Center,50 to 69,104,M,Other Race,Spanish/Hispanic,3,Emergency,Home or Self Care,2022,DIG024,Postprocedural or postoperative digestive system complication,,,252,"MALFUNCTION, REACTION AND COMPLICATION OF GASTROINTESTINAL DEVICE OR PROCEDURE",06,DISEASES AND DISORDERS OF THE DIGESTIVE SYSTEM,2,Moderate,Moderate,Medical,Medicare,Medicaid,,,,Y,57112.53,12473.68
New York City,Manhattan,7002054,001464,New York-Presbyterian Hospital - Columbia Presbyterian Center,30 to 49,104,F,Other Race,Spanish/Hispanic,3,Emergency,Home or Self Care,2022,DIG024,Postprocedural or postoperative digestive system complication,HEP007,BILIARY AND PANCREATIC CALCULUS REMOVAL,252,"MALFUNCTION, REACTION AND COMPLICATION OF GASTROINTESTINAL DEVICE OR PROCEDURE",06,DISEASES AND DISORDERS OF THE DIGESTIVE SYSTEM,1,Minor,Minor,Medical,Medicaid,,,,,N,54251.84,13979.31
New York City,Manhattan,7002054,001464,New York-Presbyterian Hospital - Columbia Presbyterian Center,0 to 17,104,M,White,Spanish/Hispanic,7,Emergency,Home w/ Home Health Services,2022,DIG024,Postprocedural or postoperative digestive system complication,,,252,"MALFUNCTION, REACTION AND COMPLICATION OF GASTROINTESTINAL DEVICE OR PROCEDURE",06,DISEASES AND DISORDERS OF THE DIGESTIVE SYSTEM,3,Major,Moderate,Medical,Medicaid,,,,,Y,196855.43,84354.49
New York City,Manhattan,7002054,001464,New York-Presbyterian Hospital - Columbia Presbyterian Center,70 or Older,,F,Black/African American,Not Span/Hispanic,19,Emergency,Expired,2022,DIG024,Postprocedural or postoperative digestive system complication,OTR004,ISOLATION PROCEDURES,252,"MALFUNCTION, REACTION AND COMPLICATION OF GASTROINTESTINAL DEVICE OR PROCEDURE",06,DISEASES AND DISORDERS OF THE DIGESTIVE SYSTEM,4,Extreme,Extreme,Medical,Medicare,,,,,Y,350643.29,90198.45
New York City,Manhattan,7002001,001438,Bellevue Hospital Center,30 to 49,114,F,Other Race,Unknown,6,Emergency,Home or Self Care,2022,DIG024,Postprocedural or postoperative digestive system complication,GIS027,"UPPER GI THERAPEUTIC PROCEDURES, NEC (ENDOSCOPIC)",252,"MALFUNCTION, REACTION AND COMPLICATION OF GASTROINTESTINAL DEVICE OR PROCEDURE",06,DISEASES AND DISORDERS OF THE DIGESTIVE SYSTEM,2,Moderate,Major,Medical,Medicaid,,,,,Y,50250.71,28898.38
New York City,Manhattan,7002001,001438,Bellevue Hospital Center,70 or Older,112,M,Other Race,Spanish/Hispanic,2,Emergency,Home or Self Care,2022,DIG024,Postprocedural or postoperative digestive system complication,ADM021,"ADMINISTRATION OF THERAPEUTIC SUBSTANCES, NEC",252,"MALFUNCTION, REACTION AND COMPLICATION OF GASTROINTESTINAL DEVICE OR PROCEDURE",06,DISEASES AND DISORDERS OF THE DIGESTIVE SYSTEM,2,Moderate,Minor,Medical,Medicare,Medicaid,,,,Y,22026.71,12667.21
New York City,Manhattan,7002054,001464,New York-Presbyterian Hospital - Columbia Presbyterian Center,70 or Older,100,F,Other Race,Spanish/Hispanic,3,Emergency,Home w/ Home Health Services,2022,DIG024,Postprocedural or postoperative digestive system complication,GIS025,OTHER GI SYSTEM DEVICE PROCEDURES,252,"MALFUNCTION, REACTION AND COMPLICATION OF GASTROINTESTINAL DEVICE OR PROCEDURE",06,DISEASES AND DISORDERS OF THE DIGESTIVE SYSTEM,4,Extreme,Extreme,Medical,Medicare,Medicaid,,,,Y,72561.02,18298.63
New York City,Manhattan,7002001,001438,Bellevue Hospital Center,30 to 49,112,F,Other Race,Unknown,3,Emergency,Home or Self Care,2022,DIG024,Postprocedural or postoperative digestive system complication,,,252,"MALFUNCTION, REACTION AND COMPLICATION OF GASTROINTESTINAL DEVICE OR PROCEDURE",06,DISEASES AND DISORDERS OF THE DIGESTIVE SYSTEM,2,Moderate,Moderate,Medical,Medicaid,,,,,Y,23231.93,13360.31
New York City,Manhattan,7002053,001463,NYU Langone Hospitals,30 to 49,OOS,F,Other Race,Not Span/Hispanic,2,Emergency,Home or Self Care,2022,DIG024,Postprocedural or postoperative digestive system complication,OTR004,ISOLATION PROCEDURES,252,"MALFUNCTION, REACTION AND COMPLICATION OF GASTROINTESTINAL DEVICE OR PROCEDURE",06,DISEASES AND DISORDERS OF THE DIGESTIVE SYSTEM,3,Major,Moderate,Medical,Private Health Insurance,,,,,Y,44217.52,12052.32
New York City,Manhattan,7002054,001464,New York-Presbyterian Hospital - Columbia Presbyterian Center,30 to 49,104,M,Other Race,Unknown,2,Emergency,Home or Self Care,2022,DIG024,Postprocedural or postoperative digestive system complication,,,252,"MALFUNCTION, REACTION AND COMPLICATION OF GASTROINTESTINAL DEVICE OR PROCEDURE",06,DISEASES AND DISORDERS OF THE DIGESTIVE SYSTEM,2,Moderate,Minor,Medical,Medicaid,,,,,Y,63650.42,18395.12
New York City,Manhattan,7002054,001464,New York-Presbyterian Hospital - Columbia Presbyterian Center,50 to 69,OOS,F,Other Race,Spanish/Hispanic,2,Emergency,Home or Self Care,2022,DIG024,Postprocedural or postoperative digestive system complication,GIS027,"UPPER GI THERAPEUTIC PROCEDURES, NEC (ENDOSCOPIC)",252,"MALFUNCTION, REACTION AND COMPLICATION OF GASTROINTESTINAL DEVICE OR PROCEDURE",06,DISEASES AND DISORDERS OF THE DIGESTIVE SYSTEM,3,Major,Moderate,Medical,Medicare,Medicaid,,,,Y,56767.34,15271.43
New York City,Manhattan,7002053,001463,NYU Langone Hospitals,70 or Older,100,F,Other Race,Spanish/Hispanic,5,Emergency,Home w/ Home Health Services,2022,DIG024,Postprocedural or postoperative digestive system complication,GIS001,ESOPHAGOGASTRODUODENOSCOPY (EGD) WITH BIOPSY,252,"MALFUNCTION, REACTION AND COMPLICATION OF GASTROINTESTINAL DEVICE OR PROCEDURE",06,DISEASES AND DISORDERS OF THE DIGESTIVE SYSTEM,3,Major,Major,Medical,Medicare,Medicaid,,,,Y,167177.21,42159.62
New York City,Manhattan,7002054,001464,New York-Presbyterian Hospital - Columbia Presbyterian Center,0 to 17,109,F,White,Not Span/Hispanic,2,Emergency,Home or Self Care,2022,DIG024,Postprocedural or postoperative digestive system complication,GIS025,OTHER GI SYSTEM DEVICE PROCEDURES,252,"MALFUNCTION, REACTION AND COMPLICATION OF GASTROINTESTINAL DEVICE OR PROCEDURE",06,DISEASES AND DISORDERS OF THE DIGESTIVE SYSTEM,3,Major,Moderate,Medical,Medicaid,,,,,Y,38932.48,9283.41
Finger Lakes,Monroe,2701005,000413,Strong Memorial Hospital,0 to 17,148,M,White,Not Span/Hispanic,1,Emergency,Home or Self Care,2022,DIG024,Postprocedural or postoperative digestive system complication,GIS017,GASTROSTOMY,252,"MALFUNCTION, REACTION AND COMPLICATION OF GASTROINTESTINAL DEVICE OR PROCEDURE",06,DISEASES AND DISORDERS OF THE DIGESTIVE SYSTEM,2,Moderate,Moderate,Medical,Medicaid,,,,,Y,9055.50,3555.36
Finger Lakes,Monroe,2701005,000413,Strong Memorial Hospital,50 to 69,146,F,White,Not Span/Hispanic,2,Emergency,Home or Self Care,2022,DIG024,Postprocedural or postoperative digestive system complication,,,252,"MALFUNCTION, REACTION AND COMPLICATION OF GASTROINTESTINAL DEVICE OR PROCEDURE",06,DISEASES AND DISORDERS OF THE DIGESTIVE SYSTEM,2,Moderate,Minor,Medical,Blue Cross/Blue Shield,,,,,Y,12967.40,3968.14
Finger Lakes,Monroe,2701005,000413,Strong Memorial Hospital,50 to 69,OOS,F,White,Not Span/Hispanic,2,Urgent,Home or Self Care,2022,DIG024,Postprocedural or postoperative digestive system complication,,,252,"MALFUNCTION, REACTION AND COMPLICATION OF GASTROINTESTINAL DEVICE OR PROCEDURE",06,DISEASES AND DISORDERS OF THE DIGESTIVE SYSTEM,2,Moderate,Minor,Medical,Blue Cross/Blue Shield,,,,,N,9912.22,4610.14
Finger Lakes,Monroe,2701005,000413,Strong Memorial Hospital,0 to 17,146,F,White,Not Span/Hispanic,2,Emergency,Home or Self Care,2022,DIG024,Postprocedural or postoperative digestive system complication,GIS007,GI SYSTEM DRAINAGE (EXCLUDING PARACENTESIS),252,"MALFUNCTION, REACTION AND COMPLICATION OF GASTROINTESTINAL DEVICE OR PROCEDURE",06,DISEASES AND DISORDERS OF THE DIGESTIVE SYSTEM,1,Minor,Minor,Medical,Medicaid,,,,,Y,11038.23,4010.80
Finger Lakes,Monroe,2701005,000413,Strong Memorial Hospital,30 to 49,146,F,White,Not Span/Hispanic,3,Emergency,Home or Self Care,2022,DIG024,Postprocedural or postoperative digestive system complication,,,252,"MALFUNCTION, REACTION AND COMPLICATION OF GASTROINTESTINAL DEVICE OR PROCEDURE",06,DISEASES AND DISORDERS OF THE DIGESTIVE SYSTEM,2,Moderate,Minor,Medical,Blue Cross/Blue Shield,,,,,Y,12038.09,4898.28
New York City,Manhattan,7002053,001463,NYU Langone Hospitals,18 to 29,104,F,Multi-racial,Not Span/Hispanic,5,Elective,Home or Self Care,2022,DIG024,Postprocedural or postoperative digestive system complication,HEP009,PANCREATIC AND PROXIMAL BILIARY DILATION AND STENTING,252,"MALFUNCTION, REACTION AND COMPLICATION OF GASTROINTESTINAL DEVICE OR PROCEDURE",06,DISEASES AND DISORDERS OF THE DIGESTIVE SYSTEM,2,Moderate,Moderate,Medical,Blue Cross/Blue Shield,,,,,N,115034.57,30446.39
New York City,Manhattan,7002001,001438,Bellevue Hospital Center,30 to 49,104,F,Other Race,Spanish/Hispanic,2,Emergency,Home or Self Care,2022,DIG024,Postprocedural or postoperative digestive system complication,GIS027,"UPPER GI THERAPEUTIC PROCEDURES, NEC (ENDOSCOPIC)",252,"MALFUNCTION, REACTION AND COMPLICATION OF GASTROINTESTINAL DEVICE OR PROCEDURE",06,DISEASES AND DISORDERS OF THE DIGESTIVE SYSTEM,3,Major,Moderate,Medical,Private Health Insurance,,,,,Y,20979.33,12064.88
New York City,Manhattan,7002053,001463,NYU Langone Hospitals,50 to 69,115,M,White,Not Span/Hispanic,3,Emergency,Home or Self Care,2022,DIG024,Postprocedural or postoperative digestive system complication,,,252,"MALFUNCTION, REACTION AND COMPLICATION OF GASTROINTESTINAL DEVICE OR PROCEDURE",06,DISEASES AND DISORDERS OF THE DIGESTIVE SYSTEM,1,Minor,Minor,Medical,Medicare,Private Health Insurance,,,,Y,69348.49,17714.12
New York City,Manhattan,7002053,001463,NYU Langone Hospitals,18 to 29,112,F,Other Race,Not Span/Hispanic,4,Emergency,Home w/ Home Health Services,2022,DIG024,Postprocedural or postoperative digestive system complication,GIS027,"UPPER GI THERAPEUTIC PROCEDURES, NEC (ENDOSCOPIC)",252,"MALFUNCTION, REACTION AND COMPLICATION OF GASTROINTESTINAL DEVICE OR PROCEDURE",06,DISEASES AND DISORDERS OF THE DIGESTIVE SYSTEM,3,Major,Major,Medical,Private Health Insurance,Blue Cross/Blue Shield,,,,N,131086.69,28866.40
New York City,Manhattan,7002053,001463,NYU Langone Hospitals,70 or Older,100,F,White,Not Span/Hispanic,6,Emergency,Home or Self Care,2022,DIG024,Postprocedural or postoperative digestive system complication,,,252,"MALFUNCTION, REACTION AND COMPLICATION OF GASTROINTESTINAL DEVICE OR PROCEDURE",06,DISEASES AND DISORDERS OF THE DIGESTIVE SYSTEM,3,Major,Moderate,Medical,Medicare,,,,,Y,97036.04,32541.21
New York City,Manhattan,7002053,001463,NYU Langone Hospitals,50 to 69,OOS,M,Other Race,Not Span/Hispanic,2,Elective,Home or Self Care,2022,DIG024,Postprocedural or postoperative digestive system complication,HEP010,HEPATOBILIARY AND PANCREATIC DRAINAGE,252,"MALFUNCTION, REACTION AND COMPLICATION OF GASTROINTESTINAL DEVICE OR PROCEDURE",06,DISEASES AND DISORDERS OF THE DIGESTIVE SYSTEM,3,Major,Minor,Medical,Private Health Insurance,,,,,N,58162.69,14345.07
New York City,Manhattan,7002001,001438,Bellevue Hospital Center,50 to 69,112,M,Other Race,Not Span/Hispanic,4,Emergency,Home or Self Care,2022,DIG024,Postprocedural or postoperative digestive system complication,ADM021,"ADMINISTRATION OF THERAPEUTIC SUBSTANCES, NEC",252,"MALFUNCTION, REACTION AND COMPLICATION OF GASTROINTESTINAL DEVICE OR PROCEDURE",06,DISEASES AND DISORDERS OF THE DIGESTIVE SYSTEM,2,Moderate,Moderate,Medical,Medicaid,,,,,Y,36193.92,20814.54
New York City,Manhattan,7002001,001438,Bellevue Hospital Center,30 to 49,112,F,Other Race,Spanish/Hispanic,4,Emergency,Home or Self Care,2022,DIG024,Postprocedural or postoperative digestive system complication,IMG006,COMPUTERIZED TOMOGRAPHY (CT) WITH CONTRAST,252,"MALFUNCTION, REACTION AND COMPLICATION OF GASTROINTESTINAL DEVICE OR PROCEDURE",06,DISEASES AND DISORDERS OF THE DIGESTIVE SYSTEM,2,Moderate,Minor,Medical,Private Health Insurance,,,,,Y,32522.06,18702.92
New York City,Manhattan,7002001,001438,Bellevue Hospital Center,18 to 29,104,F,Other Race,Spanish/Hispanic,1,Urgent,Home or Self Care,2022,DIG024,Postprocedural or postoperative digestive system complication,ADM021,"ADMINISTRATION OF THERAPEUTIC SUBSTANCES, NEC",252,"MALFUNCTION, REACTION AND COMPLICATION OF GASTROINTESTINAL DEVICE OR PROCEDURE",06,DISEASES AND DISORDERS OF THE DIGESTIVE SYSTEM,1,Minor,Minor,Medical,Private Health Insurance,,,,,N,7497.83,4311.88
New York City,Manhattan,7002054,001464,New York-Presbyterian Hospital - Columbia Presbyterian Center,70 or Older,112,F,White,Not Span/Hispanic,3,Emergency,Home or Self Care,2022,DIG024,Postprocedural or postoperative digestive system complication,ADM017,ADMINISTRATION OF NUTRITIONAL AND ELECTROLYTIC SUBSTANCES,252,"MALFUNCTION, REACTION AND COMPLICATION OF GASTROINTESTINAL DEVICE OR PROCEDURE",06,DISEASES AND DISORDERS OF THE DIGESTIVE SYSTEM,3,Major,Major,Medical,Medicare,Medicaid,,,,Y,103309.08,28653.64
New York City,Manhattan,7002054,001464,New York-Presbyterian Hospital - Columbia Presbyterian Center,50 to 69,112,M,White,Not Span/Hispanic,3,Urgent,Home or Self Care,2022,DIG024,Postprocedural or postoperative digestive system complication,ADM021,"ADMINISTRATION OF THERAPEUTIC SUBSTANCES, NEC",252,"MALFUNCTION, REACTION AND COMPLICATION OF GASTROINTESTINAL DEVICE OR PROCEDURE",06,DISEASES AND DISORDERS OF THE DIGESTIVE SYSTEM,3,Major,Major,Medical,Medicare,Medicaid,,,,N,44858.24,9824.35
New York City,Manhattan,7002001,001438,Bellevue Hospital Center,50 to 69,113,M,Other Race,Spanish/Hispanic,2,Emergency,Home or Self Care,2022,DIG024,Postprocedural or postoperative digestive system complication,IMG006,COMPUTERIZED TOMOGRAPHY (CT) WITH CONTRAST,252,"MALFUNCTION, REACTION AND COMPLICATION OF GASTROINTESTINAL DEVICE OR PROCEDURE",06,DISEASES AND DISORDERS OF THE DIGESTIVE SYSTEM,2,Moderate,Moderate,Medical,Medicaid,,,,,Y,18643.19,10721.40
New York City,Manhattan,7002001,001438,Bellevue Hospital Center,18 to 29,100,F,Other Race,Spanish/Hispanic,3,Emergency,Home or Self Care,2022,DIG024,Postprocedural or postoperative digestive system complication,MAM008,CARDIAC MONITORING,252,"MALFUNCTION, REACTION AND COMPLICATION OF GASTROINTESTINAL DEVICE OR PROCEDURE",06,DISEASES AND DISORDERS OF THE DIGESTIVE SYSTEM,1,Minor,Minor,Medical,Medicaid,,,,,Y,28796.61,16560.47
New York City,Manhattan,7002053,001463,NYU Langone Hospitals,70 or Older,100,F,White,Not Span/Hispanic,25,Emergency,Skilled Nursing Home,2022,DIG024,Postprocedural or postoperative digestive system complication,GIS025,OTHER GI SYSTEM DEVICE PROCEDURES,252,"MALFUNCTION, REACTION AND COMPLICATION OF GASTROINTESTINAL DEVICE OR PROCEDURE",06,DISEASES AND DISORDERS OF THE DIGESTIVE SYSTEM,4,Extreme,Extreme,Medical,Medicare,Medicare,,,,Y,554787.80,143366.65
New York City,Manhattan,7002001,001438,Bellevue Hospital Center,30 to 49,105,F,Other Race,Spanish/Hispanic,2,Emergency,Home or Self Care,2022,DIG024,Postprocedural or postoperative digestive system complication,ADM021,"ADMINISTRATION OF THERAPEUTIC SUBSTANCES, NEC",252,"MALFUNCTION, REACTION AND COMPLICATION OF GASTROINTESTINAL DEVICE OR PROCEDURE",06,DISEASES AND DISORDERS OF THE DIGESTIVE SYSTEM,1,Minor,Minor,Medical,Medicaid,,,,,Y,16158.64,9292.58
New York City,Manhattan,7002053,001463,NYU Langone Hospitals,50 to 69,118,F,White,Not Span/Hispanic,7,Emergency,Home w/ Home Health Services,2022,DIG024,Postprocedural or postoperative digestive system complication,,,252,"MALFUNCTION, REACTION AND COMPLICATION OF GASTROINTESTINAL DEVICE OR PROCEDURE",06,DISEASES AND DISORDERS OF THE DIGESTIVE SYSTEM,3,Major,Major,Medical,Private Health Insurance,,,,,Y,118525.90,36872.57
Finger Lakes,Monroe,2701005,000413,Strong Memorial Hospital,50 to 69,146,F,White,Not Span/Hispanic,6,Emergency,Home or Self Care,2022,DIG024,Postprocedural or postoperative digestive system complication,GIS029,"LOWER GI THERAPEUTIC PROCEDURES, NEC (EXCLUDING OPEN AND LAPAROSCOPIC)",252,"MALFUNCTION, REACTION AND COMPLICATION OF GASTROINTESTINAL DEVICE OR PROCEDURE",06,DISEASES AND DISORDERS OF THE DIGESTIVE SYSTEM,2,Moderate,Minor,Medical,Blue Cross/Blue Shield,,,,,Y,30582.63,12512.36
Finger Lakes,Monroe,2701005,000413,Strong Memorial Hospital,70 or Older,145,F,White,Not Span/Hispanic,1,Emergency,Medicare Cert Long Term Care Hospital,2022,DIG024,Postprocedural or postoperative digestive system complication,GIS025,OTHER GI SYSTEM DEVICE PROCEDURES,252,"MALFUNCTION, REACTION AND COMPLICATION OF GASTROINTESTINAL DEVICE OR PROCEDURE",06,DISEASES AND DISORDERS OF THE DIGESTIVE SYSTEM,2,Moderate,Moderate,Medical,Medicare,Medicaid,,,,Y,22307.72,6178.73
Finger Lakes,Monroe,2701005,000413,Strong Memorial Hospital,30 to 49,148,F,White,Not Span/Hispanic,10,Emergency,Home or Self Care,2022,DIG024,Postprocedural or postoperative digestive system complication,GIS004,GI SYSTEM ENDOSCOPY WITHOUT BIOPSY (DIAGNOSTIC),252,"MALFUNCTION, REACTION AND COMPLICATION OF GASTROINTESTINAL DEVICE OR PROCEDURE",06,DISEASES AND DISORDERS OF THE DIGESTIVE SYSTEM,2,Moderate,Moderate,Medical,Blue Cross/Blue Shield,,,,,Y,40824.48,17924.41
Finger Lakes,Monroe,2701005,000413,Strong Memorial Hospital,30 to 49,142,F,White,Not Span/Hispanic,8,Emergency,Home or Self Care,2022,DIG024,Postprocedural or postoperative digestive system complication,GIS029,"LOWER GI THERAPEUTIC PROCEDURES, NEC (EXCLUDING OPEN AND LAPAROSCOPIC)",252,"MALFUNCTION, REACTION AND COMPLICATION OF GASTROINTESTINAL DEVICE OR PROCEDURE",06,DISEASES AND DISORDERS OF THE DIGESTIVE SYSTEM,4,Extreme,Major,Medical,Medicare,Medicaid,,,,Y,58753.74,26074.29
Finger Lakes,Monroe,2701005,000413,Strong Memorial Hospital,50 to 69,144,M,White,Not Span/Hispanic,3,Urgent,Home w/ Home Health Services,2022,DIG024,Postprocedural or postoperative digestive system complication,ADM017,ADMINISTRATION OF NUTRITIONAL AND ELECTROLYTIC SUBSTANCES,252,"MALFUNCTION, REACTION AND COMPLICATION OF GASTROINTESTINAL DEVICE OR PROCEDURE",06,DISEASES AND DISORDERS OF THE DIGESTIVE SYSTEM,2,Moderate,Minor,Medical,Medicare,Private Health Insurance,,,,N,12969.86,5061.55
Finger Lakes,Monroe,2701005,000413,Strong Memorial Hospital,70 or Older,144,M,White,Unknown,2,Emergency,Home w/ Home Health Services,2022,DIG024,Postprocedural or postoperative digestive system complication,,,252,"MALFUNCTION, REACTION AND COMPLICATION OF GASTROINTESTINAL DEVICE OR PROCEDURE",06,DISEASES AND DISORDERS OF THE DIGESTIVE SYSTEM,3,Major,Moderate,Medical,Medicare,Private Health Insurance,,,,Y,16804.88,5612.49
New York City,Manhattan,7002054,001464,New York-Presbyterian Hospital - Columbia Presbyterian Center,0 to 17,OOS,F,White,Not Span/Hispanic,2,Emergency,Home or Self Care,2022,DIG024,Postprocedural or postoperative digestive system complication,,,252,"MALFUNCTION, REACTION AND COMPLICATION OF GASTROINTESTINAL DEVICE OR PROCEDURE",06,DISEASES AND DISORDERS OF THE DIGESTIVE SYSTEM,2,Moderate,Minor,Medical,Private Health Insurance,,,,,Y,34662.55,8727.25
New York City,Manhattan,7002001,001438,Bellevue Hospital Center,30 to 49,112,F,Other Race,Spanish/Hispanic,2,Emergency,Home or Self Care,2022,DIG024,Postprocedural or postoperative digestive system complication,GIS007,GI SYSTEM DRAINAGE (EXCLUDING PARACENTESIS),252,"MALFUNCTION, REACTION AND COMPLICATION OF GASTROINTESTINAL DEVICE OR PROCEDURE",06,DISEASES AND DISORDERS OF THE DIGESTIVE SYSTEM,1,Minor,Minor,Medical,Medicaid,,,,,Y,19745.82,11355.51
New York City,Manhattan,7002053,001463,NYU Langone Hospitals,30 to 49,100,F,Multi-racial,Not Span/Hispanic,5,Emergency,Home or Self Care,2022,DIG024,Postprocedural or postoperative digestive system complication,,,252,"MALFUNCTION, REACTION AND COMPLICATION OF GASTROINTESTINAL DEVICE OR PROCEDURE",06,DISEASES AND DISORDERS OF THE DIGESTIVE SYSTEM,2,Moderate,Moderate,Medical,Private Health Insurance,,,,,Y,95720.25,28079.23
New York City,Manhattan,7002054,001464,New York-Presbyterian Hospital - Columbia Presbyterian Center,50 to 69,100,M,Other Race,Spanish/Hispanic,2,Emergency,Skilled Nursing Home,2022,DIG024,Postprocedural or postoperative digestive system complication,,,252,"MALFUNCTION, REACTION AND COMPLICATION OF GASTROINTESTINAL DEVICE OR PROCEDURE",06,DISEASES AND DISORDERS OF THE DIGESTIVE SYSTEM,3,Major,Moderate,Medical,Medicare,,,,,Y,31532.37,7096.73
New York City,Manhattan,7002054,001464,New York-Presbyterian Hospital - Columbia Presbyterian Center,30 to 49,104,F,Other Race,Spanish/Hispanic,1,Emergency,Home or Self Care,2022,DIG024,Postprocedural or postoperative digestive system complication,,,252,"MALFUNCTION, REACTION AND COMPLICATION OF GASTROINTESTINAL DEVICE OR PROCEDURE",06,DISEASES AND DISORDERS OF THE DIGESTIVE SYSTEM,1,Minor,Minor,Medical,Private Health Insurance,Medicaid,,,,Y,29613.25,5924.07
New York City,Manhattan,7002054,001464,New York-Presbyterian Hospital - Columbia Presbyterian Center,50 to 69,100,M,Black/African American,Not Span/Hispanic,14,Emergency,Skilled Nursing Home,2022,DIG024,Postprocedural or postoperative digestive system complication,ADM017,ADMINISTRATION OF NUTRITIONAL AND ELECTROLYTIC SUBSTANCES,252,"MALFUNCTION, REACTION AND COMPLICATION OF GASTROINTESTINAL DEVICE OR PROCEDURE",06,DISEASES AND DISORDERS OF THE DIGESTIVE SYSTEM,4,Extreme,Major,Medical,Medicare,Medicaid,,,,Y,192356.90,43414.61
New York City,Manhattan,7002054,001464,New York-Presbyterian Hospital - Columbia Presbyterian Center,18 to 29,OOS,M,White,Not Span/Hispanic,7,Emergency,Home or Self Care,2022,DIG024,Postprocedural or postoperative digestive system complication,GIS001,ESOPHAGOGASTRODUODENOSCOPY (EGD) WITH BIOPSY,252,"MALFUNCTION, REACTION AND COMPLICATION OF GASTROINTESTINAL DEVICE OR PROCEDURE",06,DISEASES AND DISORDERS OF THE DIGESTIVE SYSTEM,1,Minor,Minor,Medical,Private Health Insurance,,,,,Y,99622.45,22830.20
New York City,Manhattan,7002054,001464,New York-Presbyterian Hospital - Columbia Presbyterian Center,0 to 17,109,F,White,Not Span/Hispanic,2,Emergency,Home or Self Care,2022,DIG024,Postprocedural or postoperative digestive system complication,GIS025,OTHER GI SYSTEM DEVICE PROCEDURES,252,"MALFUNCTION, REACTION AND COMPLICATION OF GASTROINTESTINAL DEVICE OR PROCEDURE",06,DISEASES AND DISORDERS OF THE DIGESTIVE SYSTEM,3,Major,Moderate,Medical,Medicaid,,,,,Y,44149.49,13285.37