Hospital Service Area,Hospital County,Operating Certificate Number,Permanent Facility Id,Facility Name,Age Group,Zip Code - 3 digits,Gender,Race,Ethnicity,Length of Stay,Type of Admission,Patient Disposition,Discharge Year,CCS Diagnosis Code,CCS Diagnosis Description,CCS Procedure Code,CCS Procedure Description,APR DRG Code,APR DRG Description,APR MDC Code,APR MDC Description,APR Severity of Illness Code,APR Severity of Illness Description,APR Risk of Mortality,APR Medical Surgical Description,Payment Typology 1,Payment Typology 2,Payment Typology 3,Birth Weight,Abortion Edit Indicator,Emergency Department Indicator,Total Charges,Total Costs
New York City,Manhattan,7002054,001464,New York-Presbyterian Hospital - Columbia Presbyterian Center,50 to 69,104,F,Black/African American,Spanish/Hispanic,1,Emergency,Home or Self Care,2022,DIG021,Gastrointestinal hemorrhage,,,253,OTHER AND UNSPECIFIED GASTROINTESTINAL HEMORRHAGE,06,DISEASES AND DISORDERS OF THE DIGESTIVE SYSTEM,2,Moderate,Minor,Medical,Private Health Insurance,,,,,Y,20409.98,4338.24
New York City,Manhattan,7002001,001438,Bellevue Hospital Center,50 to 69,112,M,Other Race,Spanish/Hispanic,52,Urgent,Home w/ Home Health Services,2022,DIG021,Gastrointestinal hemorrhage,GIS016,GI SYSTEM ENDOSCOPIC THERAPEUTIC PROCEDURES,253,OTHER AND UNSPECIFIED GASTROINTESTINAL HEMORRHAGE,06,DISEASES AND DISORDERS OF THE DIGESTIVE SYSTEM,4,Extreme,Extreme,Medical,Medicaid,,,,,N,397942.23,228850.21
New York City,Manhattan,7002054,001464,New York-Presbyterian Hospital - Columbia Presbyterian Center,70 or Older,117,F,White,Not Span/Hispanic,21,Urgent,Home or Self Care,2022,DIG025,Other specified and unspecified gastrointestinal disorders,GNR004,ENDOSCOPIC CONTROL OF BLEEDING,253,OTHER AND UNSPECIFIED GASTROINTESTINAL HEMORRHAGE,06,DISEASES AND DISORDERS OF THE DIGESTIVE SYSTEM,3,Major,Major,Medical,Medicare,Private Health Insurance,,,,N,441652.81,187570.86
New York City,Manhattan,7002054,001464,New York-Presbyterian Hospital - Columbia Presbyterian Center,70 or Older,100,M,White,Spanish/Hispanic,4,Emergency,Facility w/ Custodial/Supportive Care,2022,DIG021,Gastrointestinal hemorrhage,ADM017,ADMINISTRATION OF NUTRITIONAL AND ELECTROLYTIC SUBSTANCES,253,OTHER AND UNSPECIFIED GASTROINTESTINAL HEMORRHAGE,06,DISEASES AND DISORDERS OF THE DIGESTIVE SYSTEM,2,Moderate,Major,Medical,Medicare,Medicaid,,,,Y,56082.49,11898.08
New York City,Manhattan,7002054,001464,New York-Presbyterian Hospital - Columbia Presbyterian Center,30 to 49,111,M,White,Not Span/Hispanic,4,Emergency,Home or Self Care,2022,DIG021,Gastrointestinal hemorrhage,GIS004,GI SYSTEM ENDOSCOPY WITHOUT BIOPSY (DIAGNOSTIC),253,OTHER AND UNSPECIFIED GASTROINTESTINAL HEMORRHAGE,06,DISEASES AND DISORDERS OF THE DIGESTIVE SYSTEM,3,Major,Major,Medical,Medicaid,,,,,Y,80672.14,19098.70
New York City,Manhattan,7002001,001438,Bellevue Hospital Center,50 to 69,112,M,Other Race,Spanish/Hispanic,4,Emergency,Home or Self Care,2022,DIG021,Gastrointestinal hemorrhage,GIS004,GI SYSTEM ENDOSCOPY WITHOUT BIOPSY (DIAGNOSTIC),253,OTHER AND UNSPECIFIED GASTROINTESTINAL HEMORRHAGE,06,DISEASES AND DISORDERS OF THE DIGESTIVE SYSTEM,3,Major,Moderate,Medical,Medicaid,,,,,Y,38466.61,22121.53
New York City,Manhattan,7002054,001464,New York-Presbyterian Hospital - Columbia Presbyterian Center,30 to 49,112,M,Other Race,Not Span/Hispanic,12,Emergency,Home or Self Care,2022,DIG025,Other specified and unspecified gastrointestinal disorders,GNR004,ENDOSCOPIC CONTROL OF BLEEDING,253,OTHER AND UNSPECIFIED GASTROINTESTINAL HEMORRHAGE,06,DISEASES AND DISORDERS OF THE DIGESTIVE SYSTEM,3,Major,Major,Medical,Medicaid,,,,,Y,231136.41,55568.87
New York City,Manhattan,7002054,001464,New York-Presbyterian Hospital - Columbia Presbyterian Center,50 to 69,106,F,White,Not Span/Hispanic,2,Emergency,Home or Self Care,2022,DIG021,Gastrointestinal hemorrhage,ADM001,TRANSFUSION OF BLOOD AND BLOOD PRODUCTS,253,OTHER AND UNSPECIFIED GASTROINTESTINAL HEMORRHAGE,06,DISEASES AND DISORDERS OF THE DIGESTIVE SYSTEM,3,Major,Moderate,Medical,Medicare,Blue Cross/Blue Shield,,,,Y,34693.89,7833.31
New York City,Manhattan,7002054,001464,New York-Presbyterian Hospital - Columbia Presbyterian Center,50 to 69,100,M,White,Spanish/Hispanic,4,Emergency,Home w/ Home Health Services,2022,DIG021,Gastrointestinal hemorrhage,OTR004,ISOLATION PROCEDURES,253,OTHER AND UNSPECIFIED GASTROINTESTINAL HEMORRHAGE,06,DISEASES AND DISORDERS OF THE DIGESTIVE SYSTEM,3,Major,Major,Medical,Medicare,Medicaid,,,,Y,73340.68,16425.94
New York City,Manhattan,7002054,001464,New York-Presbyterian Hospital - Columbia Presbyterian Center,70 or Older,100,F,Black/African American,Not Span/Hispanic,1,Emergency,Skilled Nursing Home,2022,DIG021,Gastrointestinal hemorrhage,,,253,OTHER AND UNSPECIFIED GASTROINTESTINAL HEMORRHAGE,06,DISEASES AND DISORDERS OF THE DIGESTIVE SYSTEM,3,Major,Moderate,Medical,Medicare,,,,,Y,24441.65,5228.61
New York City,Manhattan,7002054,001464,New York-Presbyterian Hospital - Columbia Presbyterian Center,70 or Older,100,M,Black/African American,Not Span/Hispanic,3,Emergency,Facility w/ Custodial/Supportive Care,2022,DIG021,Gastrointestinal hemorrhage,OTR004,ISOLATION PROCEDURES,253,OTHER AND UNSPECIFIED GASTROINTESTINAL HEMORRHAGE,06,DISEASES AND DISORDERS OF THE DIGESTIVE SYSTEM,3,Major,Major,Medical,Medicare,Medicaid,,,,Y,51239.90,10528.91
New York City,Manhattan,7002054,001464,New York-Presbyterian Hospital - Columbia Presbyterian Center,70 or Older,107,M,Other Race,Unknown,4,Emergency,Home or Self Care,2022,DIG021,Gastrointestinal hemorrhage,ADM021,"ADMINISTRATION OF THERAPEUTIC SUBSTANCES, NEC",253,OTHER AND UNSPECIFIED GASTROINTESTINAL HEMORRHAGE,06,DISEASES AND DISORDERS OF THE DIGESTIVE SYSTEM,1,Minor,Moderate,Medical,Medicare,,,,,Y,56650.93,12040.42
New York City,Manhattan,7002054,001464,New York-Presbyterian Hospital - Columbia Presbyterian Center,50 to 69,100,M,Other Race,Spanish/Hispanic,27,Emergency,Home or Self Care,2022,DIG021,Gastrointestinal hemorrhage,CAR024,VENOUS AND ARTERIAL CATHETER PLACEMENT,253,OTHER AND UNSPECIFIED GASTROINTESTINAL HEMORRHAGE,06,DISEASES AND DISORDERS OF THE DIGESTIVE SYSTEM,4,Extreme,Extreme,Medical,Medicaid,,,,,Y,455066.45,106552.10
New York City,Manhattan,7002054,001464,New York-Presbyterian Hospital - Columbia Presbyterian Center,30 to 49,100,F,White,Not Span/Hispanic,3,Emergency,Home or Self Care,2022,DIG021,Gastrointestinal hemorrhage,GIS001,ESOPHAGOGASTRODUODENOSCOPY (EGD) WITH BIOPSY,253,OTHER AND UNSPECIFIED GASTROINTESTINAL HEMORRHAGE,06,DISEASES AND DISORDERS OF THE DIGESTIVE SYSTEM,1,Minor,Moderate,Medical,Private Health Insurance,,,,,Y,74689.90,18916.42
New York City,Manhattan,7002053,001463,NYU Langone Hospitals,70 or Older,118,F,White,Not Span/Hispanic,2,Emergency,Home or Self Care,2022,DIG025,Other specified and unspecified gastrointestinal disorders,GNR004,ENDOSCOPIC CONTROL OF BLEEDING,253,OTHER AND UNSPECIFIED GASTROINTESTINAL HEMORRHAGE,06,DISEASES AND DISORDERS OF THE DIGESTIVE SYSTEM,1,Minor,Minor,Medical,Medicare,,,,,N,64438.73,14996.08
New York City,Manhattan,7002053,001463,NYU Langone Hospitals,70 or Older,113,M,White,Not Span/Hispanic,3,Emergency,Home w/ Home Health Services,2022,DIG021,Gastrointestinal hemorrhage,GNR004,ENDOSCOPIC CONTROL OF BLEEDING,253,OTHER AND UNSPECIFIED GASTROINTESTINAL HEMORRHAGE,06,DISEASES AND DISORDERS OF THE DIGESTIVE SYSTEM,4,Extreme,Extreme,Medical,Medicare,Medicaid,,,,Y,70175.81,19127.10
New York City,Manhattan,7002054,001464,New York-Presbyterian Hospital - Columbia Presbyterian Center,70 or Older,100,F,Other Race,Spanish/Hispanic,5,Emergency,Home or Self Care,2022,DIG021,Gastrointestinal hemorrhage,OTR004,ISOLATION PROCEDURES,253,OTHER AND UNSPECIFIED GASTROINTESTINAL HEMORRHAGE,06,DISEASES AND DISORDERS OF THE DIGESTIVE SYSTEM,3,Major,Major,Medical,Medicare,Medicaid,,,,Y,69421.87,15335.92
New York City,Manhattan,7002054,001464,New York-Presbyterian Hospital - Columbia Presbyterian Center,70 or Older,100,M,White,Spanish/Hispanic,3,Emergency,Home w/ Home Health Services,2022,DIG008,Other specified and unspecified disorders of stomach and duodenum,GIS004,GI SYSTEM ENDOSCOPY WITHOUT BIOPSY (DIAGNOSTIC),253,OTHER AND UNSPECIFIED GASTROINTESTINAL HEMORRHAGE,06,DISEASES AND DISORDERS OF THE DIGESTIVE SYSTEM,2,Moderate,Moderate,Medical,Medicare,Medicaid,,,,Y,72671.19,17967.30
New York City,Manhattan,7002053,001463,NYU Langone Hospitals,70 or Older,119,M,White,Not Span/Hispanic,1,Emergency,Home or Self Care,2022,DIG021,Gastrointestinal hemorrhage,GIS004,GI SYSTEM ENDOSCOPY WITHOUT BIOPSY (DIAGNOSTIC),253,OTHER AND UNSPECIFIED GASTROINTESTINAL HEMORRHAGE,06,DISEASES AND DISORDERS OF THE DIGESTIVE SYSTEM,3,Major,Major,Medical,Medicare,Medicare,Private Health Insurance,,,Y,56523.86,11114.02
New York City,Manhattan,7002001,001438,Bellevue Hospital Center,50 to 69,112,F,Other Race,Spanish/Hispanic,10,Emergency,Home w/ Home Health Services,2022,DIG021,Gastrointestinal hemorrhage,ADM001,TRANSFUSION OF BLOOD AND BLOOD PRODUCTS,253,OTHER AND UNSPECIFIED GASTROINTESTINAL HEMORRHAGE,06,DISEASES AND DISORDERS OF THE DIGESTIVE SYSTEM,2,Moderate,Moderate,Medical,Medicaid,,,,,Y,90928.57,52291.57
Finger Lakes,Monroe,2701005,000413,Strong Memorial Hospital,70 or Older,146,M,Other Race,Spanish/Hispanic,5,Emergency,Hospice - Home,2022,DIG021,Gastrointestinal hemorrhage,GNR004,ENDOSCOPIC CONTROL OF BLEEDING,253,OTHER AND UNSPECIFIED GASTROINTESTINAL HEMORRHAGE,06,DISEASES AND DISORDERS OF THE DIGESTIVE SYSTEM,4,Extreme,Major,Medical,Medicare,,,,,Y,40226.00,14366.88
Finger Lakes,Monroe,2701005,000413,Strong Memorial Hospital,70 or Older,146,M,White,Not Span/Hispanic,15,Emergency,Skilled Nursing Home,2022,DIG021,Gastrointestinal hemorrhage,,,253,OTHER AND UNSPECIFIED GASTROINTESTINAL HEMORRHAGE,06,DISEASES AND DISORDERS OF THE DIGESTIVE SYSTEM,4,Extreme,Extreme,Medical,Medicare,,,,,Y,49312.25,22717.00
Finger Lakes,Monroe,2701005,000413,Strong Memorial Hospital,50 to 69,146,M,Black/African American,Not Span/Hispanic,3,Emergency,Home or Self Care,2022,DIG021,Gastrointestinal hemorrhage,,,253,OTHER AND UNSPECIFIED GASTROINTESTINAL HEMORRHAGE,06,DISEASES AND DISORDERS OF THE DIGESTIVE SYSTEM,3,Major,Major,Medical,Medicare,Medicaid,,,,Y,12459.05,5024.45
Finger Lakes,Monroe,2701005,000413,Strong Memorial Hospital,0 to 17,145,M,White,Not Span/Hispanic,4,Emergency,Home or Self Care,2022,DIG021,Gastrointestinal hemorrhage,GIS025,OTHER GI SYSTEM DEVICE PROCEDURES,253,OTHER AND UNSPECIFIED GASTROINTESTINAL HEMORRHAGE,06,DISEASES AND DISORDERS OF THE DIGESTIVE SYSTEM,2,Moderate,Minor,Medical,Medicaid,,,,,Y,11644.25,5863.74
Finger Lakes,Monroe,2701005,000413,Strong Memorial Hospital,70 or Older,146,F,Black/African American,Not Span/Hispanic,4,Emergency,Home or Self Care,2022,DIG021,Gastrointestinal hemorrhage,GIS004,GI SYSTEM ENDOSCOPY WITHOUT BIOPSY (DIAGNOSTIC),253,OTHER AND UNSPECIFIED GASTROINTESTINAL HEMORRHAGE,06,DISEASES AND DISORDERS OF THE DIGESTIVE SYSTEM,2,Moderate,Major,Medical,Medicare,,,,,Y,22493.17,8226.96
Finger Lakes,Monroe,2701005,000413,Strong Memorial Hospital,50 to 69,146,M,Black/African American,Spanish/Hispanic,120 +,Emergency,Expired,2022,DIG021,Gastrointestinal hemorrhage,CAR025,PLACEMENT OF TUNNELED OR IMPLANTABLE PORTION OF A VASCULAR ACCESS DEVICE,253,OTHER AND UNSPECIFIED GASTROINTESTINAL HEMORRHAGE,06,DISEASES AND DISORDERS OF THE DIGESTIVE SYSTEM,4,Extreme,Extreme,Medical,Medicare,Medicaid,,,,Y,658132.00,236190.19
Finger Lakes,Monroe,2701005,000413,Strong Memorial Hospital,30 to 49,145,F,White,Not Span/Hispanic,2,Emergency,Home or Self Care,2022,DIG021,Gastrointestinal hemorrhage,GIS004,GI SYSTEM ENDOSCOPY WITHOUT BIOPSY (DIAGNOSTIC),253,OTHER AND UNSPECIFIED GASTROINTESTINAL HEMORRHAGE,06,DISEASES AND DISORDERS OF THE DIGESTIVE SYSTEM,1,Minor,Minor,Medical,Blue Cross/Blue Shield,,,,,Y,26302.71,8154.30
Finger Lakes,Monroe,2701005,000413,Strong Memorial Hospital,70 or Older,144,F,White,Not Span/Hispanic,1,Emergency,Home or Self Care,2022,DIG021,Gastrointestinal hemorrhage,,,253,OTHER AND UNSPECIFIED GASTROINTESTINAL HEMORRHAGE,06,DISEASES AND DISORDERS OF THE DIGESTIVE SYSTEM,1,Minor,Moderate,Medical,Medicare,,,,,Y,8168.47,2407.17
New York City,Manhattan,7002053,001463,NYU Langone Hospitals,50 to 69,100,F,White,Not Span/Hispanic,4,Emergency,Home or Self Care,2022,DIG021,Gastrointestinal hemorrhage,ADM001,TRANSFUSION OF BLOOD AND BLOOD PRODUCTS,253,OTHER AND UNSPECIFIED GASTROINTESTINAL HEMORRHAGE,06,DISEASES AND DISORDERS OF THE DIGESTIVE SYSTEM,3,Major,Major,Medical,Blue Cross/Blue Shield,,,,,Y,65961.63,21243.17
New York City,Manhattan,7002053,001463,NYU Langone Hospitals,70 or Older,115,F,Other Race,Spanish/Hispanic,2,Emergency,Home or Self Care,2022,DIG025,Other specified and unspecified gastrointestinal disorders,GNR004,ENDOSCOPIC CONTROL OF BLEEDING,253,OTHER AND UNSPECIFIED GASTROINTESTINAL HEMORRHAGE,06,DISEASES AND DISORDERS OF THE DIGESTIVE SYSTEM,3,Major,Major,Medical,Medicare,Blue Cross/Blue Shield,,,,N,81128.03,19928.13
New York City,Manhattan,7002053,001463,NYU Langone Hospitals,50 to 69,114,M,Other Race,Spanish/Hispanic,1,Elective,Home w/ Home Health Services,2022,DIG021,Gastrointestinal hemorrhage,GNR004,ENDOSCOPIC CONTROL OF BLEEDING,253,OTHER AND UNSPECIFIED GASTROINTESTINAL HEMORRHAGE,06,DISEASES AND DISORDERS OF THE DIGESTIVE SYSTEM,2,Moderate,Moderate,Medical,Medicaid,,,,,N,45876.77,9056.00
New York City,Manhattan,7002001,001438,Bellevue Hospital Center,70 or Older,100,F,Other Race,Unknown,4,Emergency,Home or Self Care,2022,DIG008,Other specified and unspecified disorders of stomach and duodenum,GIS001,ESOPHAGOGASTRODUODENOSCOPY (EGD) WITH BIOPSY,253,OTHER AND UNSPECIFIED GASTROINTESTINAL HEMORRHAGE,06,DISEASES AND DISORDERS OF THE DIGESTIVE SYSTEM,2,Moderate,Major,Medical,Medicare,Medicaid,,,,Y,45941.40,26420.16
New York City,Manhattan,7002053,001463,NYU Langone Hospitals,70 or Older,111,F,Multi-racial,Not Span/Hispanic,2,Emergency,Home or Self Care,2022,DIG021,Gastrointestinal hemorrhage,,,253,OTHER AND UNSPECIFIED GASTROINTESTINAL HEMORRHAGE,06,DISEASES AND DISORDERS OF THE DIGESTIVE SYSTEM,3,Major,Major,Medical,Medicare,,,,,Y,35998.68,10970.02
New York City,Manhattan,7002054,001464,New York-Presbyterian Hospital - Columbia Presbyterian Center,70 or Older,100,M,Other Race,Spanish/Hispanic,4,Emergency,Home w/ Home Health Services,2022,DIG021,Gastrointestinal hemorrhage,GIS001,ESOPHAGOGASTRODUODENOSCOPY (EGD) WITH BIOPSY,253,OTHER AND UNSPECIFIED GASTROINTESTINAL HEMORRHAGE,06,DISEASES AND DISORDERS OF THE DIGESTIVE SYSTEM,2,Moderate,Minor,Medical,Medicare,Medicaid,,,,Y,76956.59,18079.99
New York City,Manhattan,7002054,001464,New York-Presbyterian Hospital - Columbia Presbyterian Center,70 or Older,100,M,White,Not Span/Hispanic,4,Urgent,Home or Self Care,2022,DIG025,Other specified and unspecified gastrointestinal disorders,GNR004,ENDOSCOPIC CONTROL OF BLEEDING,253,OTHER AND UNSPECIFIED GASTROINTESTINAL HEMORRHAGE,06,DISEASES AND DISORDERS OF THE DIGESTIVE SYSTEM,1,Minor,Moderate,Medical,Medicaid,,,,,Y,89299.90,20450.33
New York City,Manhattan,7002054,001464,New York-Presbyterian Hospital - Columbia Presbyterian Center,50 to 69,100,M,White,Spanish/Hispanic,1,Emergency,Home or Self Care,2022,DIG021,Gastrointestinal hemorrhage,,,253,OTHER AND UNSPECIFIED GASTROINTESTINAL HEMORRHAGE,06,DISEASES AND DISORDERS OF THE DIGESTIVE SYSTEM,2,Moderate,Moderate,Medical,Medicare,Medicaid,,,,Y,17750.87,3876.82
New York City,Manhattan,7002054,001464,New York-Presbyterian Hospital - Columbia Presbyterian Center,70 or Older,100,M,White,Spanish/Hispanic,3,Emergency,Home w/ Home Health Services,2022,DIG021,Gastrointestinal hemorrhage,GIS001,ESOPHAGOGASTRODUODENOSCOPY (EGD) WITH BIOPSY,253,OTHER AND UNSPECIFIED GASTROINTESTINAL HEMORRHAGE,06,DISEASES AND DISORDERS OF THE DIGESTIVE SYSTEM,3,Major,Major,Medical,Private Health Insurance,Medicare,,,,Y,64212.82,15130.36
New York City,Manhattan,7002054,001464,New York-Presbyterian Hospital - Columbia Presbyterian Center,70 or Older,100,F,Other Race,Spanish/Hispanic,4,Emergency,Home w/ Home Health Services,2022,DIG025,Other specified and unspecified gastrointestinal disorders,,,253,OTHER AND UNSPECIFIED GASTROINTESTINAL HEMORRHAGE,06,DISEASES AND DISORDERS OF THE DIGESTIVE SYSTEM,4,Extreme,Extreme,Medical,Medicare,,,,,Y,66123.06,13872.09
New York City,Manhattan,7002054,001464,New York-Presbyterian Hospital - Columbia Presbyterian Center,30 to 49,104,M,Other Race,Spanish/Hispanic,1,Emergency,Home or Self Care,2022,DIG021,Gastrointestinal hemorrhage,,,253,OTHER AND UNSPECIFIED GASTROINTESTINAL HEMORRHAGE,06,DISEASES AND DISORDERS OF THE DIGESTIVE SYSTEM,2,Moderate,Minor,Medical,Medicaid,,,,,Y,25181.33,
New York City,Manhattan,7002054,001464,New York-Presbyterian Hospital - Columbia Presbyterian Center,30 to 49,100,M,Other Race,Spanish/Hispanic,1,Emergency,Home or Self Care,2022,DIG021,Gastrointestinal hemorrhage,,,253,OTHER AND UNSPECIFIED GASTROINTESTINAL HEMORRHAGE,06,DISEASES AND DISORDERS OF THE DIGESTIVE SYSTEM,1,Minor,Minor,Medical,Medicaid,,,,,Y,19545.70,4287.43
New York City,Manhattan,7002054,001464,New York-Presbyterian Hospital - Columbia Presbyterian Center,70 or Older,100,M,White,Spanish/Hispanic,8,Emergency,Home w/ Home Health Services,2022,DIG008,Other specified and unspecified disorders of stomach and duodenum,GIS004,GI SYSTEM ENDOSCOPY WITHOUT BIOPSY (DIAGNOSTIC),253,OTHER AND UNSPECIFIED GASTROINTESTINAL HEMORRHAGE,06,DISEASES AND DISORDERS OF THE DIGESTIVE SYSTEM,3,Major,Major,Medical,Medicare,Medicaid,,,,Y,123802.61,28409.07
New York City,Manhattan,7002054,001464,New York-Presbyterian Hospital - Columbia Presbyterian Center,70 or Older,100,F,Black/African American,Not Span/Hispanic,8,Emergency,Skilled Nursing Home,2022,DIG021,Gastrointestinal hemorrhage,ADM001,TRANSFUSION OF BLOOD AND BLOOD PRODUCTS,253,OTHER AND UNSPECIFIED GASTROINTESTINAL HEMORRHAGE,06,DISEASES AND DISORDERS OF THE DIGESTIVE SYSTEM,4,Extreme,Extreme,Medical,Medicare,Medicaid,,,,Y,139704.37,30119.70
New York City,Manhattan,7002054,001464,New York-Presbyterian Hospital - Columbia Presbyterian Center,70 or Older,100,M,Other Race,Spanish/Hispanic,6,Urgent,Home w/ Home Health Services,2022,DIG021,Gastrointestinal hemorrhage,GIS004,GI SYSTEM ENDOSCOPY WITHOUT BIOPSY (DIAGNOSTIC),253,OTHER AND UNSPECIFIED GASTROINTESTINAL HEMORRHAGE,06,DISEASES AND DISORDERS OF THE DIGESTIVE SYSTEM,2,Moderate,Moderate,Medical,Medicare,Medicaid,,,,Y,100605.01,23178.70
New York City,Manhattan,7002054,001464,New York-Presbyterian Hospital - Columbia Presbyterian Center,70 or Older,112,F,White,Not Span/Hispanic,4,Emergency,Home w/ Home Health Services,2022,DIG021,Gastrointestinal hemorrhage,GIS004,GI SYSTEM ENDOSCOPY WITHOUT BIOPSY (DIAGNOSTIC),253,OTHER AND UNSPECIFIED GASTROINTESTINAL HEMORRHAGE,06,DISEASES AND DISORDERS OF THE DIGESTIVE SYSTEM,1,Minor,Minor,Medical,Medicare,Medicaid,,,,Y,70568.90,17711.99
New York City,Manhattan,7002054,001464,New York-Presbyterian Hospital - Columbia Presbyterian Center,50 to 69,112,F,Black/African American,Not Span/Hispanic,19,Urgent,Skilled Nursing Home,2022,DIG008,Other specified and unspecified disorders of stomach and duodenum,GIS004,GI SYSTEM ENDOSCOPY WITHOUT BIOPSY (DIAGNOSTIC),253,OTHER AND UNSPECIFIED GASTROINTESTINAL HEMORRHAGE,06,DISEASES AND DISORDERS OF THE DIGESTIVE SYSTEM,3,Major,Major,Medical,Medicare,Medicaid,,,,N,481376.44,235749.35
New York City,Manhattan,7002054,001464,New York-Presbyterian Hospital - Columbia Presbyterian Center,70 or Older,100,M,White,Spanish/Hispanic,4,Emergency,Home or Self Care,2022,DIG025,Other specified and unspecified gastrointestinal disorders,GNR004,ENDOSCOPIC CONTROL OF BLEEDING,253,OTHER AND UNSPECIFIED GASTROINTESTINAL HEMORRHAGE,06,DISEASES AND DISORDERS OF THE DIGESTIVE SYSTEM,2,Moderate,Minor,Medical,Medicare,Private Health Insurance,,,,Y,68067.27,16304.41
New York City,Manhattan,7002054,001464,New York-Presbyterian Hospital - Columbia Presbyterian Center,70 or Older,101,F,White,Not Span/Hispanic,7,Emergency,Home w/ Home Health Services,2022,DIG008,Other specified and unspecified disorders of stomach and duodenum,GNR004,ENDOSCOPIC CONTROL OF BLEEDING,253,OTHER AND UNSPECIFIED GASTROINTESTINAL HEMORRHAGE,06,DISEASES AND DISORDERS OF THE DIGESTIVE SYSTEM,2,Moderate,Moderate,Medical,Medicare,Private Health Insurance,,,,Y,122612.73,29189.52
New York City,Manhattan,7002054,001464,New York-Presbyterian Hospital - Columbia Presbyterian Center,70 or Older,100,F,Other Race,Spanish/Hispanic,12,Emergency,Home or Self Care,2022,DIG008,Other specified and unspecified disorders of stomach and duodenum,GIS004,GI SYSTEM ENDOSCOPY WITHOUT BIOPSY (DIAGNOSTIC),253,OTHER AND UNSPECIFIED GASTROINTESTINAL HEMORRHAGE,06,DISEASES AND DISORDERS OF THE DIGESTIVE SYSTEM,4,Extreme,Extreme,Medical,Medicare,,,,,Y,166895.50,37258.24
New York City,Manhattan,7002053,001463,NYU Langone Hospitals,70 or Older,100,F,White,Not Span/Hispanic,4,Emergency,Skilled Nursing Home,2022,DIG021,Gastrointestinal hemorrhage,,,253,OTHER AND UNSPECIFIED GASTROINTESTINAL HEMORRHAGE,06,DISEASES AND DISORDERS OF THE DIGESTIVE SYSTEM,3,Major,Major,Medical,Medicare,Medicare,,,,Y,79739.34,22726.27
New York City,Manhattan,7002053,001463,NYU Langone Hospitals,50 to 69,OOS,M,White,Not Span/Hispanic,6,Emergency,Home or Self Care,2022,DIG021,Gastrointestinal hemorrhage,GIS004,GI SYSTEM ENDOSCOPY WITHOUT BIOPSY (DIAGNOSTIC),253,OTHER AND UNSPECIFIED GASTROINTESTINAL HEMORRHAGE,06,DISEASES AND DISORDERS OF THE DIGESTIVE SYSTEM,2,Moderate,Minor,Medical,Private Health Insurance,,,,,N,130078.08,36900.16
New York City,Manhattan,7002001,001438,Bellevue Hospital Center,50 to 69,103,M,Other Race,Not Span/Hispanic,3,Emergency,Home or Self Care,2022,DIG021,Gastrointestinal hemorrhage,GIS001,ESOPHAGOGASTRODUODENOSCOPY (EGD) WITH BIOPSY,253,OTHER AND UNSPECIFIED GASTROINTESTINAL HEMORRHAGE,06,DISEASES AND DISORDERS OF THE DIGESTIVE SYSTEM,3,Major,Moderate,Medical,Medicaid,,,,,Y,31447.11,18084.73
New York City,Manhattan,7002053,001463,NYU Langone Hospitals,70 or Older,113,F,Other Race,Unknown,6,Emergency,Home or Self Care,2022,DIG021,Gastrointestinal hemorrhage,,,253,OTHER AND UNSPECIFIED GASTROINTESTINAL HEMORRHAGE,06,DISEASES AND DISORDERS OF THE DIGESTIVE SYSTEM,2,Moderate,Moderate,Medical,Medicare,Medicaid,,,,Y,103605.21,30621.97
New York City,Manhattan,7002053,001463,NYU Langone Hospitals,70 or Older,100,F,White,Not Span/Hispanic,11,Emergency,Home or Self Care,2022,DIG008,Other specified and unspecified disorders of stomach and duodenum,GIS002,COLONOSCOPY AND PROCTOSCOPY WITH BIOPSY,253,OTHER AND UNSPECIFIED GASTROINTESTINAL HEMORRHAGE,06,DISEASES AND DISORDERS OF THE DIGESTIVE SYSTEM,2,Moderate,Moderate,Medical,Medicare,Blue Cross/Blue Shield,,,,Y,293976.39,75038.66
Finger Lakes,Monroe,2701005,000413,Strong Memorial Hospital,70 or Older,146,F,White,Not Span/Hispanic,3,Emergency,Home or Self Care,2022,DIG021,Gastrointestinal hemorrhage,,,253,OTHER AND UNSPECIFIED GASTROINTESTINAL HEMORRHAGE,06,DISEASES AND DISORDERS OF THE DIGESTIVE SYSTEM,3,Major,Major,Medical,Medicare,Medicaid,,,,Y,13123.67,5286.34
Finger Lakes,Monroe,2701005,000413,Strong Memorial Hospital,50 to 69,146,F,White,Not Span/Hispanic,8,Emergency,Home or Self Care,2022,DIG021,Gastrointestinal hemorrhage,ESA001,HEMODIALYSIS,253,OTHER AND UNSPECIFIED GASTROINTESTINAL HEMORRHAGE,06,DISEASES AND DISORDERS OF THE DIGESTIVE SYSTEM,3,Major,Major,Medical,Blue Cross/Blue Shield,Medicaid,,,,Y,61305.74,19588.95
Finger Lakes,Monroe,2701005,000413,Strong Memorial Hospital,18 to 29,145,M,White,Not Span/Hispanic,1,Emergency,Home or Self Care,2022,DIG021,Gastrointestinal hemorrhage,,,253,OTHER AND UNSPECIFIED GASTROINTESTINAL HEMORRHAGE,06,DISEASES AND DISORDERS OF THE DIGESTIVE SYSTEM,2,Moderate,Major,Medical,Medicaid,,,,,Y,10727.44,3484.69