Hospital Service Area,Hospital County,Operating Certificate Number,Permanent Facility Id,Facility Name,Age Group,Zip Code - 3 digits,Gender,Race,Ethnicity,Length of Stay,Type of Admission,Patient Disposition,Discharge Year,CCS Diagnosis Code,CCS Diagnosis Description,CCS Procedure Code,CCS Procedure Description,APR DRG Code,APR DRG Description,APR MDC Code,APR MDC Description,APR Severity of Illness Code,APR Severity of Illness Description,APR Risk of Mortality,APR Medical Surgical Description,Payment Typology 1,Payment Typology 2,Payment Typology 3,Birth Weight,Abortion Edit Indicator,Emergency Department Indicator,Total Charges,Total Costs
New York City,Manhattan,7002054,001464,New York-Presbyterian Hospital - Columbia Presbyterian Center,30 to 49,104,M,Other Race,Spanish/Hispanic,4,Emergency,Home or Self Care,2022,DIG025,Other specified and unspecified gastrointestinal disorders,GIS001,ESOPHAGOGASTRODUODENOSCOPY (EGD) WITH BIOPSY,254,OTHER DIGESTIVE SYSTEM DIAGNOSES,06,DISEASES AND DISORDERS OF THE DIGESTIVE SYSTEM,3,Major,Major,Medical,Medicaid,,,,,Y,96937.34,21784.35
New York City,Manhattan,7002054,001464,New York-Presbyterian Hospital - Columbia Presbyterian Center,30 to 49,100,M,Other Race,Spanish/Hispanic,1,Emergency,Home or Self Care,2022,DIG009,Appendicitis and other appendiceal conditions,OTR004,ISOLATION PROCEDURES,254,OTHER DIGESTIVE SYSTEM DIAGNOSES,06,DISEASES AND DISORDERS OF THE DIGESTIVE SYSTEM,3,Major,Major,Medical,Medicaid,,,,,Y,20146.39,4403.38
New York City,Manhattan,7002054,001464,New York-Presbyterian Hospital - Columbia Presbyterian Center,0 to 17,109,F,White,Unknown,1,Emergency,Home or Self Care,2022,DIG009,Appendicitis and other appendiceal conditions,ADM015,ADMINISTRATION OF ANTIBIOTICS,254,OTHER DIGESTIVE SYSTEM DIAGNOSES,06,DISEASES AND DISORDERS OF THE DIGESTIVE SYSTEM,2,Moderate,Moderate,Medical,Medicaid,,,,,Y,22193.84,4702.62
New York City,Manhattan,7002054,001464,New York-Presbyterian Hospital - Columbia Presbyterian Center,70 or Older,100,F,White,Not Span/Hispanic,1,Emergency,Home or Self Care,2022,DIG021,Gastrointestinal hemorrhage,OTR004,ISOLATION PROCEDURES,254,OTHER DIGESTIVE SYSTEM DIAGNOSES,06,DISEASES AND DISORDERS OF THE DIGESTIVE SYSTEM,2,Moderate,Moderate,Medical,Medicare,Private Health Insurance,,,,Y,32023.92,6974.49
New York City,Manhattan,7002054,001464,New York-Presbyterian Hospital - Columbia Presbyterian Center,70 or Older,100,M,Other Race,Unknown,2,Emergency,Home or Self Care,2022,DIG021,Gastrointestinal hemorrhage,ADM017,ADMINISTRATION OF NUTRITIONAL AND ELECTROLYTIC SUBSTANCES,254,OTHER DIGESTIVE SYSTEM DIAGNOSES,06,DISEASES AND DISORDERS OF THE DIGESTIVE SYSTEM,2,Moderate,Moderate,Medical,Medicare,Private Health Insurance,,,,Y,35506.30,7447.84
New York City,Manhattan,7002054,001464,New York-Presbyterian Hospital - Columbia Presbyterian Center,70 or Older,OOS,F,Other Race,Not Span/Hispanic,3,Elective,Home w/ Home Health Services,2022,DIG015,Anal and rectal conditions,GIS016,GI SYSTEM ENDOSCOPIC THERAPEUTIC PROCEDURES,254,OTHER DIGESTIVE SYSTEM DIAGNOSES,06,DISEASES AND DISORDERS OF THE DIGESTIVE SYSTEM,1,Minor,Minor,Medical,Medicare,,,,,N,63531.21,17812.11
New York City,Manhattan,7002054,001464,New York-Presbyterian Hospital - Columbia Presbyterian Center,18 to 29,100,F,Other Race,Spanish/Hispanic,1,Emergency,Home or Self Care,2022,DIG009,Appendicitis and other appendiceal conditions,ADM015,ADMINISTRATION OF ANTIBIOTICS,254,OTHER DIGESTIVE SYSTEM DIAGNOSES,06,DISEASES AND DISORDERS OF THE DIGESTIVE SYSTEM,2,Moderate,Moderate,Medical,Blue Cross/Blue Shield,Medicaid,,,,Y,25859.43,5493.57
New York City,Manhattan,7002054,001464,New York-Presbyterian Hospital - Columbia Presbyterian Center,50 to 69,112,F,Other Race,Unknown,2,Emergency,Home or Self Care,2022,DIG010,Abdominal hernia,,,254,OTHER DIGESTIVE SYSTEM DIAGNOSES,06,DISEASES AND DISORDERS OF THE DIGESTIVE SYSTEM,2,Moderate,Moderate,Medical,Medicaid,,,,,Y,39149.30,8342.60
New York City,Manhattan,7002001,001438,Bellevue Hospital Center,50 to 69,100,F,Other Race,Spanish/Hispanic,2,Emergency,Home or Self Care,2022,DIG009,Appendicitis and other appendiceal conditions,ADM015,ADMINISTRATION OF ANTIBIOTICS,254,OTHER DIGESTIVE SYSTEM DIAGNOSES,06,DISEASES AND DISORDERS OF THE DIGESTIVE SYSTEM,1,Minor,Minor,Medical,Medicaid,,,,,Y,18642.67,10721.10
New York City,Manhattan,7002001,001438,Bellevue Hospital Center,50 to 69,105,M,White,Unknown,10,Emergency,Inpatient Rehabilitation Facility,2022,DIG016,Peritonitis and intra-abdominal abscess,ADM015,ADMINISTRATION OF ANTIBIOTICS,254,OTHER DIGESTIVE SYSTEM DIAGNOSES,06,DISEASES AND DISORDERS OF THE DIGESTIVE SYSTEM,2,Moderate,Moderate,Medical,Private Health Insurance,,,,,Y,84316.47,48489.05
New York City,Manhattan,7002054,001464,New York-Presbyterian Hospital - Columbia Presbyterian Center,30 to 49,100,M,Black/African American,Not Span/Hispanic,4,Emergency,Home or Self Care,2022,DIG025,Other specified and unspecified gastrointestinal disorders,ADM017,ADMINISTRATION OF NUTRITIONAL AND ELECTROLYTIC SUBSTANCES,254,OTHER DIGESTIVE SYSTEM DIAGNOSES,06,DISEASES AND DISORDERS OF THE DIGESTIVE SYSTEM,1,Minor,Moderate,Medical,Medicare,Medicaid,,,,Y,53863.41,11896.56
New York City,Manhattan,7002054,001464,New York-Presbyterian Hospital - Columbia Presbyterian Center,50 to 69,OOS,F,Other Race,Spanish/Hispanic,8,Emergency,Home or Self Care,2022,DIG008,Other specified and unspecified disorders of stomach and duodenum,GIS025,OTHER GI SYSTEM DEVICE PROCEDURES,254,OTHER DIGESTIVE SYSTEM DIAGNOSES,06,DISEASES AND DISORDERS OF THE DIGESTIVE SYSTEM,2,Moderate,Minor,Medical,Medicare,,,,,Y,187104.78,50544.55
New York City,Manhattan,7002054,001464,New York-Presbyterian Hospital - Columbia Presbyterian Center,70 or Older,107,F,Other Race,Not Span/Hispanic,4,Emergency,Facility w/ Custodial/Supportive Care,2022,DIG021,Gastrointestinal hemorrhage,ADM001,TRANSFUSION OF BLOOD AND BLOOD PRODUCTS,254,OTHER DIGESTIVE SYSTEM DIAGNOSES,06,DISEASES AND DISORDERS OF THE DIGESTIVE SYSTEM,2,Moderate,Moderate,Medical,Medicare,Private Health Insurance,,,,Y,53400.96,11412.19
New York City,Manhattan,7002054,001464,New York-Presbyterian Hospital - Columbia Presbyterian Center,70 or Older,100,M,Other Race,Spanish/Hispanic,1,Emergency,Left Against Medical Advice,2022,DIG021,Gastrointestinal hemorrhage,ADM001,TRANSFUSION OF BLOOD AND BLOOD PRODUCTS,254,OTHER DIGESTIVE SYSTEM DIAGNOSES,06,DISEASES AND DISORDERS OF THE DIGESTIVE SYSTEM,2,Moderate,Moderate,Medical,Medicare,,,,,Y,27831.66,5831.05
New York City,Manhattan,7002054,001464,New York-Presbyterian Hospital - Columbia Presbyterian Center,70 or Older,104,F,White,Not Span/Hispanic,3,Emergency,Home or Self Care,2022,DIG021,Gastrointestinal hemorrhage,GIS001,ESOPHAGOGASTRODUODENOSCOPY (EGD) WITH BIOPSY,254,OTHER DIGESTIVE SYSTEM DIAGNOSES,06,DISEASES AND DISORDERS OF THE DIGESTIVE SYSTEM,2,Moderate,Moderate,Medical,Self-Pay,,,,,Y,64026.01,14951.89
New York City,Manhattan,7002054,001464,New York-Presbyterian Hospital - Columbia Presbyterian Center,18 to 29,OOS,F,White,Not Span/Hispanic,1,Emergency,Home or Self Care,2022,DIG025,Other specified and unspecified gastrointestinal disorders,,,254,OTHER DIGESTIVE SYSTEM DIAGNOSES,06,DISEASES AND DISORDERS OF THE DIGESTIVE SYSTEM,1,Minor,Minor,Medical,Blue Cross/Blue Shield,,,,,Y,31430.28,7616.19
New York City,Manhattan,7002054,001464,New York-Presbyterian Hospital - Columbia Presbyterian Center,50 to 69,OOS,M,White,Not Span/Hispanic,1,Emergency,Home or Self Care,2022,DIG014,Hemorrhoids,,,254,OTHER DIGESTIVE SYSTEM DIAGNOSES,06,DISEASES AND DISORDERS OF THE DIGESTIVE SYSTEM,3,Major,Major,Medical,Private Health Insurance,,,,,Y,18589.93,4102.30
New York City,Manhattan,7002054,001464,New York-Presbyterian Hospital - Columbia Presbyterian Center,70 or Older,104,M,White,Spanish/Hispanic,1,Emergency,Left Against Medical Advice,2022,SYM006,Abdominal pain and other digestive/abdomen signs and symptoms,,,254,OTHER DIGESTIVE SYSTEM DIAGNOSES,06,DISEASES AND DISORDERS OF THE DIGESTIVE SYSTEM,3,Major,Major,Medical,Medicare,Medicaid,,,,Y,26882.92,5493.23
New York City,Manhattan,7002054,001464,New York-Presbyterian Hospital - Columbia Presbyterian Center,0 to 17,130,M,White,Not Span/Hispanic,4,Emergency,Home or Self Care,2022,DIG025,Other specified and unspecified gastrointestinal disorders,,,254,OTHER DIGESTIVE SYSTEM DIAGNOSES,06,DISEASES AND DISORDERS OF THE DIGESTIVE SYSTEM,1,Minor,Minor,Medical,Medicaid,,,,,Y,54377.75,16032.53
New York City,Manhattan,7002054,001464,New York-Presbyterian Hospital - Columbia Presbyterian Center,50 to 69,104,M,Other Race,Spanish/Hispanic,3,Emergency,Skilled Nursing Home,2022,DIG015,Anal and rectal conditions,GIS004,GI SYSTEM ENDOSCOPY WITHOUT BIOPSY (DIAGNOSTIC),254,OTHER DIGESTIVE SYSTEM DIAGNOSES,06,DISEASES AND DISORDERS OF THE DIGESTIVE SYSTEM,3,Major,Moderate,Medical,Medicaid,,,,,Y,57515.79,13495.90
New York City,Manhattan,7002001,001438,Bellevue Hospital Center,30 to 49,112,F,Other Race,Spanish/Hispanic,2,Emergency,Home or Self Care,2022,DIG015,Anal and rectal conditions,GIS007,GI SYSTEM DRAINAGE (EXCLUDING PARACENTESIS),254,OTHER DIGESTIVE SYSTEM DIAGNOSES,06,DISEASES AND DISORDERS OF THE DIGESTIVE SYSTEM,2,Moderate,Minor,Medical,Medicaid,,,,,Y,25554.59,14696.04
New York City,Manhattan,7002001,001438,Bellevue Hospital Center,70 or Older,104,M,Other Race,Spanish/Hispanic,1,Emergency,Home or Self Care,2022,DIG014,Hemorrhoids,ADM021,"ADMINISTRATION OF THERAPEUTIC SUBSTANCES, NEC",254,OTHER DIGESTIVE SYSTEM DIAGNOSES,06,DISEASES AND DISORDERS OF THE DIGESTIVE SYSTEM,1,Minor,Moderate,Medical,Medicare,Medicaid,,,,Y,8572.19,4929.73
New York City,Manhattan,7002054,001464,New York-Presbyterian Hospital - Columbia Presbyterian Center,70 or Older,100,M,White,Not Span/Hispanic,3,Emergency,Home or Self Care,2022,DIG021,Gastrointestinal hemorrhage,GIS004,GI SYSTEM ENDOSCOPY WITHOUT BIOPSY (DIAGNOSTIC),254,OTHER DIGESTIVE SYSTEM DIAGNOSES,06,DISEASES AND DISORDERS OF THE DIGESTIVE SYSTEM,3,Major,Major,Medical,Medicare,Private Health Insurance,,,,Y,56139.76,13760.67
New York City,Manhattan,7002054,001464,New York-Presbyterian Hospital - Columbia Presbyterian Center,70 or Older,100,M,Black/African American,Not Span/Hispanic,1,Elective,Home or Self Care,2022,NEO073,Benign neoplasms,GIS016,GI SYSTEM ENDOSCOPIC THERAPEUTIC PROCEDURES,254,OTHER DIGESTIVE SYSTEM DIAGNOSES,06,DISEASES AND DISORDERS OF THE DIGESTIVE SYSTEM,2,Moderate,Moderate,Medical,Private Health Insurance,,,,,N,45086.02,
New York City,Manhattan,7002054,001464,New York-Presbyterian Hospital - Columbia Presbyterian Center,70 or Older,100,F,White,Spanish/Hispanic,2,Emergency,Home or Self Care,2022,DIG021,Gastrointestinal hemorrhage,,,254,OTHER DIGESTIVE SYSTEM DIAGNOSES,06,DISEASES AND DISORDERS OF THE DIGESTIVE SYSTEM,3,Major,Moderate,Medical,Medicare,,,,,Y,52396.96,
New York City,Manhattan,7002054,001464,New York-Presbyterian Hospital - Columbia Presbyterian Center,70 or Older,104,F,White,Not Span/Hispanic,3,Emergency,Home w/ Home Health Services,2022,INJ030,Drug induced or toxic related condition,ADM001,TRANSFUSION OF BLOOD AND BLOOD PRODUCTS,254,OTHER DIGESTIVE SYSTEM DIAGNOSES,06,DISEASES AND DISORDERS OF THE DIGESTIVE SYSTEM,1,Minor,Minor,Medical,Medicare,Private Health Insurance,,,,Y,54180.95,12124.59
New York City,Manhattan,7002054,001464,New York-Presbyterian Hospital - Columbia Presbyterian Center,50 to 69,125,M,White,Not Span/Hispanic,2,Urgent,Home or Self Care,2022,NEO073,Benign neoplasms,GIS004,GI SYSTEM ENDOSCOPY WITHOUT BIOPSY (DIAGNOSTIC),254,OTHER DIGESTIVE SYSTEM DIAGNOSES,06,DISEASES AND DISORDERS OF THE DIGESTIVE SYSTEM,3,Major,Moderate,Medical,Medicare,Private Health Insurance,,,,N,53881.65,14129.88
New York City,Manhattan,7002054,001464,New York-Presbyterian Hospital - Columbia Presbyterian Center,50 to 69,104,M,Other Race,Unknown,1,Emergency,Left Against Medical Advice,2022,DIG021,Gastrointestinal hemorrhage,,,254,OTHER DIGESTIVE SYSTEM DIAGNOSES,06,DISEASES AND DISORDERS OF THE DIGESTIVE SYSTEM,2,Moderate,Minor,Medical,Medicare,Medicaid,,,,Y,19963.37,
New York City,Manhattan,7002054,001464,New York-Presbyterian Hospital - Columbia Presbyterian Center,0 to 17,104,M,Other Race,Spanish/Hispanic,1,Emergency,Home or Self Care,2022,DIG016,Peritonitis and intra-abdominal abscess,,,254,OTHER DIGESTIVE SYSTEM DIAGNOSES,06,DISEASES AND DISORDERS OF THE DIGESTIVE SYSTEM,2,Moderate,Minor,Medical,Medicaid,,,04500,,Y,17380.27,5280.75
New York City,Manhattan,7002054,001464,New York-Presbyterian Hospital - Columbia Presbyterian Center,18 to 29,104,M,Other Race,Spanish/Hispanic,2,Emergency,Home or Self Care,2022,DIG025,Other specified and unspecified gastrointestinal disorders,,,254,OTHER DIGESTIVE SYSTEM DIAGNOSES,06,DISEASES AND DISORDERS OF THE DIGESTIVE SYSTEM,1,Minor,Minor,Medical,Medicaid,,,,,Y,32141.93,
New York City,Manhattan,7002054,001464,New York-Presbyterian Hospital - Columbia Presbyterian Center,50 to 69,100,M,Other Race,Spanish/Hispanic,1,Emergency,Home or Self Care,2022,FAC010,Other aftercare encounter,GIS025,OTHER GI SYSTEM DEVICE PROCEDURES,254,OTHER DIGESTIVE SYSTEM DIAGNOSES,06,DISEASES AND DISORDERS OF THE DIGESTIVE SYSTEM,1,Minor,Moderate,Medical,Medicaid,,,,,Y,20623.05,5322.53
New York City,Manhattan,7002001,001438,Bellevue Hospital Center,50 to 69,100,M,Other Race,Spanish/Hispanic,1,Emergency,Home or Self Care,2022,DIG010,Abdominal hernia,ADM015,ADMINISTRATION OF ANTIBIOTICS,254,OTHER DIGESTIVE SYSTEM DIAGNOSES,06,DISEASES AND DISORDERS OF THE DIGESTIVE SYSTEM,2,Moderate,Minor,Medical,Medicaid,,,,,Y,8423.04,4843.96
New York City,Manhattan,7002001,001438,Bellevue Hospital Center,50 to 69,100,F,Black/African American,Unknown,5,Emergency,Home or Self Care,2022,DIG014,Hemorrhoids,ADM021,"ADMINISTRATION OF THERAPEUTIC SUBSTANCES, NEC",254,OTHER DIGESTIVE SYSTEM DIAGNOSES,06,DISEASES AND DISORDERS OF THE DIGESTIVE SYSTEM,2,Moderate,Minor,Medical,Medicaid,,,,,Y,38483.27,22131.11
New York City,Manhattan,7002001,001438,Bellevue Hospital Center,0 to 17,113,M,Other Race,Spanish/Hispanic,1,Emergency,Home or Self Care,2022,DIG009,Appendicitis and other appendiceal conditions,ADM017,ADMINISTRATION OF NUTRITIONAL AND ELECTROLYTIC SUBSTANCES,254,OTHER DIGESTIVE SYSTEM DIAGNOSES,06,DISEASES AND DISORDERS OF THE DIGESTIVE SYSTEM,2,Moderate,Moderate,Medical,Private Health Insurance,,,,,Y,9482.98,5453.51
New York City,Manhattan,7002054,001464,New York-Presbyterian Hospital - Columbia Presbyterian Center,18 to 29,OOS,M,Black/African American,Not Span/Hispanic,10,Urgent,Home w/ Home Health Services,2022,DIG024,Postprocedural or postoperative digestive system complication,CAR024,VENOUS AND ARTERIAL CATHETER PLACEMENT,254,OTHER DIGESTIVE SYSTEM DIAGNOSES,06,DISEASES AND DISORDERS OF THE DIGESTIVE SYSTEM,3,Major,Moderate,Medical,Private Health Insurance,,,,,N,160632.82,53646.36
New York City,Manhattan,7002054,001464,New York-Presbyterian Hospital - Columbia Presbyterian Center,70 or Older,104,M,Other Race,Spanish/Hispanic,13,Emergency,Home w/ Home Health Services,2022,DIG008,Other specified and unspecified disorders of stomach and duodenum,GIS017,GASTROSTOMY,254,OTHER DIGESTIVE SYSTEM DIAGNOSES,06,DISEASES AND DISORDERS OF THE DIGESTIVE SYSTEM,4,Extreme,Major,Medical,Medicaid,,,,,Y,242500.67,54420.31
New York City,Manhattan,7002054,001464,New York-Presbyterian Hospital - Columbia Presbyterian Center,70 or Older,100,F,White,Spanish/Hispanic,2,Emergency,Home or Self Care,2022,FAC010,Other aftercare encounter,GIS025,OTHER GI SYSTEM DEVICE PROCEDURES,254,OTHER DIGESTIVE SYSTEM DIAGNOSES,06,DISEASES AND DISORDERS OF THE DIGESTIVE SYSTEM,2,Moderate,Moderate,Medical,Medicare,Medicaid,,,,Y,37226.84,9178.75
New York City,Manhattan,7002054,001464,New York-Presbyterian Hospital - Columbia Presbyterian Center,18 to 29,100,F,Black/African American,Not Span/Hispanic,1,Emergency,Home or Self Care,2022,DIG015,Anal and rectal conditions,ADM015,ADMINISTRATION OF ANTIBIOTICS,254,OTHER DIGESTIVE SYSTEM DIAGNOSES,06,DISEASES AND DISORDERS OF THE DIGESTIVE SYSTEM,1,Minor,Minor,Medical,Medicaid,,,,,Y,20062.33,4521.27
New York City,Manhattan,7002054,001464,New York-Presbyterian Hospital - Columbia Presbyterian Center,50 to 69,104,M,Black/African American,Not Span/Hispanic,1,Emergency,Home or Self Care,2022,DIG010,Abdominal hernia,ADM021,"ADMINISTRATION OF THERAPEUTIC SUBSTANCES, NEC",254,OTHER DIGESTIVE SYSTEM DIAGNOSES,06,DISEASES AND DISORDERS OF THE DIGESTIVE SYSTEM,2,Moderate,Minor,Medical,Blue Cross/Blue Shield,,,,,Y,27022.76,5585.84
New York City,Manhattan,7002054,001464,New York-Presbyterian Hospital - Columbia Presbyterian Center,0 to 17,130,M,White,Not Span/Hispanic,2,Elective,Home or Self Care,2022,DIG025,Other specified and unspecified gastrointestinal disorders,MAM015,"MEASUREMENT AND MONITORING, NEC",254,OTHER DIGESTIVE SYSTEM DIAGNOSES,06,DISEASES AND DISORDERS OF THE DIGESTIVE SYSTEM,1,Minor,Minor,Medical,Medicaid,,,,,N,24252.96,8284.84
New York City,Manhattan,7002054,001464,New York-Presbyterian Hospital - Columbia Presbyterian Center,0 to 17,100,M,Other Race,Spanish/Hispanic,2,Elective,Home or Self Care,2022,DIG025,Other specified and unspecified gastrointestinal disorders,GIS006,PARACENTESIS,254,OTHER DIGESTIVE SYSTEM DIAGNOSES,06,DISEASES AND DISORDERS OF THE DIGESTIVE SYSTEM,1,Minor,Minor,Medical,Medicaid,,,,,N,39526.06,13830.79
New York City,Manhattan,7002054,001464,New York-Presbyterian Hospital - Columbia Presbyterian Center,0 to 17,109,F,White,Not Span/Hispanic,1,Elective,Home or Self Care,2022,MAL002,Digestive congenital anomalies,GIS017,GASTROSTOMY,254,OTHER DIGESTIVE SYSTEM DIAGNOSES,06,DISEASES AND DISORDERS OF THE DIGESTIVE SYSTEM,3,Major,Minor,Medical,Medicaid,,,,,N,44921.11,15593.32
New York City,Manhattan,7002054,001464,New York-Presbyterian Hospital - Columbia Presbyterian Center,70 or Older,100,M,White,Spanish/Hispanic,5,Emergency,Home or Self Care,2022,DIG021,Gastrointestinal hemorrhage,GNR004,ENDOSCOPIC CONTROL OF BLEEDING,254,OTHER DIGESTIVE SYSTEM DIAGNOSES,06,DISEASES AND DISORDERS OF THE DIGESTIVE SYSTEM,2,Moderate,Minor,Medical,Medicare,Private Health Insurance,,,,Y,113048.83,26173.68
New York City,Manhattan,7002054,001464,New York-Presbyterian Hospital - Columbia Presbyterian Center,18 to 29,100,M,Black/African American,Not Span/Hispanic,4,Emergency,Home w/ Home Health Services,2022,DIG021,Gastrointestinal hemorrhage,GIS007,GI SYSTEM DRAINAGE (EXCLUDING PARACENTESIS),254,OTHER DIGESTIVE SYSTEM DIAGNOSES,06,DISEASES AND DISORDERS OF THE DIGESTIVE SYSTEM,2,Moderate,Moderate,Medical,Medicare,Medicaid,,,,Y,67170.48,16107.31
New York City,Manhattan,7002053,001463,NYU Langone Hospitals,18 to 29,OOS,M,White,Not Span/Hispanic,1,Emergency,Home or Self Care,2022,DIG024,Postprocedural or postoperative digestive system complication,,,254,OTHER DIGESTIVE SYSTEM DIAGNOSES,06,DISEASES AND DISORDERS OF THE DIGESTIVE SYSTEM,2,Moderate,Moderate,Medical,Blue Cross/Blue Shield,,,,,Y,41799.91,11414.82
New York City,Manhattan,7002053,001463,NYU Langone Hospitals,70 or Older,112,F,White,Not Span/Hispanic,12,Emergency,Skilled Nursing Home,2022,DIG015,Anal and rectal conditions,GNR004,ENDOSCOPIC CONTROL OF BLEEDING,254,OTHER DIGESTIVE SYSTEM DIAGNOSES,06,DISEASES AND DISORDERS OF THE DIGESTIVE SYSTEM,3,Major,Moderate,Medical,Medicare,Medicare,,,,Y,271903.78,75835.73
New York City,Manhattan,7002053,001463,NYU Langone Hospitals,0 to 17,112,M,White,Not Span/Hispanic,1,Emergency,Home or Self Care,2022,DIG009,Appendicitis and other appendiceal conditions,OTR004,ISOLATION PROCEDURES,254,OTHER DIGESTIVE SYSTEM DIAGNOSES,06,DISEASES AND DISORDERS OF THE DIGESTIVE SYSTEM,1,Minor,Minor,Medical,Medicaid,,,,,Y,19232.80,5997.79
New York City,Manhattan,7002053,001463,NYU Langone Hospitals,30 to 49,112,F,Other Race,Spanish/Hispanic,1,Emergency,Home or Self Care,2022,DIG009,Appendicitis and other appendiceal conditions,,,254,OTHER DIGESTIVE SYSTEM DIAGNOSES,06,DISEASES AND DISORDERS OF THE DIGESTIVE SYSTEM,2,Moderate,Moderate,Medical,Private Health Insurance,,,,,Y,31663.99,7056.20
New York City,Manhattan,7002054,001464,New York-Presbyterian Hospital - Columbia Presbyterian Center,70 or Older,OOS,F,Other Race,Unknown,1,Elective,Home or Self Care,2022,DIG015,Anal and rectal conditions,,,254,OTHER DIGESTIVE SYSTEM DIAGNOSES,06,DISEASES AND DISORDERS OF THE DIGESTIVE SYSTEM,1,Minor,Moderate,Medical,Medicare,Private Health Insurance,,,,N,68647.79,23922.86
New York City,Manhattan,7002054,001464,New York-Presbyterian Hospital - Columbia Presbyterian Center,0 to 17,107,F,Other Race,Not Span/Hispanic,3,Emergency,Home or Self Care,2022,DIG025,Other specified and unspecified gastrointestinal disorders,,,254,OTHER DIGESTIVE SYSTEM DIAGNOSES,06,DISEASES AND DISORDERS OF THE DIGESTIVE SYSTEM,1,Minor,Minor,Medical,Medicaid,,,,,Y,42923.62,12064.97
New York City,Manhattan,7002001,001438,Bellevue Hospital Center,30 to 49,113,M,Black/African American,Not Span/Hispanic,1,Emergency,Court/Law Enforcement,2022,INJ020,"Effect of foreign body entering opening, initial encounter",GIS027,"UPPER GI THERAPEUTIC PROCEDURES, NEC (ENDOSCOPIC)",254,OTHER DIGESTIVE SYSTEM DIAGNOSES,06,DISEASES AND DISORDERS OF THE DIGESTIVE SYSTEM,2,Moderate,Minor,Medical,Medicaid,,,,,Y,18981.13,10915.74
New York City,Manhattan,7002054,001464,New York-Presbyterian Hospital - Columbia Presbyterian Center,0 to 17,103,M,Black/African American,Not Span/Hispanic,3,Emergency,Home or Self Care,2022,FAC010,Other aftercare encounter,GIS025,OTHER GI SYSTEM DEVICE PROCEDURES,254,OTHER DIGESTIVE SYSTEM DIAGNOSES,06,DISEASES AND DISORDERS OF THE DIGESTIVE SYSTEM,1,Minor,Minor,Medical,Private Health Insurance,Medicaid,,,,Y,104064.92,45155.92
New York City,Manhattan,7002054,001464,New York-Presbyterian Hospital - Columbia Presbyterian Center,50 to 69,112,F,Other Race,Unknown,2,Emergency,Home or Self Care,2022,DIG010,Abdominal hernia,,,254,OTHER DIGESTIVE SYSTEM DIAGNOSES,06,DISEASES AND DISORDERS OF THE DIGESTIVE SYSTEM,1,Minor,Minor,Medical,Medicaid,,,,,Y,36410.35,7636.85
New York City,Manhattan,7002054,001464,New York-Presbyterian Hospital - Columbia Presbyterian Center,18 to 29,109,F,Other Race,Unknown,1,Emergency,Home or Self Care,2022,DIG009,Appendicitis and other appendiceal conditions,ADM015,ADMINISTRATION OF ANTIBIOTICS,254,OTHER DIGESTIVE SYSTEM DIAGNOSES,06,DISEASES AND DISORDERS OF THE DIGESTIVE SYSTEM,1,Minor,Minor,Medical,Medicaid,,,,,Y,20529.61,4555.40
New York City,Manhattan,7002054,001464,New York-Presbyterian Hospital - Columbia Presbyterian Center,30 to 49,107,M,White,Not Span/Hispanic,1,Emergency,Home or Self Care,2022,DIG024,Postprocedural or postoperative digestive system complication,,,254,OTHER DIGESTIVE SYSTEM DIAGNOSES,06,DISEASES AND DISORDERS OF THE DIGESTIVE SYSTEM,1,Minor,Minor,Medical,Medicaid,,,,,Y,18712.61,4192.16
New York City,Manhattan,7002054,001464,New York-Presbyterian Hospital - Columbia Presbyterian Center,0 to 17,112,M,Other Race,Spanish/Hispanic,47,Elective,Cancer Center or Children's Hospital,2022,SYM005,Dysphagia,GIS017,GASTROSTOMY,254,OTHER DIGESTIVE SYSTEM DIAGNOSES,06,DISEASES AND DISORDERS OF THE DIGESTIVE SYSTEM,4,Extreme,Major,Medical,Medicaid,,,,,N,1030278.26,419903.34
New York City,Manhattan,7002054,001464,New York-Presbyterian Hospital - Columbia Presbyterian Center,70 or Older,OOS,M,White,Not Span/Hispanic,7,Emergency,Hospice - Home,2022,DIG021,Gastrointestinal hemorrhage,ADM001,TRANSFUSION OF BLOOD AND BLOOD PRODUCTS,254,OTHER DIGESTIVE SYSTEM DIAGNOSES,06,DISEASES AND DISORDERS OF THE DIGESTIVE SYSTEM,4,Extreme,Extreme,Medical,Medicare,Private Health Insurance,,,,Y,111515.97,23865.46