Hospital Service Area,Hospital County,Operating Certificate Number,Permanent Facility Id,Facility Name,Age Group,Zip Code - 3 digits,Gender,Race,Ethnicity,Length of Stay,Type of Admission,Patient Disposition,Discharge Year,CCS Diagnosis Code,CCS Diagnosis Description,CCS Procedure Code,CCS Procedure Description,APR DRG Code,APR DRG Description,APR MDC Code,APR MDC Description,APR Severity of Illness Code,APR Severity of Illness Description,APR Risk of Mortality,APR Medical Surgical Description,Payment Typology 1,Payment Typology 2,Payment Typology 3,Birth Weight,Abortion Edit Indicator,Emergency Department Indicator,Total Charges,Total Costs
New York City,Manhattan,7002054,001464,New York-Presbyterian Hospital - Columbia Presbyterian Center,50 to 69,104,F,Other Race,Spanish/Hispanic,14,Elective,Home w/ Home Health Services,2022,DIG017,Biliary tract disease,HEP004,HEPATOBILIARY RESECTION AND ABLATION,260,"MAJOR PANCREAS, LIVER AND SHUNT PROCEDURES",07,DISEASES AND DISORDERS OF THE HEPATOBILIARY SYSTEM AND PANCREAS,2,Moderate,Minor,Surgical,Medicaid,,,,,N,421803.76,131165.00
New York City,Manhattan,7002054,001464,New York-Presbyterian Hospital - Columbia Presbyterian Center,50 to 69,105,F,White,Not Span/Hispanic,3,Elective,Home or Self Care,2022,DIG020,Pancreatic disorders (excluding diabetes),HEP013,"HEPATOBILIARY AND PANCREATIC PROCEDURES, NEC",260,"MAJOR PANCREAS, LIVER AND SHUNT PROCEDURES",07,DISEASES AND DISORDERS OF THE HEPATOBILIARY SYSTEM AND PANCREAS,1,Minor,Minor,Surgical,Blue Cross/Blue Shield,,,,,N,71893.87,18461.83
New York City,Manhattan,7002054,001464,New York-Presbyterian Hospital - Columbia Presbyterian Center,50 to 69,113,F,White,Not Span/Hispanic,6,Elective,Home w/ Home Health Services,2022,NEO051,Endocrine system cancers - pancreas,HEP005,PANCREATECTOMY,260,"MAJOR PANCREAS, LIVER AND SHUNT PROCEDURES",07,DISEASES AND DISORDERS OF THE HEPATOBILIARY SYSTEM AND PANCREAS,3,Major,Moderate,Surgical,Medicaid,,,,,N,206344.49,69016.19
New York City,Manhattan,7002054,001464,New York-Presbyterian Hospital - Columbia Presbyterian Center,70 or Older,109,F,White,Unknown,5,Elective,Home or Self Care,2022,NEO051,Endocrine system cancers - pancreas,HEP005,PANCREATECTOMY,260,"MAJOR PANCREAS, LIVER AND SHUNT PROCEDURES",07,DISEASES AND DISORDERS OF THE HEPATOBILIARY SYSTEM AND PANCREAS,2,Moderate,Moderate,Surgical,Medicare,Private Health Insurance,,,,N,125541.80,38359.89
New York City,Manhattan,7002054,001464,New York-Presbyterian Hospital - Columbia Presbyterian Center,70 or Older,103,F,Other Race,Not Span/Hispanic,18,Elective,Home or Self Care,2022,NEO051,Endocrine system cancers - pancreas,HEP004,HEPATOBILIARY RESECTION AND ABLATION,260,"MAJOR PANCREAS, LIVER AND SHUNT PROCEDURES",07,DISEASES AND DISORDERS OF THE HEPATOBILIARY SYSTEM AND PANCREAS,4,Extreme,Extreme,Surgical,Self-Pay,,,,,N,364168.00,98111.12
New York City,Manhattan,7002054,001464,New York-Presbyterian Hospital - Columbia Presbyterian Center,70 or Older,112,F,Other Race,Unknown,1,Elective,Home or Self Care,2022,NEO070,Secondary malignancies,HEP004,HEPATOBILIARY RESECTION AND ABLATION,260,"MAJOR PANCREAS, LIVER AND SHUNT PROCEDURES",07,DISEASES AND DISORDERS OF THE HEPATOBILIARY SYSTEM AND PANCREAS,2,Moderate,Moderate,Surgical,Medicare,Medicaid,,,,N,130890.56,32932.20
New York City,Manhattan,7002054,001464,New York-Presbyterian Hospital - Columbia Presbyterian Center,50 to 69,114,F,White,Not Span/Hispanic,3,Elective,Home or Self Care,2022,DIG020,Pancreatic disorders (excluding diabetes),LYM005,SPLENECTOMY,260,"MAJOR PANCREAS, LIVER AND SHUNT PROCEDURES",07,DISEASES AND DISORDERS OF THE HEPATOBILIARY SYSTEM AND PANCREAS,1,Minor,Minor,Surgical,Blue Cross/Blue Shield,,,,,N,83274.35,22418.44
New York City,Manhattan,7002001,001438,Bellevue Hospital Center,70 or Older,112,M,Other Race,Spanish/Hispanic,4,Elective,Home or Self Care,2022,NEO073,Benign neoplasms,HEP005,PANCREATECTOMY,260,"MAJOR PANCREAS, LIVER AND SHUNT PROCEDURES",07,DISEASES AND DISORDERS OF THE HEPATOBILIARY SYSTEM AND PANCREAS,3,Major,Moderate,Surgical,Medicare,Medicaid,,,,N,63887.31,36740.57
New York City,Manhattan,7002054,001464,New York-Presbyterian Hospital - Columbia Presbyterian Center,0 to 17,100,F,Other Race,Not Span/Hispanic,5,Elective,Home or Self Care,2022,NEO017,Gastrointestinal cancers - liver,HEP004,HEPATOBILIARY RESECTION AND ABLATION,260,"MAJOR PANCREAS, LIVER AND SHUNT PROCEDURES",07,DISEASES AND DISORDERS OF THE HEPATOBILIARY SYSTEM AND PANCREAS,2,Moderate,Moderate,Surgical,Medicaid,,,04000,,N,159822.62,53560.45
New York City,Manhattan,7002054,001464,New York-Presbyterian Hospital - Columbia Presbyterian Center,70 or Older,113,F,Other Race,Not Span/Hispanic,10,Elective,Home w/ Home Health Services,2022,NEO051,Endocrine system cancers - pancreas,HEP005,PANCREATECTOMY,260,"MAJOR PANCREAS, LIVER AND SHUNT PROCEDURES",07,DISEASES AND DISORDERS OF THE HEPATOBILIARY SYSTEM AND PANCREAS,2,Moderate,Minor,Surgical,Medicare,Medicaid,,,,N,296235.58,91915.56
New York City,Manhattan,7002054,001464,New York-Presbyterian Hospital - Columbia Presbyterian Center,50 to 69,OOS,F,White,Not Span/Hispanic,109,Elective,Expired,2022,NEO018,Gastrointestinal cancers - bile duct,HEP013,"HEPATOBILIARY AND PANCREATIC PROCEDURES, NEC",260,"MAJOR PANCREAS, LIVER AND SHUNT PROCEDURES",07,DISEASES AND DISORDERS OF THE HEPATOBILIARY SYSTEM AND PANCREAS,4,Extreme,Extreme,Surgical,Private Health Insurance,,,,,N,3652806.65,1555473.61
New York City,Manhattan,7002054,001464,New York-Presbyterian Hospital - Columbia Presbyterian Center,50 to 69,OOS,M,White,Not Span/Hispanic,9,Elective,Expired,2022,NEO051,Endocrine system cancers - pancreas,HEP005,PANCREATECTOMY,260,"MAJOR PANCREAS, LIVER AND SHUNT PROCEDURES",07,DISEASES AND DISORDERS OF THE HEPATOBILIARY SYSTEM AND PANCREAS,4,Extreme,Extreme,Surgical,Medicare,,,,,N,827691.05,279447.83
New York City,Manhattan,7002054,001464,New York-Presbyterian Hospital - Columbia Presbyterian Center,70 or Older,105,M,White,Not Span/Hispanic,102,Elective,Skilled Nursing Home,2022,NEO051,Endocrine system cancers - pancreas,HEP005,PANCREATECTOMY,260,"MAJOR PANCREAS, LIVER AND SHUNT PROCEDURES",07,DISEASES AND DISORDERS OF THE HEPATOBILIARY SYSTEM AND PANCREAS,3,Major,Major,Surgical,Medicare,,,,,N,1723663.18,409352.73
New York City,Manhattan,7002001,001438,Bellevue Hospital Center,50 to 69,112,M,Other Race,Unknown,6,Elective,Home or Self Care,2022,NEO073,Benign neoplasms,HEP005,PANCREATECTOMY,260,"MAJOR PANCREAS, LIVER AND SHUNT PROCEDURES",07,DISEASES AND DISORDERS OF THE HEPATOBILIARY SYSTEM AND PANCREAS,2,Moderate,Minor,Surgical,Medicaid,,,,,N,104319.63,59992.55
New York City,Manhattan,7002054,001464,New York-Presbyterian Hospital - Columbia Presbyterian Center,70 or Older,OOS,M,White,Not Span/Hispanic,6,Elective,Home or Self Care,2022,NEO051,Endocrine system cancers - pancreas,HEP005,PANCREATECTOMY,260,"MAJOR PANCREAS, LIVER AND SHUNT PROCEDURES",07,DISEASES AND DISORDERS OF THE HEPATOBILIARY SYSTEM AND PANCREAS,3,Major,Minor,Surgical,Medicare,Private Health Insurance,,,,N,175450.51,46669.80
New York City,Manhattan,7002001,001438,Bellevue Hospital Center,50 to 69,113,F,Other Race,Not Span/Hispanic,22,Elective,Home or Self Care,2022,NEO051,Endocrine system cancers - pancreas,HEP005,PANCREATECTOMY,260,"MAJOR PANCREAS, LIVER AND SHUNT PROCEDURES",07,DISEASES AND DISORDERS OF THE HEPATOBILIARY SYSTEM AND PANCREAS,3,Major,Moderate,Surgical,Self-Pay,,,,,N,267662.68,153928.52
New York City,Manhattan,7002053,001463,NYU Langone Hospitals,50 to 69,112,M,Other Race,Not Span/Hispanic,14,Elective,Home w/ Home Health Services,2022,NEO021,Gastrointestinal cancers - all other types,HEP005,PANCREATECTOMY,260,"MAJOR PANCREAS, LIVER AND SHUNT PROCEDURES",07,DISEASES AND DISORDERS OF THE HEPATOBILIARY SYSTEM AND PANCREAS,3,Major,Major,Surgical,Self-Pay,,,,,N,451085.43,101917.03
New York City,Manhattan,7002054,001464,New York-Presbyterian Hospital - Columbia Presbyterian Center,70 or Older,100,F,Black/African American,Not Span/Hispanic,7,Elective,Home w/ Home Health Services,2022,NEO051,Endocrine system cancers - pancreas,HEP005,PANCREATECTOMY,260,"MAJOR PANCREAS, LIVER AND SHUNT PROCEDURES",07,DISEASES AND DISORDERS OF THE HEPATOBILIARY SYSTEM AND PANCREAS,3,Major,Moderate,Surgical,Medicare,Private Health Insurance,Blue Cross/Blue Shield,,,N,184060.29,47903.93
New York City,Manhattan,7002054,001464,New York-Presbyterian Hospital - Columbia Presbyterian Center,70 or Older,OOS,F,White,Not Span/Hispanic,5,Elective,Home w/ Home Health Services,2022,NEO051,Endocrine system cancers - pancreas,HEP005,PANCREATECTOMY,260,"MAJOR PANCREAS, LIVER AND SHUNT PROCEDURES",07,DISEASES AND DISORDERS OF THE HEPATOBILIARY SYSTEM AND PANCREAS,2,Moderate,Major,Surgical,Medicare,,,,,N,172920.82,61302.67
New York City,Manhattan,7002054,001464,New York-Presbyterian Hospital - Columbia Presbyterian Center,70 or Older,OOS,F,White,Not Span/Hispanic,10,Elective,Home w/ Home Health Services,2022,NEO017,Gastrointestinal cancers - liver,HEP004,HEPATOBILIARY RESECTION AND ABLATION,260,"MAJOR PANCREAS, LIVER AND SHUNT PROCEDURES",07,DISEASES AND DISORDERS OF THE HEPATOBILIARY SYSTEM AND PANCREAS,2,Moderate,Major,Surgical,Medicare,Medicaid,,,,Y,184122.76,48716.97
New York City,Manhattan,7002053,001463,NYU Langone Hospitals,18 to 29,OOS,M,Other Race,Not Span/Hispanic,11,Elective,Home w/ Home Health Services,2022,NEO051,Endocrine system cancers - pancreas,HEP005,PANCREATECTOMY,260,"MAJOR PANCREAS, LIVER AND SHUNT PROCEDURES",07,DISEASES AND DISORDERS OF THE HEPATOBILIARY SYSTEM AND PANCREAS,3,Major,Moderate,Surgical,Blue Cross/Blue Shield,,,,,N,426000.25,87240.54
New York City,Manhattan,7002001,001438,Bellevue Hospital Center,50 to 69,112,M,Other Race,Not Span/Hispanic,3,Elective,Home or Self Care,2022,NEO017,Gastrointestinal cancers - liver,HEP004,HEPATOBILIARY RESECTION AND ABLATION,260,"MAJOR PANCREAS, LIVER AND SHUNT PROCEDURES",07,DISEASES AND DISORDERS OF THE HEPATOBILIARY SYSTEM AND PANCREAS,2,Moderate,Minor,Surgical,Private Health Insurance,,,,,N,52603.20,30251.26
Finger Lakes,Monroe,2701005,000413,Strong Memorial Hospital,50 to 69,146,F,Black/African American,Not Span/Hispanic,4,Elective,Home or Self Care,2022,NEO051,Endocrine system cancers - pancreas,HEP005,PANCREATECTOMY,260,"MAJOR PANCREAS, LIVER AND SHUNT PROCEDURES",07,DISEASES AND DISORDERS OF THE HEPATOBILIARY SYSTEM AND PANCREAS,2,Moderate,Moderate,Surgical,Medicaid,,,,,N,93658.48,45413.84
Finger Lakes,Monroe,2701005,000413,Strong Memorial Hospital,70 or Older,144,M,White,Not Span/Hispanic,11,Elective,Skilled Nursing Home,2022,NEO051,Endocrine system cancers - pancreas,HEP005,PANCREATECTOMY,260,"MAJOR PANCREAS, LIVER AND SHUNT PROCEDURES",07,DISEASES AND DISORDERS OF THE HEPATOBILIARY SYSTEM AND PANCREAS,3,Major,Major,Surgical,Medicare,,,,,N,62139.72,32085.49
Finger Lakes,Monroe,2701005,000413,Strong Memorial Hospital,50 to 69,146,M,White,Not Span/Hispanic,5,Elective,Home or Self Care,2022,NEO051,Endocrine system cancers - pancreas,HEP005,PANCREATECTOMY,260,"MAJOR PANCREAS, LIVER AND SHUNT PROCEDURES",07,DISEASES AND DISORDERS OF THE HEPATOBILIARY SYSTEM AND PANCREAS,3,Major,Major,Surgical,Medicaid,,,,,N,107127.04,48483.10
Finger Lakes,Monroe,2701005,000413,Strong Memorial Hospital,50 to 69,148,F,White,Not Span/Hispanic,7,Elective,Home or Self Care,2022,NEO051,Endocrine system cancers - pancreas,HEP005,PANCREATECTOMY,260,"MAJOR PANCREAS, LIVER AND SHUNT PROCEDURES",07,DISEASES AND DISORDERS OF THE HEPATOBILIARY SYSTEM AND PANCREAS,2,Moderate,Moderate,Surgical,Medicare,,,,,N,82553.99,41928.06
Finger Lakes,Monroe,2701005,000413,Strong Memorial Hospital,18 to 29,148,M,White,Not Span/Hispanic,9,Emergency,Home or Self Care,2022,INJ010,"Internal organ injury, initial encounter",HEP004,HEPATOBILIARY RESECTION AND ABLATION,260,"MAJOR PANCREAS, LIVER AND SHUNT PROCEDURES",07,DISEASES AND DISORDERS OF THE HEPATOBILIARY SYSTEM AND PANCREAS,4,Extreme,Moderate,Surgical,Blue Cross/Blue Shield,,,,,Y,46420.91,20218.56
Finger Lakes,Monroe,2701005,000413,Strong Memorial Hospital,70 or Older,146,M,Black/African American,Not Span/Hispanic,6,Elective,Home or Self Care,2022,NEO051,Endocrine system cancers - pancreas,HEP005,PANCREATECTOMY,260,"MAJOR PANCREAS, LIVER AND SHUNT PROCEDURES",07,DISEASES AND DISORDERS OF THE HEPATOBILIARY SYSTEM AND PANCREAS,2,Moderate,Minor,Surgical,Medicare,,,,,N,86010.19,43126.67
Finger Lakes,Monroe,2701005,000413,Strong Memorial Hospital,30 to 49,148,M,White,Not Span/Hispanic,6,Elective,Home or Self Care,2022,DIG020,Pancreatic disorders (excluding diabetes),HEP005,PANCREATECTOMY,260,"MAJOR PANCREAS, LIVER AND SHUNT PROCEDURES",07,DISEASES AND DISORDERS OF THE HEPATOBILIARY SYSTEM AND PANCREAS,1,Minor,Minor,Surgical,Medicaid,,,,,N,72966.32,36047.73
Finger Lakes,Monroe,2701005,000413,Strong Memorial Hospital,50 to 69,146,M,White,Not Span/Hispanic,45,Elective,Home or Self Care,2022,NEO021,Gastrointestinal cancers - all other types,HEP005,PANCREATECTOMY,260,"MAJOR PANCREAS, LIVER AND SHUNT PROCEDURES",07,DISEASES AND DISORDERS OF THE HEPATOBILIARY SYSTEM AND PANCREAS,4,Extreme,Moderate,Surgical,Medicare,Medicaid,,,,N,193578.75,92770.35
New York City,Manhattan,7002053,001463,NYU Langone Hospitals,70 or Older,113,M,White,Not Span/Hispanic,29,Elective,Home w/ Home Health Services,2022,NEO051,Endocrine system cancers - pancreas,HEP005,PANCREATECTOMY,260,"MAJOR PANCREAS, LIVER AND SHUNT PROCEDURES",07,DISEASES AND DISORDERS OF THE HEPATOBILIARY SYSTEM AND PANCREAS,3,Major,Moderate,Surgical,Medicare,Medicare,,,,N,832917.58,181662.36
New York City,Manhattan,7002053,001463,NYU Langone Hospitals,50 to 69,112,F,White,Not Span/Hispanic,12,Emergency,Home or Self Care,2022,NEO051,Endocrine system cancers - pancreas,HEP005,PANCREATECTOMY,260,"MAJOR PANCREAS, LIVER AND SHUNT PROCEDURES",07,DISEASES AND DISORDERS OF THE HEPATOBILIARY SYSTEM AND PANCREAS,3,Major,Major,Surgical,Medicare,Blue Cross/Blue Shield,,,,Y,366323.35,85820.89
Finger Lakes,Monroe,2701005,000413,Strong Memorial Hospital,70 or Older,144,M,Other Race,Unknown,18,Urgent,Home w/ Home Health Services,2022,NEO021,Gastrointestinal cancers - all other types,ADM017,ADMINISTRATION OF NUTRITIONAL AND ELECTROLYTIC SUBSTANCES,260,"MAJOR PANCREAS, LIVER AND SHUNT PROCEDURES",07,DISEASES AND DISORDERS OF THE HEPATOBILIARY SYSTEM AND PANCREAS,3,Major,Minor,Surgical,Medicare,,,,,N,144456.18,67053.04
New York City,Manhattan,7002053,001463,NYU Langone Hospitals,50 to 69,OOS,M,White,Not Span/Hispanic,7,Elective,Home w/ Home Health Services,2022,NEO051,Endocrine system cancers - pancreas,HEP005,PANCREATECTOMY,260,"MAJOR PANCREAS, LIVER AND SHUNT PROCEDURES",07,DISEASES AND DISORDERS OF THE HEPATOBILIARY SYSTEM AND PANCREAS,3,Major,Moderate,Surgical,Blue Cross/Blue Shield,,,,,N,340473.60,63508.97
New York City,Manhattan,7002053,001463,NYU Langone Hospitals,50 to 69,112,F,White,Unknown,5,Elective,Home or Self Care,2022,NEO070,Secondary malignancies,HEP004,HEPATOBILIARY RESECTION AND ABLATION,260,"MAJOR PANCREAS, LIVER AND SHUNT PROCEDURES",07,DISEASES AND DISORDERS OF THE HEPATOBILIARY SYSTEM AND PANCREAS,2,Moderate,Moderate,Surgical,Medicare,,,,,N,263438.27,50860.11
New York City,Manhattan,7002053,001463,NYU Langone Hospitals,30 to 49,114,M,Other Race,Not Span/Hispanic,55,Emergency,Home w/ Home Health Services,2022,DIG019,Other specified and unspecified liver disease,CAR016,PORTAL AND OTHER VENOUS BYPASS PROCEDURES,260,"MAJOR PANCREAS, LIVER AND SHUNT PROCEDURES",07,DISEASES AND DISORDERS OF THE HEPATOBILIARY SYSTEM AND PANCREAS,4,Extreme,Extreme,Surgical,Medicaid,,,,,Y,1732820.12,457176.00
New York City,Manhattan,7002053,001463,NYU Langone Hospitals,50 to 69,OOS,F,Other Race,Unknown,7,Elective,Home w/ Home Health Services,2022,NEO051,Endocrine system cancers - pancreas,HEP005,PANCREATECTOMY,260,"MAJOR PANCREAS, LIVER AND SHUNT PROCEDURES",07,DISEASES AND DISORDERS OF THE HEPATOBILIARY SYSTEM AND PANCREAS,3,Major,Moderate,Surgical,Medicare,Blue Cross/Blue Shield,,,,N,207597.91,48885.28
New York City,Manhattan,7002053,001463,NYU Langone Hospitals,70 or Older,117,F,White,Not Span/Hispanic,1,Elective,Home or Self Care,2022,DIG019,Other specified and unspecified liver disease,CAR016,PORTAL AND OTHER VENOUS BYPASS PROCEDURES,260,"MAJOR PANCREAS, LIVER AND SHUNT PROCEDURES",07,DISEASES AND DISORDERS OF THE HEPATOBILIARY SYSTEM AND PANCREAS,3,Major,Moderate,Surgical,Blue Cross/Blue Shield,,,,,N,171140.01,28488.36
New York City,Manhattan,7002054,001464,New York-Presbyterian Hospital - Columbia Presbyterian Center,30 to 49,OOS,F,White,Spanish/Hispanic,10,Urgent,Home or Self Care,2022,DIG023,Noninfectious hepatitis,ESA004,NON-INVASIVE VENTILATION,260,"MAJOR PANCREAS, LIVER AND SHUNT PROCEDURES",07,DISEASES AND DISORDERS OF THE HEPATOBILIARY SYSTEM AND PANCREAS,4,Extreme,Extreme,Surgical,Blue Cross/Blue Shield,,,,,N,360265.62,151084.10
New York City,Manhattan,7002054,001464,New York-Presbyterian Hospital - Columbia Presbyterian Center,30 to 49,OOS,M,Other Race,Not Span/Hispanic,21,Elective,Home w/ Home Health Services,2022,NEO051,Endocrine system cancers - pancreas,HEP005,PANCREATECTOMY,260,"MAJOR PANCREAS, LIVER AND SHUNT PROCEDURES",07,DISEASES AND DISORDERS OF THE HEPATOBILIARY SYSTEM AND PANCREAS,4,Extreme,Extreme,Surgical,Private Health Insurance,,,,,N,638672.38,249818.95
New York City,Manhattan,7002054,001464,New York-Presbyterian Hospital - Columbia Presbyterian Center,0 to 17,116,F,Other Race,Spanish/Hispanic,21,Elective,Home or Self Care,2022,NEO017,Gastrointestinal cancers - liver,HEP004,HEPATOBILIARY RESECTION AND ABLATION,260,"MAJOR PANCREAS, LIVER AND SHUNT PROCEDURES",07,DISEASES AND DISORDERS OF THE HEPATOBILIARY SYSTEM AND PANCREAS,4,Extreme,Extreme,Surgical,Medicaid,,,,,N,622385.27,264817.19
New York City,Manhattan,7002054,001464,New York-Presbyterian Hospital - Columbia Presbyterian Center,70 or Older,104,M,Other Race,Spanish/Hispanic,5,Elective,Home w/ Home Health Services,2022,NEO051,Endocrine system cancers - pancreas,HEP005,PANCREATECTOMY,260,"MAJOR PANCREAS, LIVER AND SHUNT PROCEDURES",07,DISEASES AND DISORDERS OF THE HEPATOBILIARY SYSTEM AND PANCREAS,2,Moderate,Minor,Surgical,Medicare,Medicaid,,,,N,168364.10,48098.87
New York City,Manhattan,7002054,001464,New York-Presbyterian Hospital - Columbia Presbyterian Center,0 to 17,104,M,White,Spanish/Hispanic,5,Emergency,Home or Self Care,2022,CIR033,Acute phlebitis; thrombophlebitis and thromboembolism,CAR016,PORTAL AND OTHER VENOUS BYPASS PROCEDURES,260,"MAJOR PANCREAS, LIVER AND SHUNT PROCEDURES",07,DISEASES AND DISORDERS OF THE HEPATOBILIARY SYSTEM AND PANCREAS,2,Moderate,Moderate,Surgical,Medicaid,,,,,Y,141013.14,52513.79
New York City,Manhattan,7002054,001464,New York-Presbyterian Hospital - Columbia Presbyterian Center,50 to 69,100,F,Black/African American,Not Span/Hispanic,7,Elective,Home or Self Care,2022,NEO070,Secondary malignancies,HEP004,HEPATOBILIARY RESECTION AND ABLATION,260,"MAJOR PANCREAS, LIVER AND SHUNT PROCEDURES",07,DISEASES AND DISORDERS OF THE HEPATOBILIARY SYSTEM AND PANCREAS,2,Moderate,Moderate,Surgical,Private Health Insurance,,,,,N,213986.43,76085.34
New York City,Manhattan,7002054,001464,New York-Presbyterian Hospital - Columbia Presbyterian Center,50 to 69,105,F,White,Unknown,3,Elective,Home or Self Care,2022,DIG020,Pancreatic disorders (excluding diabetes),HEP005,PANCREATECTOMY,260,"MAJOR PANCREAS, LIVER AND SHUNT PROCEDURES",07,DISEASES AND DISORDERS OF THE HEPATOBILIARY SYSTEM AND PANCREAS,1,Minor,Minor,Surgical,Private Health Insurance,,,,,N,81646.72,20929.77
New York City,Manhattan,7002054,001464,New York-Presbyterian Hospital - Columbia Presbyterian Center,70 or Older,110,M,Other Race,Unknown,3,Elective,Home or Self Care,2022,DIG019,Other specified and unspecified liver disease,CAR016,PORTAL AND OTHER VENOUS BYPASS PROCEDURES,260,"MAJOR PANCREAS, LIVER AND SHUNT PROCEDURES",07,DISEASES AND DISORDERS OF THE HEPATOBILIARY SYSTEM AND PANCREAS,2,Moderate,Moderate,Surgical,Medicare,Private Health Insurance,,,,N,104243.64,38949.26
New York City,Manhattan,7002053,001463,NYU Langone Hospitals,30 to 49,109,F,White,Not Span/Hispanic,4,Elective,Home or Self Care,2022,DIG020,Pancreatic disorders (excluding diabetes),LYM005,SPLENECTOMY,260,"MAJOR PANCREAS, LIVER AND SHUNT PROCEDURES",07,DISEASES AND DISORDERS OF THE HEPATOBILIARY SYSTEM AND PANCREAS,2,Moderate,Moderate,Surgical,Blue Cross/Blue Shield,,,,,N,251399.12,46046.57
New York City,Manhattan,7002053,001463,NYU Langone Hospitals,70 or Older,112,F,Other Race,Unknown,4,Elective,Home w/ Home Health Services,2022,DIG006,Gastrointestinal and biliary perforation,HEP006,CHOLECYSTECTOMY,260,"MAJOR PANCREAS, LIVER AND SHUNT PROCEDURES",07,DISEASES AND DISORDERS OF THE HEPATOBILIARY SYSTEM AND PANCREAS,2,Moderate,Moderate,Surgical,Medicaid,,,,,N,210150.79,40983.60
New York City,Manhattan,7002053,001463,NYU Langone Hospitals,70 or Older,OOS,F,White,Not Span/Hispanic,6,Elective,Home w/ Home Health Services,2022,NEO051,Endocrine system cancers - pancreas,HEP005,PANCREATECTOMY,260,"MAJOR PANCREAS, LIVER AND SHUNT PROCEDURES",07,DISEASES AND DISORDERS OF THE HEPATOBILIARY SYSTEM AND PANCREAS,3,Major,Major,Surgical,Medicare,,,,,N,269530.02,52565.53
New York City,Manhattan,7002053,001463,NYU Langone Hospitals,50 to 69,103,F,White,Not Span/Hispanic,6,Elective,Home or Self Care,2022,NEO051,Endocrine system cancers - pancreas,HEP005,PANCREATECTOMY,260,"MAJOR PANCREAS, LIVER AND SHUNT PROCEDURES",07,DISEASES AND DISORDERS OF THE HEPATOBILIARY SYSTEM AND PANCREAS,2,Moderate,Moderate,Surgical,Blue Cross/Blue Shield,,,,,N,264018.79,53944.45
New York City,Manhattan,7002053,001463,NYU Langone Hospitals,30 to 49,OOS,M,Other Race,Not Span/Hispanic,9,Elective,Home w/ Home Health Services,2022,NEO051,Endocrine system cancers - pancreas,HEP005,PANCREATECTOMY,260,"MAJOR PANCREAS, LIVER AND SHUNT PROCEDURES",07,DISEASES AND DISORDERS OF THE HEPATOBILIARY SYSTEM AND PANCREAS,3,Major,Major,Surgical,Blue Cross/Blue Shield,,,,,N,255380.58,60714.22
Finger Lakes,Monroe,2701005,000413,Strong Memorial Hospital,70 or Older,131,M,White,Not Span/Hispanic,12,Emergency,Expired,2022,DIG020,Pancreatic disorders (excluding diabetes),HEP005,PANCREATECTOMY,260,"MAJOR PANCREAS, LIVER AND SHUNT PROCEDURES",07,DISEASES AND DISORDERS OF THE HEPATOBILIARY SYSTEM AND PANCREAS,3,Major,Extreme,Surgical,Medicare,,,,,Y,137036.12,60807.77
Finger Lakes,Monroe,2701005,000413,Strong Memorial Hospital,50 to 69,146,F,White,Not Span/Hispanic,13,Elective,Home w/ Home Health Services,2022,DIG020,Pancreatic disorders (excluding diabetes),HEP005,PANCREATECTOMY,260,"MAJOR PANCREAS, LIVER AND SHUNT PROCEDURES",07,DISEASES AND DISORDERS OF THE HEPATOBILIARY SYSTEM AND PANCREAS,3,Major,Moderate,Surgical,Medicaid,,,,,N,131152.52,49508.41
Finger Lakes,Monroe,2701005,000413,Strong Memorial Hospital,50 to 69,145,M,White,Not Span/Hispanic,2,Urgent,Home or Self Care,2022,DIG019,Other specified and unspecified liver disease,CAR016,PORTAL AND OTHER VENOUS BYPASS PROCEDURES,260,"MAJOR PANCREAS, LIVER AND SHUNT PROCEDURES",07,DISEASES AND DISORDERS OF THE HEPATOBILIARY SYSTEM AND PANCREAS,2,Moderate,Moderate,Surgical,Medicaid,,,,,N,39552.77,17168.32
Finger Lakes,Monroe,2701005,000413,Strong Memorial Hospital,70 or Older,146,M,White,Not Span/Hispanic,8,Elective,Home w/ Home Health Services,2022,NEO051,Endocrine system cancers - pancreas,HEP005,PANCREATECTOMY,260,"MAJOR PANCREAS, LIVER AND SHUNT PROCEDURES",07,DISEASES AND DISORDERS OF THE HEPATOBILIARY SYSTEM AND PANCREAS,2,Moderate,Moderate,Surgical,Medicare,,,,,N,78141.57,38771.80
Finger Lakes,Monroe,2701005,000413,Strong Memorial Hospital,30 to 49,140,M,White,Not Span/Hispanic,2,Elective,Home or Self Care,2022,DIG019,Other specified and unspecified liver disease,CAR016,PORTAL AND OTHER VENOUS BYPASS PROCEDURES,260,"MAJOR PANCREAS, LIVER AND SHUNT PROCEDURES",07,DISEASES AND DISORDERS OF THE HEPATOBILIARY SYSTEM AND PANCREAS,3,Major,Moderate,Surgical,Medicaid,,,,,N,37841.06,16647.40