Hospital Service Area,Hospital County,Operating Certificate Number,Permanent Facility Id,Facility Name,Age Group,Zip Code - 3 digits,Gender,Race,Ethnicity,Length of Stay,Type of Admission,Patient Disposition,Discharge Year,CCS Diagnosis Code,CCS Diagnosis Description,CCS Procedure Code,CCS Procedure Description,APR DRG Code,APR DRG Description,APR MDC Code,APR MDC Description,APR Severity of Illness Code,APR Severity of Illness Description,APR Risk of Mortality,APR Medical Surgical Description,Payment Typology 1,Payment Typology 2,Payment Typology 3,Birth Weight,Abortion Edit Indicator,Emergency Department Indicator,Total Charges,Total Costs
New York City,Manhattan,7002054,001464,New York-Presbyterian Hospital - Columbia Presbyterian Center,50 to 69,100,M,White,Not Span/Hispanic,7,Emergency,Cancer Center or Children's Hospital,2022,DIG020,Pancreatic disorders (excluding diabetes),,,282,DISORDERS OF PANCREAS EXCEPT MALIGNANCY,07,DISEASES AND DISORDERS OF THE HEPATOBILIARY SYSTEM AND PANCREAS,3,Major,Major,Medical,Private Health Insurance,,,,,Y,103074.13,21743.11
New York City,Manhattan,7002001,001438,Bellevue Hospital Center,70 or Older,112,M,Black/African American,Unknown,6,Emergency,Left Against Medical Advice,2022,DIG020,Pancreatic disorders (excluding diabetes),OTR004,ISOLATION PROCEDURES,282,DISORDERS OF PANCREAS EXCEPT MALIGNANCY,07,DISEASES AND DISORDERS OF THE HEPATOBILIARY SYSTEM AND PANCREAS,4,Extreme,Major,Medical,Medicare,Medicaid,,,,Y,47361.82,27237.02
New York City,Manhattan,7002001,001438,Bellevue Hospital Center,30 to 49,113,M,Other Race,Not Span/Hispanic,3,Urgent,Home or Self Care,2022,DIG020,Pancreatic disorders (excluding diabetes),ADM014,REGIONAL ANESTHESIA,282,DISORDERS OF PANCREAS EXCEPT MALIGNANCY,07,DISEASES AND DISORDERS OF THE HEPATOBILIARY SYSTEM AND PANCREAS,1,Minor,Minor,Medical,Private Health Insurance,,,,,N,21992.50,12647.53
New York City,Manhattan,7002054,001464,New York-Presbyterian Hospital - Columbia Presbyterian Center,50 to 69,104,M,Other Race,Spanish/Hispanic,9,Emergency,Home or Self Care,2022,INJ030,Drug induced or toxic related condition,GIS004,GI SYSTEM ENDOSCOPY WITHOUT BIOPSY (DIAGNOSTIC),282,DISORDERS OF PANCREAS EXCEPT MALIGNANCY,07,DISEASES AND DISORDERS OF THE HEPATOBILIARY SYSTEM AND PANCREAS,4,Extreme,Extreme,Medical,Private Health Insurance,,,,,Y,149082.49,35032.89
New York City,Manhattan,7002054,001464,New York-Presbyterian Hospital - Columbia Presbyterian Center,50 to 69,100,M,Black/African American,Not Span/Hispanic,1,Emergency,Home or Self Care,2022,DIG020,Pancreatic disorders (excluding diabetes),,,282,DISORDERS OF PANCREAS EXCEPT MALIGNANCY,07,DISEASES AND DISORDERS OF THE HEPATOBILIARY SYSTEM AND PANCREAS,1,Minor,Minor,Medical,Medicare,Medicaid,,,,Y,26870.15,5440.31
New York City,Manhattan,7002054,001464,New York-Presbyterian Hospital - Columbia Presbyterian Center,50 to 69,100,M,Multi-racial,Spanish/Hispanic,9,Emergency,Expired,2022,DIG020,Pancreatic disorders (excluding diabetes),LYM008,BONE MARROW ASPIRATION (THERAPEUTIC),282,DISORDERS OF PANCREAS EXCEPT MALIGNANCY,07,DISEASES AND DISORDERS OF THE HEPATOBILIARY SYSTEM AND PANCREAS,4,Extreme,Extreme,Medical,Medicaid,,,,,Y,449351.39,161222.20
New York City,Manhattan,7002054,001464,New York-Presbyterian Hospital - Columbia Presbyterian Center,50 to 69,104,F,Black/African American,Spanish/Hispanic,9,Emergency,Home or Self Care,2022,DIG020,Pancreatic disorders (excluding diabetes),ADM017,ADMINISTRATION OF NUTRITIONAL AND ELECTROLYTIC SUBSTANCES,282,DISORDERS OF PANCREAS EXCEPT MALIGNANCY,07,DISEASES AND DISORDERS OF THE HEPATOBILIARY SYSTEM AND PANCREAS,2,Moderate,Minor,Medical,Medicaid,,,,,Y,125970.49,26629.90
New York City,Manhattan,7002054,001464,New York-Presbyterian Hospital - Columbia Presbyterian Center,30 to 49,103,F,White,Not Span/Hispanic,7,Emergency,Home or Self Care,2022,DIG020,Pancreatic disorders (excluding diabetes),HEP009,PANCREATIC AND PROXIMAL BILIARY DILATION AND STENTING,282,DISORDERS OF PANCREAS EXCEPT MALIGNANCY,07,DISEASES AND DISORDERS OF THE HEPATOBILIARY SYSTEM AND PANCREAS,4,Extreme,Major,Medical,Medicaid,,,,,Y,132125.60,33026.16
New York City,Manhattan,7002054,001464,New York-Presbyterian Hospital - Columbia Presbyterian Center,30 to 49,100,F,White,Spanish/Hispanic,5,Emergency,Home or Self Care,2022,DIG020,Pancreatic disorders (excluding diabetes),,,282,DISORDERS OF PANCREAS EXCEPT MALIGNANCY,07,DISEASES AND DISORDERS OF THE HEPATOBILIARY SYSTEM AND PANCREAS,2,Moderate,Minor,Medical,Medicaid,,,,,Y,75566.70,15956.18
New York City,Manhattan,7002054,001464,New York-Presbyterian Hospital - Columbia Presbyterian Center,50 to 69,109,F,White,Not Span/Hispanic,5,Emergency,Home or Self Care,2022,DIG020,Pancreatic disorders (excluding diabetes),ADM021,"ADMINISTRATION OF THERAPEUTIC SUBSTANCES, NEC",282,DISORDERS OF PANCREAS EXCEPT MALIGNANCY,07,DISEASES AND DISORDERS OF THE HEPATOBILIARY SYSTEM AND PANCREAS,2,Moderate,Moderate,Medical,Private Health Insurance,Medicare,,,,Y,64110.78,13808.63
New York City,Manhattan,7002054,001464,New York-Presbyterian Hospital - Columbia Presbyterian Center,50 to 69,104,F,Black/African American,Spanish/Hispanic,5,Emergency,Home or Self Care,2022,DIG020,Pancreatic disorders (excluding diabetes),,,282,DISORDERS OF PANCREAS EXCEPT MALIGNANCY,07,DISEASES AND DISORDERS OF THE HEPATOBILIARY SYSTEM AND PANCREAS,2,Moderate,Minor,Medical,Medicare,Medicaid,,,,Y,63580.68,13800.35
New York City,Manhattan,7002054,001464,New York-Presbyterian Hospital - Columbia Presbyterian Center,70 or Older,100,F,Other Race,Spanish/Hispanic,1,Emergency,Home or Self Care,2022,DIG020,Pancreatic disorders (excluding diabetes),IMG006,COMPUTERIZED TOMOGRAPHY (CT) WITH CONTRAST,282,DISORDERS OF PANCREAS EXCEPT MALIGNANCY,07,DISEASES AND DISORDERS OF THE HEPATOBILIARY SYSTEM AND PANCREAS,2,Moderate,Major,Medical,Medicare,,,,,Y,27018.27,5796.46
New York City,Manhattan,7002053,001463,NYU Langone Hospitals,70 or Older,100,M,Other Race,Not Span/Hispanic,21,Emergency,Home w/ Home Health Services,2022,DIG020,Pancreatic disorders (excluding diabetes),,,282,DISORDERS OF PANCREAS EXCEPT MALIGNANCY,07,DISEASES AND DISORDERS OF THE HEPATOBILIARY SYSTEM AND PANCREAS,4,Extreme,Extreme,Medical,Medicare,Medicaid,,,,Y,484295.32,161077.61
New York City,Manhattan,7002053,001463,NYU Langone Hospitals,30 to 49,112,M,Other Race,Spanish/Hispanic,3,Emergency,Home or Self Care,2022,DIG020,Pancreatic disorders (excluding diabetes),,,282,DISORDERS OF PANCREAS EXCEPT MALIGNANCY,07,DISEASES AND DISORDERS OF THE HEPATOBILIARY SYSTEM AND PANCREAS,3,Major,Major,Medical,Medicaid,,,,,Y,69718.39,16926.32
New York City,Manhattan,7002054,001464,New York-Presbyterian Hospital - Columbia Presbyterian Center,50 to 69,100,M,Other Race,Spanish/Hispanic,2,Emergency,Home or Self Care,2022,DIG020,Pancreatic disorders (excluding diabetes),ADM021,"ADMINISTRATION OF THERAPEUTIC SUBSTANCES, NEC",282,DISORDERS OF PANCREAS EXCEPT MALIGNANCY,07,DISEASES AND DISORDERS OF THE HEPATOBILIARY SYSTEM AND PANCREAS,1,Minor,Minor,Medical,Medicare,,,,,Y,32764.26,
New York City,Manhattan,7002054,001464,New York-Presbyterian Hospital - Columbia Presbyterian Center,30 to 49,100,F,Other Race,Spanish/Hispanic,3,Emergency,Home or Self Care,2022,DIG020,Pancreatic disorders (excluding diabetes),ADM021,"ADMINISTRATION OF THERAPEUTIC SUBSTANCES, NEC",282,DISORDERS OF PANCREAS EXCEPT MALIGNANCY,07,DISEASES AND DISORDERS OF THE HEPATOBILIARY SYSTEM AND PANCREAS,2,Moderate,Minor,Medical,Medicaid,,,,,Y,52504.15,10552.89
New York City,Manhattan,7002054,001464,New York-Presbyterian Hospital - Columbia Presbyterian Center,50 to 69,104,M,White,Not Span/Hispanic,2,Emergency,Home or Self Care,2022,DIG020,Pancreatic disorders (excluding diabetes),OTR004,ISOLATION PROCEDURES,282,DISORDERS OF PANCREAS EXCEPT MALIGNANCY,07,DISEASES AND DISORDERS OF THE HEPATOBILIARY SYSTEM AND PANCREAS,2,Moderate,Moderate,Medical,Medicaid,,,,,Y,31824.78,6829.42
New York City,Manhattan,7002001,001438,Bellevue Hospital Center,30 to 49,113,M,Other Race,Spanish/Hispanic,1,Emergency,Home or Self Care,2022,DIG020,Pancreatic disorders (excluding diabetes),ADM014,REGIONAL ANESTHESIA,282,DISORDERS OF PANCREAS EXCEPT MALIGNANCY,07,DISEASES AND DISORDERS OF THE HEPATOBILIARY SYSTEM AND PANCREAS,1,Minor,Minor,Medical,Medicaid,,,,,Y,12445.32,7157.10
New York City,Manhattan,7002054,001464,New York-Presbyterian Hospital - Columbia Presbyterian Center,50 to 69,100,M,Other Race,Spanish/Hispanic,3,Emergency,Home or Self Care,2022,DIG020,Pancreatic disorders (excluding diabetes),ADM019,POTENTIAL COVID-19 THERAPIES,282,DISORDERS OF PANCREAS EXCEPT MALIGNANCY,07,DISEASES AND DISORDERS OF THE HEPATOBILIARY SYSTEM AND PANCREAS,3,Major,Major,Medical,Medicare,Medicaid,,,,Y,63452.45,15354.76
New York City,Manhattan,7002054,001464,New York-Presbyterian Hospital - Columbia Presbyterian Center,70 or Older,112,M,White,Not Span/Hispanic,8,Emergency,Home or Self Care,2022,DIG020,Pancreatic disorders (excluding diabetes),HEP010,HEPATOBILIARY AND PANCREATIC DRAINAGE,282,DISORDERS OF PANCREAS EXCEPT MALIGNANCY,07,DISEASES AND DISORDERS OF THE HEPATOBILIARY SYSTEM AND PANCREAS,3,Major,Moderate,Medical,Medicare,Medicaid,,,,Y,138851.20,32612.19
New York City,Manhattan,7002053,001463,NYU Langone Hospitals,70 or Older,114,F,Black/African American,Not Span/Hispanic,4,Emergency,Home w/ Home Health Services,2022,INJ030,Drug induced or toxic related condition,,,282,DISORDERS OF PANCREAS EXCEPT MALIGNANCY,07,DISEASES AND DISORDERS OF THE HEPATOBILIARY SYSTEM AND PANCREAS,1,Minor,Moderate,Medical,Medicare,Blue Cross/Blue Shield,,,,N,79178.17,17683.01
New York City,Manhattan,7002053,001463,NYU Langone Hospitals,50 to 69,OOS,M,White,Not Span/Hispanic,3,Emergency,Home w/ Home Health Services,2022,DIG020,Pancreatic disorders (excluding diabetes),ADM010,VACCINATIONS,282,DISORDERS OF PANCREAS EXCEPT MALIGNANCY,07,DISEASES AND DISORDERS OF THE HEPATOBILIARY SYSTEM AND PANCREAS,2,Moderate,Minor,Medical,Medicare,,,,,N,48552.25,15740.58
New York City,Manhattan,7002054,001464,New York-Presbyterian Hospital - Columbia Presbyterian Center,18 to 29,104,F,Other Race,Spanish/Hispanic,15,Emergency,Home or Self Care,2022,DIG020,Pancreatic disorders (excluding diabetes),HEP009,PANCREATIC AND PROXIMAL BILIARY DILATION AND STENTING,282,DISORDERS OF PANCREAS EXCEPT MALIGNANCY,07,DISEASES AND DISORDERS OF THE HEPATOBILIARY SYSTEM AND PANCREAS,2,Moderate,Moderate,Medical,Private Health Insurance,,,,,Y,234777.08,53218.58
Finger Lakes,Monroe,2701005,000413,Strong Memorial Hospital,0 to 17,146,F,Other Race,Spanish/Hispanic,5,Emergency,Home or Self Care,2022,DIG020,Pancreatic disorders (excluding diabetes),,,282,DISORDERS OF PANCREAS EXCEPT MALIGNANCY,07,DISEASES AND DISORDERS OF THE HEPATOBILIARY SYSTEM AND PANCREAS,3,Major,Major,Medical,Medicaid,,,,,Y,16518.29,7936.11
Finger Lakes,Monroe,2701005,000413,Strong Memorial Hospital,30 to 49,144,F,White,Not Span/Hispanic,1,Emergency,Home or Self Care,2022,DIG020,Pancreatic disorders (excluding diabetes),,,282,DISORDERS OF PANCREAS EXCEPT MALIGNANCY,07,DISEASES AND DISORDERS OF THE HEPATOBILIARY SYSTEM AND PANCREAS,1,Minor,Minor,Medical,Medicaid,,,,,Y,12091.86,4322.09
Finger Lakes,Monroe,2701005,000413,Strong Memorial Hospital,50 to 69,145,M,Black/African American,Not Span/Hispanic,6,Emergency,Home or Self Care,2022,DIG020,Pancreatic disorders (excluding diabetes),,,282,DISORDERS OF PANCREAS EXCEPT MALIGNANCY,07,DISEASES AND DISORDERS OF THE HEPATOBILIARY SYSTEM AND PANCREAS,3,Major,Moderate,Medical,Medicare,Medicaid,,,,Y,21446.93,9417.92
Finger Lakes,Monroe,2701005,000413,Strong Memorial Hospital,30 to 49,130,F,White,Not Span/Hispanic,4,Emergency,Home or Self Care,2022,DIG020,Pancreatic disorders (excluding diabetes),,,282,DISORDERS OF PANCREAS EXCEPT MALIGNANCY,07,DISEASES AND DISORDERS OF THE HEPATOBILIARY SYSTEM AND PANCREAS,2,Moderate,Minor,Medical,Blue Cross/Blue Shield,,,,,Y,15532.33,6528.46
Finger Lakes,Monroe,2701005,000413,Strong Memorial Hospital,0 to 17,145,F,White,Not Span/Hispanic,2,Emergency,Home or Self Care,2022,DIG020,Pancreatic disorders (excluding diabetes),,,282,DISORDERS OF PANCREAS EXCEPT MALIGNANCY,07,DISEASES AND DISORDERS OF THE HEPATOBILIARY SYSTEM AND PANCREAS,1,Minor,Minor,Medical,Medicaid,,,,,Y,8412.84,3651.14
Finger Lakes,Monroe,2701005,000413,Strong Memorial Hospital,50 to 69,146,F,White,Not Span/Hispanic,6,Emergency,Home w/ Home Health Services,2022,DIG020,Pancreatic disorders (excluding diabetes),HEP010,HEPATOBILIARY AND PANCREATIC DRAINAGE,282,DISORDERS OF PANCREAS EXCEPT MALIGNANCY,07,DISEASES AND DISORDERS OF THE HEPATOBILIARY SYSTEM AND PANCREAS,2,Moderate,Minor,Medical,Medicaid,,,,,Y,39003.65,15194.06
Finger Lakes,Monroe,2701005,000413,Strong Memorial Hospital,50 to 69,146,F,Multi-racial,Spanish/Hispanic,3,Emergency,Home or Self Care,2022,DIG020,Pancreatic disorders (excluding diabetes),,,282,DISORDERS OF PANCREAS EXCEPT MALIGNANCY,07,DISEASES AND DISORDERS OF THE HEPATOBILIARY SYSTEM AND PANCREAS,2,Moderate,Moderate,Medical,Medicare,,,,,Y,15003.62,5608.38
Finger Lakes,Monroe,2701005,000413,Strong Memorial Hospital,50 to 69,145,M,White,Not Span/Hispanic,6,Emergency,Home or Self Care,2022,DIG020,Pancreatic disorders (excluding diabetes),HEP007,BILIARY AND PANCREATIC CALCULUS REMOVAL,282,DISORDERS OF PANCREAS EXCEPT MALIGNANCY,07,DISEASES AND DISORDERS OF THE HEPATOBILIARY SYSTEM AND PANCREAS,1,Minor,Minor,Medical,Blue Cross/Blue Shield,,,,,Y,42693.26,16592.07
Finger Lakes,Monroe,2701005,000413,Strong Memorial Hospital,70 or Older,145,F,Other Race,Not Span/Hispanic,2,Emergency,Home or Self Care,2022,DIG020,Pancreatic disorders (excluding diabetes),,,282,DISORDERS OF PANCREAS EXCEPT MALIGNANCY,07,DISEASES AND DISORDERS OF THE HEPATOBILIARY SYSTEM AND PANCREAS,2,Moderate,Major,Medical,Medicare,,,,,Y,7987.92,3480.01
Finger Lakes,Monroe,2701005,000413,Strong Memorial Hospital,50 to 69,144,M,White,Not Span/Hispanic,4,Emergency,Home or Self Care,2022,DIG020,Pancreatic disorders (excluding diabetes),HEP010,HEPATOBILIARY AND PANCREATIC DRAINAGE,282,DISORDERS OF PANCREAS EXCEPT MALIGNANCY,07,DISEASES AND DISORDERS OF THE HEPATOBILIARY SYSTEM AND PANCREAS,3,Major,Moderate,Medical,Blue Cross/Blue Shield,,,,,Y,48560.15,17603.49
Finger Lakes,Monroe,2701005,000413,Strong Memorial Hospital,70 or Older,146,M,Black/African American,Not Span/Hispanic,5,Emergency,Home or Self Care,2022,DIG020,Pancreatic disorders (excluding diabetes),,,282,DISORDERS OF PANCREAS EXCEPT MALIGNANCY,07,DISEASES AND DISORDERS OF THE HEPATOBILIARY SYSTEM AND PANCREAS,3,Major,Major,Medical,Federal/State/Local/VA,,,,,Y,14326.65,7246.00
Finger Lakes,Monroe,2701005,000413,Strong Memorial Hospital,50 to 69,146,F,Black/African American,Not Span/Hispanic,5,Emergency,Home or Self Care,2022,DIG020,Pancreatic disorders (excluding diabetes),HEP009,PANCREATIC AND PROXIMAL BILIARY DILATION AND STENTING,282,DISORDERS OF PANCREAS EXCEPT MALIGNANCY,07,DISEASES AND DISORDERS OF THE HEPATOBILIARY SYSTEM AND PANCREAS,1,Minor,Minor,Medical,Medicare,Medicaid,,,,Y,26931.48,10985.96
Finger Lakes,Monroe,2701005,000413,Strong Memorial Hospital,18 to 29,145,M,White,Not Span/Hispanic,2,Emergency,Home or Self Care,2022,DIG020,Pancreatic disorders (excluding diabetes),,,282,DISORDERS OF PANCREAS EXCEPT MALIGNANCY,07,DISEASES AND DISORDERS OF THE HEPATOBILIARY SYSTEM AND PANCREAS,1,Minor,Minor,Medical,Private Health Insurance,,,,,Y,9903.38,3605.15
Finger Lakes,Monroe,2701005,000413,Strong Memorial Hospital,50 to 69,144,M,White,Not Span/Hispanic,4,Emergency,Home w/ Home Health Services,2022,DIG020,Pancreatic disorders (excluding diabetes),,,282,DISORDERS OF PANCREAS EXCEPT MALIGNANCY,07,DISEASES AND DISORDERS OF THE HEPATOBILIARY SYSTEM AND PANCREAS,2,Moderate,Moderate,Medical,Medicare,Private Health Insurance,,,,Y,23684.99,9030.44
Finger Lakes,Monroe,2701005,000413,Strong Memorial Hospital,30 to 49,146,M,White,Not Span/Hispanic,5,Emergency,Home or Self Care,2022,DIG020,Pancreatic disorders (excluding diabetes),,,282,DISORDERS OF PANCREAS EXCEPT MALIGNANCY,07,DISEASES AND DISORDERS OF THE HEPATOBILIARY SYSTEM AND PANCREAS,2,Moderate,Minor,Medical,Medicare,Medicaid,,,,Y,29049.43,12154.33
New York City,Manhattan,7002053,001463,NYU Langone Hospitals,30 to 49,100,M,White,Not Span/Hispanic,1,Emergency,Home or Self Care,2022,DIG020,Pancreatic disorders (excluding diabetes),,,282,DISORDERS OF PANCREAS EXCEPT MALIGNANCY,07,DISEASES AND DISORDERS OF THE HEPATOBILIARY SYSTEM AND PANCREAS,2,Moderate,Minor,Medical,Private Health Insurance,,,,,Y,36311.80,7932.03
New York City,Manhattan,7002053,001463,NYU Langone Hospitals,30 to 49,110,F,White,Not Span/Hispanic,11,Emergency,Home w/ Home Health Services,2022,INJ036,"Complication of transplanted organs or tissue, initial encounter",ADM003,ADMINISTRATION OF ALBUMIN AND GLOBULIN,282,DISORDERS OF PANCREAS EXCEPT MALIGNANCY,07,DISEASES AND DISORDERS OF THE HEPATOBILIARY SYSTEM AND PANCREAS,4,Extreme,Major,Medical,Medicare,Private Health Insurance,,,,N,640829.59,84138.62
New York City,Manhattan,7002053,001463,NYU Langone Hospitals,30 to 49,100,M,White,Not Span/Hispanic,3,Emergency,Home or Self Care,2022,DIG020,Pancreatic disorders (excluding diabetes),,,282,DISORDERS OF PANCREAS EXCEPT MALIGNANCY,07,DISEASES AND DISORDERS OF THE HEPATOBILIARY SYSTEM AND PANCREAS,2,Moderate,Minor,Medical,Medicaid,,,,,Y,91374.46,25278.78
New York City,Manhattan,7002053,001463,NYU Langone Hospitals,70 or Older,100,M,White,Not Span/Hispanic,6,Emergency,Home or Self Care,2022,DIG020,Pancreatic disorders (excluding diabetes),GIS001,ESOPHAGOGASTRODUODENOSCOPY (EGD) WITH BIOPSY,282,DISORDERS OF PANCREAS EXCEPT MALIGNANCY,07,DISEASES AND DISORDERS OF THE HEPATOBILIARY SYSTEM AND PANCREAS,3,Major,Major,Medical,Medicare,Medicare,,,,Y,125036.45,35948.33
New York City,Manhattan,7002001,001438,Bellevue Hospital Center,30 to 49,112,F,White,Unknown,2,Emergency,Home or Self Care,2022,DIG020,Pancreatic disorders (excluding diabetes),IMG008,ULTRASONOGRAPHY,282,DISORDERS OF PANCREAS EXCEPT MALIGNANCY,07,DISEASES AND DISORDERS OF THE HEPATOBILIARY SYSTEM AND PANCREAS,2,Moderate,Minor,Medical,Medicaid,,,,,Y,19857.79,11419.90
Finger Lakes,Monroe,2701005,000413,Strong Memorial Hospital,50 to 69,146,F,Black/African American,Not Span/Hispanic,1,Emergency,Home or Self Care,2022,DIG020,Pancreatic disorders (excluding diabetes),,,282,DISORDERS OF PANCREAS EXCEPT MALIGNANCY,07,DISEASES AND DISORDERS OF THE HEPATOBILIARY SYSTEM AND PANCREAS,3,Major,Major,Medical,Medicaid,,,,,Y,9319.44,2638.37
Finger Lakes,Monroe,2701005,000413,Strong Memorial Hospital,50 to 69,144,M,White,Not Span/Hispanic,4,Emergency,Home or Self Care,2022,DIG020,Pancreatic disorders (excluding diabetes),,,282,DISORDERS OF PANCREAS EXCEPT MALIGNANCY,07,DISEASES AND DISORDERS OF THE HEPATOBILIARY SYSTEM AND PANCREAS,3,Major,Moderate,Medical,Private Health Insurance,,,,,Y,31814.53,10873.28
New York City,Manhattan,7002053,001463,NYU Langone Hospitals,70 or Older,100,M,White,Not Span/Hispanic,9,Emergency,Home w/ Home Health Services,2022,DIG020,Pancreatic disorders (excluding diabetes),ADM021,"ADMINISTRATION OF THERAPEUTIC SUBSTANCES, NEC",282,DISORDERS OF PANCREAS EXCEPT MALIGNANCY,07,DISEASES AND DISORDERS OF THE HEPATOBILIARY SYSTEM AND PANCREAS,4,Extreme,Extreme,Medical,Medicare,Medicare,,,,Y,254878.65,65015.34
New York City,Manhattan,7002054,001464,New York-Presbyterian Hospital - Columbia Presbyterian Center,30 to 49,104,F,Other Race,Spanish/Hispanic,10,Emergency,Home or Self Care,2022,DIG020,Pancreatic disorders (excluding diabetes),OTR004,ISOLATION PROCEDURES,282,DISORDERS OF PANCREAS EXCEPT MALIGNANCY,07,DISEASES AND DISORDERS OF THE HEPATOBILIARY SYSTEM AND PANCREAS,4,Extreme,Extreme,Medical,Private Health Insurance,,,,,Y,170376.88,36154.17
New York City,Manhattan,7002054,001464,New York-Presbyterian Hospital - Columbia Presbyterian Center,30 to 49,100,F,Other Race,Spanish/Hispanic,3,Emergency,Home or Self Care,2022,DIG020,Pancreatic disorders (excluding diabetes),ADM021,"ADMINISTRATION OF THERAPEUTIC SUBSTANCES, NEC",282,DISORDERS OF PANCREAS EXCEPT MALIGNANCY,07,DISEASES AND DISORDERS OF THE HEPATOBILIARY SYSTEM AND PANCREAS,1,Minor,Minor,Medical,Medicaid,,,,,Y,44600.60,9648.44
New York City,Manhattan,7002054,001464,New York-Presbyterian Hospital - Columbia Presbyterian Center,70 or Older,100,F,Other Race,Spanish/Hispanic,3,Emergency,Home or Self Care,2022,DIG020,Pancreatic disorders (excluding diabetes),ADM017,ADMINISTRATION OF NUTRITIONAL AND ELECTROLYTIC SUBSTANCES,282,DISORDERS OF PANCREAS EXCEPT MALIGNANCY,07,DISEASES AND DISORDERS OF THE HEPATOBILIARY SYSTEM AND PANCREAS,3,Major,Major,Medical,Medicare,Medicaid,,,,Y,51514.60,11400.74
New York City,Manhattan,7002054,001464,New York-Presbyterian Hospital - Columbia Presbyterian Center,30 to 49,105,M,White,Not Span/Hispanic,2,Elective,Home or Self Care,2022,DIG020,Pancreatic disorders (excluding diabetes),GIS027,"UPPER GI THERAPEUTIC PROCEDURES, NEC (ENDOSCOPIC)",282,DISORDERS OF PANCREAS EXCEPT MALIGNANCY,07,DISEASES AND DISORDERS OF THE HEPATOBILIARY SYSTEM AND PANCREAS,2,Moderate,Minor,Medical,Private Health Insurance,,,,,N,45181.67,12572.02
New York City,Manhattan,7002054,001464,New York-Presbyterian Hospital - Columbia Presbyterian Center,30 to 49,125,F,White,Not Span/Hispanic,4,Urgent,Home or Self Care,2022,DIG020,Pancreatic disorders (excluding diabetes),HEP009,PANCREATIC AND PROXIMAL BILIARY DILATION AND STENTING,282,DISORDERS OF PANCREAS EXCEPT MALIGNANCY,07,DISEASES AND DISORDERS OF THE HEPATOBILIARY SYSTEM AND PANCREAS,2,Moderate,Minor,Medical,Private Health Insurance,,,,,N,79536.65,23032.65
New York City,Manhattan,7002054,001464,New York-Presbyterian Hospital - Columbia Presbyterian Center,18 to 29,104,M,White,Spanish/Hispanic,5,Emergency,Home or Self Care,2022,DIG020,Pancreatic disorders (excluding diabetes),,,282,DISORDERS OF PANCREAS EXCEPT MALIGNANCY,07,DISEASES AND DISORDERS OF THE HEPATOBILIARY SYSTEM AND PANCREAS,3,Major,Major,Medical,Medicaid,,,,,Y,92875.93,22767.58
New York City,Manhattan,7002053,001463,NYU Langone Hospitals,30 to 49,113,F,Other Race,Spanish/Hispanic,5,Emergency,Home or Self Care,2022,DIG020,Pancreatic disorders (excluding diabetes),,,282,DISORDERS OF PANCREAS EXCEPT MALIGNANCY,07,DISEASES AND DISORDERS OF THE HEPATOBILIARY SYSTEM AND PANCREAS,2,Moderate,Moderate,Medical,Private Health Insurance,,,,,Y,93934.90,26031.97
New York City,Manhattan,7002053,001463,NYU Langone Hospitals,30 to 49,112,M,White,Not Span/Hispanic,5,Emergency,Psychiatric Hospital or Unit of Hosp,2022,DIG020,Pancreatic disorders (excluding diabetes),,,282,DISORDERS OF PANCREAS EXCEPT MALIGNANCY,07,DISEASES AND DISORDERS OF THE HEPATOBILIARY SYSTEM AND PANCREAS,3,Major,Moderate,Medical,Blue Cross/Blue Shield,,,,,Y,136615.93,34707.32
New York City,Manhattan,7002053,001463,NYU Langone Hospitals,70 or Older,100,M,White,Not Span/Hispanic,3,Emergency,Home or Self Care,2022,DIG020,Pancreatic disorders (excluding diabetes),,,282,DISORDERS OF PANCREAS EXCEPT MALIGNANCY,07,DISEASES AND DISORDERS OF THE HEPATOBILIARY SYSTEM AND PANCREAS,2,Moderate,Moderate,Medical,Medicare,Blue Cross/Blue Shield,,,,Y,73719.68,17780.96
New York City,Manhattan,7002053,001463,NYU Langone Hospitals,50 to 69,100,M,White,Not Span/Hispanic,7,Emergency,Home or Self Care,2022,DIG020,Pancreatic disorders (excluding diabetes),GIS001,ESOPHAGOGASTRODUODENOSCOPY (EGD) WITH BIOPSY,282,DISORDERS OF PANCREAS EXCEPT MALIGNANCY,07,DISEASES AND DISORDERS OF THE HEPATOBILIARY SYSTEM AND PANCREAS,3,Major,Major,Medical,Medicaid,,,,,Y,128790.80,37876.22
New York City,Manhattan,7002053,001463,NYU Langone Hospitals,30 to 49,100,M,Other Race,Not Span/Hispanic,2,Emergency,Home or Self Care,2022,DIG020,Pancreatic disorders (excluding diabetes),OTR004,ISOLATION PROCEDURES,282,DISORDERS OF PANCREAS EXCEPT MALIGNANCY,07,DISEASES AND DISORDERS OF THE HEPATOBILIARY SYSTEM AND PANCREAS,3,Major,Moderate,Medical,Blue Cross/Blue Shield,,,,,Y,40947.09,11859.00