Hospital Service Area,Hospital County,Operating Certificate Number,Permanent Facility Id,Facility Name,Age Group,Zip Code - 3 digits,Gender,Race,Ethnicity,Length of Stay,Type of Admission,Patient Disposition,Discharge Year,CCS Diagnosis Code,CCS Diagnosis Description,CCS Procedure Code,CCS Procedure Description,APR DRG Code,APR DRG Description,APR MDC Code,APR MDC Description,APR Severity of Illness Code,APR Severity of Illness Description,APR Risk of Mortality,APR Medical Surgical Description,Payment Typology 1,Payment Typology 2,Payment Typology 3,Birth Weight,Abortion Edit Indicator,Emergency Department Indicator,Total Charges,Total Costs
New York City,Manhattan,7002054,001464,New York-Presbyterian Hospital - Columbia Presbyterian Center,50 to 69,100,M,White,Spanish/Hispanic,10,Emergency,Skilled Nursing Home,2022,INJ037,"Complication of other surgical or medical care, injury, initial encounter",MST024,BELOW KNEE AMPUTATION,305,AMPUTATION OF LOWER LIMB EXCEPT TOES,08,DISEASES AND DISORDERS OF THE MUSCULOSKELETAL SYSTEM AND CONNECTIVE TISSUE,3,Major,Extreme,Surgical,Medicare,Medicaid,,,,Y,214774.92,60657.01
New York City,Manhattan,7002054,001464,New York-Presbyterian Hospital - Columbia Presbyterian Center,70 or Older,100,F,Other Race,Spanish/Hispanic,11,Urgent,Home or Self Care,2022,END003,Diabetes mellitus with complication,MST025,ABOVE KNEE AND OTHER PROXIMAL LOWER EXTREMITY AMPUTATION,305,AMPUTATION OF LOWER LIMB EXCEPT TOES,08,DISEASES AND DISORDERS OF THE MUSCULOSKELETAL SYSTEM AND CONNECTIVE TISSUE,3,Major,Major,Surgical,Medicare,,,,,Y,198094.18,46217.23
New York City,Manhattan,7002054,001464,New York-Presbyterian Hospital - Columbia Presbyterian Center,70 or Older,100,M,Other Race,Spanish/Hispanic,4,Urgent,Skilled Nursing Home,2022,END003,Diabetes mellitus with complication,MST025,ABOVE KNEE AND OTHER PROXIMAL LOWER EXTREMITY AMPUTATION,305,AMPUTATION OF LOWER LIMB EXCEPT TOES,08,DISEASES AND DISORDERS OF THE MUSCULOSKELETAL SYSTEM AND CONNECTIVE TISSUE,2,Moderate,Moderate,Surgical,Medicare,Medicaid,,,,N,73761.41,18872.41
New York City,Manhattan,7002054,001464,New York-Presbyterian Hospital - Columbia Presbyterian Center,50 to 69,104,M,Other Race,Spanish/Hispanic,4,Urgent,Skilled Nursing Home,2022,INJ037,"Complication of other surgical or medical care, injury, initial encounter",MST023,TOE AND MID FOOT AMPUTATION,305,AMPUTATION OF LOWER LIMB EXCEPT TOES,08,DISEASES AND DISORDERS OF THE MUSCULOSKELETAL SYSTEM AND CONNECTIVE TISSUE,1,Minor,Moderate,Surgical,Medicaid,,,,,N,74101.55,18622.81
New York City,Manhattan,7002054,001464,New York-Presbyterian Hospital - Columbia Presbyterian Center,70 or Older,104,F,Other Race,Spanish/Hispanic,36,Emergency,Home or Self Care,2022,END003,Diabetes mellitus with complication,MST024,BELOW KNEE AMPUTATION,305,AMPUTATION OF LOWER LIMB EXCEPT TOES,08,DISEASES AND DISORDERS OF THE MUSCULOSKELETAL SYSTEM AND CONNECTIVE TISSUE,4,Extreme,Extreme,Surgical,Medicare,Medicaid,,,,Y,875071.50,347681.10
New York City,Manhattan,7002054,001464,New York-Presbyterian Hospital - Columbia Presbyterian Center,70 or Older,104,F,Black/African American,Not Span/Hispanic,11,Elective,Skilled Nursing Home,2022,CIR026,Peripheral and visceral vascular disease,MST025,ABOVE KNEE AND OTHER PROXIMAL LOWER EXTREMITY AMPUTATION,305,AMPUTATION OF LOWER LIMB EXCEPT TOES,08,DISEASES AND DISORDERS OF THE MUSCULOSKELETAL SYSTEM AND CONNECTIVE TISSUE,3,Major,Moderate,Surgical,Medicare,Private Health Insurance,Medicaid,,,N,262887.85,121079.05
New York City,Manhattan,7002054,001464,New York-Presbyterian Hospital - Columbia Presbyterian Center,30 to 49,104,F,Other Race,Spanish/Hispanic,16,Emergency,Inpatient Rehabilitation Facility,2022,NEO024,Sarcoma,CAR028,INFERIOR VENA CAVA (IVC) FILTER PROCEDURES,305,AMPUTATION OF LOWER LIMB EXCEPT TOES,08,DISEASES AND DISORDERS OF THE MUSCULOSKELETAL SYSTEM AND CONNECTIVE TISSUE,4,Extreme,Extreme,Surgical,Medicaid,,,,,Y,456388.49,165055.83
Finger Lakes,Monroe,2701005,000413,Strong Memorial Hospital,50 to 69,147,M,White,Not Span/Hispanic,2,Elective,Home w/ Home Health Services,2022,END003,Diabetes mellitus with complication,MST024,BELOW KNEE AMPUTATION,305,AMPUTATION OF LOWER LIMB EXCEPT TOES,08,DISEASES AND DISORDERS OF THE MUSCULOSKELETAL SYSTEM AND CONNECTIVE TISSUE,2,Moderate,Minor,Surgical,Private Health Insurance,,,,,N,24127.91,12173.34
Finger Lakes,Monroe,2701005,000413,Strong Memorial Hospital,50 to 69,149,F,White,Not Span/Hispanic,13,Urgent,Skilled Nursing Home,2022,INJ037,"Complication of other surgical or medical care, injury, initial encounter",MST025,ABOVE KNEE AND OTHER PROXIMAL LOWER EXTREMITY AMPUTATION,305,AMPUTATION OF LOWER LIMB EXCEPT TOES,08,DISEASES AND DISORDERS OF THE MUSCULOSKELETAL SYSTEM AND CONNECTIVE TISSUE,2,Moderate,Moderate,Surgical,Medicare,Medicaid,,,,N,84533.31,34088.29
New York City,Manhattan,7002053,001463,NYU Langone Hospitals,50 to 69,100,M,Other Race,Spanish/Hispanic,50,Emergency,Inpatient Rehabilitation Facility,2022,END003,Diabetes mellitus with complication,MST024,BELOW KNEE AMPUTATION,305,AMPUTATION OF LOWER LIMB EXCEPT TOES,08,DISEASES AND DISORDERS OF THE MUSCULOSKELETAL SYSTEM AND CONNECTIVE TISSUE,4,Extreme,Extreme,Surgical,Medicare,Medicaid,,,,Y,1196452.71,358940.23
Finger Lakes,Monroe,2701005,000413,Strong Memorial Hospital,50 to 69,144,M,White,Not Span/Hispanic,7,Elective,Home w/ Home Health Services,2022,CIR026,Peripheral and visceral vascular disease,MST024,BELOW KNEE AMPUTATION,305,AMPUTATION OF LOWER LIMB EXCEPT TOES,08,DISEASES AND DISORDERS OF THE MUSCULOSKELETAL SYSTEM AND CONNECTIVE TISSUE,3,Major,Major,Surgical,Medicare,Blue Cross/Blue Shield,,,,N,44315.20,22419.79
New York City,Manhattan,7002053,001463,NYU Langone Hospitals,50 to 69,112,M,Black/African American,Not Span/Hispanic,7,Elective,Home w/ Home Health Services,2022,END003,Diabetes mellitus with complication,MST023,TOE AND MID FOOT AMPUTATION,305,AMPUTATION OF LOWER LIMB EXCEPT TOES,08,DISEASES AND DISORDERS OF THE MUSCULOSKELETAL SYSTEM AND CONNECTIVE TISSUE,3,Major,Major,Surgical,Medicaid,,,,,N,246067.88,49457.37
New York City,Manhattan,7002001,001438,Bellevue Hospital Center,50 to 69,114,M,Other Race,Not Span/Hispanic,20,Urgent,Inpatient Rehabilitation Facility,2022,END003,Diabetes mellitus with complication,MST024,BELOW KNEE AMPUTATION,305,AMPUTATION OF LOWER LIMB EXCEPT TOES,08,DISEASES AND DISORDERS OF THE MUSCULOSKELETAL SYSTEM AND CONNECTIVE TISSUE,4,Extreme,Extreme,Surgical,Medicare,Medicaid,,,,N,192101.41,110474.45
New York City,Manhattan,7002054,001464,New York-Presbyterian Hospital - Columbia Presbyterian Center,50 to 69,100,M,Other Race,Spanish/Hispanic,34,Emergency,Skilled Nursing Home,2022,END003,Diabetes mellitus with complication,MST023,TOE AND MID FOOT AMPUTATION,305,AMPUTATION OF LOWER LIMB EXCEPT TOES,08,DISEASES AND DISORDERS OF THE MUSCULOSKELETAL SYSTEM AND CONNECTIVE TISSUE,4,Extreme,Major,Surgical,Medicaid,,,,,Y,636274.55,150083.97
New York City,Manhattan,7002054,001464,New York-Presbyterian Hospital - Columbia Presbyterian Center,50 to 69,100,M,Other Race,Spanish/Hispanic,15,Emergency,Skilled Nursing Home,2022,END003,Diabetes mellitus with complication,MST024,BELOW KNEE AMPUTATION,305,AMPUTATION OF LOWER LIMB EXCEPT TOES,08,DISEASES AND DISORDERS OF THE MUSCULOSKELETAL SYSTEM AND CONNECTIVE TISSUE,4,Extreme,Major,Surgical,Medicaid,,,,,Y,310201.55,75435.48
New York City,Manhattan,7002054,001464,New York-Presbyterian Hospital - Columbia Presbyterian Center,70 or Older,104,M,Other Race,Unknown,20,Emergency,Skilled Nursing Home,2022,INJ037,"Complication of other surgical or medical care, injury, initial encounter",MST023,TOE AND MID FOOT AMPUTATION,305,AMPUTATION OF LOWER LIMB EXCEPT TOES,08,DISEASES AND DISORDERS OF THE MUSCULOSKELETAL SYSTEM AND CONNECTIVE TISSUE,3,Major,Major,Surgical,Medicare,,,,,Y,375572.33,100511.21
New York City,Manhattan,7002054,001464,New York-Presbyterian Hospital - Columbia Presbyterian Center,50 to 69,107,M,White,Not Span/Hispanic,2,Elective,Home w/ Home Health Services,2022,END003,Diabetes mellitus with complication,MST024,BELOW KNEE AMPUTATION,305,AMPUTATION OF LOWER LIMB EXCEPT TOES,08,DISEASES AND DISORDERS OF THE MUSCULOSKELETAL SYSTEM AND CONNECTIVE TISSUE,2,Moderate,Minor,Surgical,Blue Cross/Blue Shield,,,,,N,58931.08,16191.03
New York City,Manhattan,7002053,001463,NYU Langone Hospitals,70 or Older,112,F,Black/African American,Not Span/Hispanic,19,Emergency,Skilled Nursing Home,2022,INJ037,"Complication of other surgical or medical care, injury, initial encounter",MST024,BELOW KNEE AMPUTATION,305,AMPUTATION OF LOWER LIMB EXCEPT TOES,08,DISEASES AND DISORDERS OF THE MUSCULOSKELETAL SYSTEM AND CONNECTIVE TISSUE,4,Extreme,Major,Surgical,Medicare,Medicaid,,,,Y,438884.14,118910.20
New York City,Manhattan,7002053,001463,NYU Langone Hospitals,70 or Older,OOS,M,White,Not Span/Hispanic,6,Emergency,Skilled Nursing Home,2022,END003,Diabetes mellitus with complication,MST023,TOE AND MID FOOT AMPUTATION,305,AMPUTATION OF LOWER LIMB EXCEPT TOES,08,DISEASES AND DISORDERS OF THE MUSCULOSKELETAL SYSTEM AND CONNECTIVE TISSUE,4,Extreme,Extreme,Surgical,Medicare,Private Health Insurance,,,,Y,186275.52,38030.81
New York City,Manhattan,7002053,001463,NYU Langone Hospitals,50 to 69,104,F,Multi-racial,Not Span/Hispanic,9,Emergency,Skilled Nursing Home,2022,END003,Diabetes mellitus with complication,MST024,BELOW KNEE AMPUTATION,305,AMPUTATION OF LOWER LIMB EXCEPT TOES,08,DISEASES AND DISORDERS OF THE MUSCULOSKELETAL SYSTEM AND CONNECTIVE TISSUE,3,Major,Major,Surgical,Medicare,Blue Cross/Blue Shield,Medicaid,,,Y,224573.73,61447.04
New York City,Manhattan,7002053,001463,NYU Langone Hospitals,50 to 69,112,M,Black/African American,Not Span/Hispanic,1,Emergency,Home or Self Care,2022,END003,Diabetes mellitus with complication,MST023,TOE AND MID FOOT AMPUTATION,305,AMPUTATION OF LOWER LIMB EXCEPT TOES,08,DISEASES AND DISORDERS OF THE MUSCULOSKELETAL SYSTEM AND CONNECTIVE TISSUE,3,Major,Major,Surgical,Medicare,Blue Cross/Blue Shield,,,,Y,42546.18,8533.77
Finger Lakes,Monroe,2701005,000413,Strong Memorial Hospital,30 to 49,145,F,White,Not Span/Hispanic,10,Urgent,Inpatient Rehabilitation Facility,2022,CIR030,Aortic and peripheral arterial embolism or thrombosis,MST025,ABOVE KNEE AND OTHER PROXIMAL LOWER EXTREMITY AMPUTATION,305,AMPUTATION OF LOWER LIMB EXCEPT TOES,08,DISEASES AND DISORDERS OF THE MUSCULOSKELETAL SYSTEM AND CONNECTIVE TISSUE,3,Major,Major,Surgical,Medicaid,,,,,N,70832.61,34009.33
Finger Lakes,Monroe,2701005,000413,Strong Memorial Hospital,70 or Older,146,M,White,Not Span/Hispanic,17,Emergency,Skilled Nursing Home,2022,END003,Diabetes mellitus with complication,MST023,TOE AND MID FOOT AMPUTATION,305,AMPUTATION OF LOWER LIMB EXCEPT TOES,08,DISEASES AND DISORDERS OF THE MUSCULOSKELETAL SYSTEM AND CONNECTIVE TISSUE,3,Major,Major,Surgical,Medicare,,,,,Y,67636.28,35111.13
Finger Lakes,Monroe,2701005,000413,Strong Memorial Hospital,70 or Older,140,F,White,Not Span/Hispanic,16,Urgent,Skilled Nursing Home,2022,NEO024,Sarcoma,MST025,ABOVE KNEE AND OTHER PROXIMAL LOWER EXTREMITY AMPUTATION,305,AMPUTATION OF LOWER LIMB EXCEPT TOES,08,DISEASES AND DISORDERS OF THE MUSCULOSKELETAL SYSTEM AND CONNECTIVE TISSUE,2,Moderate,Moderate,Surgical,Medicare,,,,,N,71422.43,33093.63
Finger Lakes,Monroe,2701005,000413,Strong Memorial Hospital,70 or Older,144,M,White,Not Span/Hispanic,3,Urgent,Home w/ Home Health Services,2022,CIR028,Gangrene,MST023,TOE AND MID FOOT AMPUTATION,305,AMPUTATION OF LOWER LIMB EXCEPT TOES,08,DISEASES AND DISORDERS OF THE MUSCULOSKELETAL SYSTEM AND CONNECTIVE TISSUE,2,Moderate,Moderate,Surgical,Medicare,,,,,N,26735.78,13634.47
Finger Lakes,Monroe,2701005,000413,Strong Memorial Hospital,50 to 69,148,M,White,Not Span/Hispanic,41,Urgent,Skilled Nursing Home,2022,END003,Diabetes mellitus with complication,MST024,BELOW KNEE AMPUTATION,305,AMPUTATION OF LOWER LIMB EXCEPT TOES,08,DISEASES AND DISORDERS OF THE MUSCULOSKELETAL SYSTEM AND CONNECTIVE TISSUE,4,Extreme,Extreme,Surgical,Medicare,Medicaid,,,,N,204773.14,78041.72
Finger Lakes,Monroe,2701005,000413,Strong Memorial Hospital,70 or Older,145,M,White,Not Span/Hispanic,16,Elective,Skilled Nursing Home,2022,CIR026,Peripheral and visceral vascular disease,MST023,TOE AND MID FOOT AMPUTATION,305,AMPUTATION OF LOWER LIMB EXCEPT TOES,08,DISEASES AND DISORDERS OF THE MUSCULOSKELETAL SYSTEM AND CONNECTIVE TISSUE,4,Extreme,Moderate,Surgical,Medicare,,,,,N,207355.75,87436.08
Finger Lakes,Monroe,2701005,000413,Strong Memorial Hospital,30 to 49,144,M,White,Not Span/Hispanic,9,Emergency,Home w/ Home Health Services,2022,MUS013,Osteoporosis,MST023,TOE AND MID FOOT AMPUTATION,305,AMPUTATION OF LOWER LIMB EXCEPT TOES,08,DISEASES AND DISORDERS OF THE MUSCULOSKELETAL SYSTEM AND CONNECTIVE TISSUE,2,Moderate,Minor,Surgical,Medicare,Medicaid,,,,Y,57990.97,24073.06
New York City,Manhattan,7002054,001464,New York-Presbyterian Hospital - Columbia Presbyterian Center,70 or Older,104,M,Other Race,Spanish/Hispanic,16,Emergency,Skilled Nursing Home,2022,END003,Diabetes mellitus with complication,MST024,BELOW KNEE AMPUTATION,305,AMPUTATION OF LOWER LIMB EXCEPT TOES,08,DISEASES AND DISORDERS OF THE MUSCULOSKELETAL SYSTEM AND CONNECTIVE TISSUE,2,Moderate,Moderate,Surgical,Medicare,Medicaid,,,,Y,258735.85,61971.08
New York City,Manhattan,7002054,001464,New York-Presbyterian Hospital - Columbia Presbyterian Center,30 to 49,109,M,White,Not Span/Hispanic,7,Elective,Skilled Nursing Home,2022,MUS032,Neurogenic/neuropathic arthropathy,MST024,BELOW KNEE AMPUTATION,305,AMPUTATION OF LOWER LIMB EXCEPT TOES,08,DISEASES AND DISORDERS OF THE MUSCULOSKELETAL SYSTEM AND CONNECTIVE TISSUE,3,Major,Major,Surgical,Medicare,,,,,N,137256.89,35243.25
New York City,Manhattan,7002001,001438,Bellevue Hospital Center,50 to 69,111,M,Other Race,Unknown,29,Emergency,Inpatient Rehabilitation Facility,2022,END003,Diabetes mellitus with complication,MST024,BELOW KNEE AMPUTATION,305,AMPUTATION OF LOWER LIMB EXCEPT TOES,08,DISEASES AND DISORDERS OF THE MUSCULOSKELETAL SYSTEM AND CONNECTIVE TISSUE,3,Major,Major,Surgical,Medicaid,,,,,Y,266100.03,153029.87
New York City,Manhattan,7002053,001463,NYU Langone Hospitals,70 or Older,112,F,Black/African American,Not Span/Hispanic,11,Emergency,Inpatient Rehabilitation Facility,2022,INJ037,"Complication of other surgical or medical care, injury, initial encounter",MST024,BELOW KNEE AMPUTATION,305,AMPUTATION OF LOWER LIMB EXCEPT TOES,08,DISEASES AND DISORDERS OF THE MUSCULOSKELETAL SYSTEM AND CONNECTIVE TISSUE,3,Major,Major,Surgical,Medicare,Medicaid,,,,Y,257596.14,63765.83
New York City,Manhattan,7002053,001463,NYU Langone Hospitals,70 or Older,100,M,White,Spanish/Hispanic,7,Emergency,Home w/ Home Health Services,2022,END003,Diabetes mellitus with complication,MST024,BELOW KNEE AMPUTATION,305,AMPUTATION OF LOWER LIMB EXCEPT TOES,08,DISEASES AND DISORDERS OF THE MUSCULOSKELETAL SYSTEM AND CONNECTIVE TISSUE,3,Major,Major,Surgical,Medicare,Medicaid,,,,Y,175514.85,51310.09
New York City,Manhattan,7002054,001464,New York-Presbyterian Hospital - Columbia Presbyterian Center,70 or Older,104,M,Other Race,Spanish/Hispanic,12,Urgent,Home w/ Home Health Services,2022,INJ037,"Complication of other surgical or medical care, injury, initial encounter",MST025,ABOVE KNEE AND OTHER PROXIMAL LOWER EXTREMITY AMPUTATION,305,AMPUTATION OF LOWER LIMB EXCEPT TOES,08,DISEASES AND DISORDERS OF THE MUSCULOSKELETAL SYSTEM AND CONNECTIVE TISSUE,3,Major,Major,Surgical,Medicare,,,,,N,291691.03,98809.72
New York City,Manhattan,7002054,001464,New York-Presbyterian Hospital - Columbia Presbyterian Center,30 to 49,104,F,Black/African American,Not Span/Hispanic,11,Emergency,Home w/ Home Health Services,2022,END003,Diabetes mellitus with complication,MST023,TOE AND MID FOOT AMPUTATION,305,AMPUTATION OF LOWER LIMB EXCEPT TOES,08,DISEASES AND DISORDERS OF THE MUSCULOSKELETAL SYSTEM AND CONNECTIVE TISSUE,2,Moderate,Major,Surgical,Medicaid,,,,,Y,169638.07,39195.43
New York City,Manhattan,7002054,001464,New York-Presbyterian Hospital - Columbia Presbyterian Center,30 to 49,100,M,Black/African American,Not Span/Hispanic,6,Emergency,Skilled Nursing Home,2022,END003,Diabetes mellitus with complication,MST023,TOE AND MID FOOT AMPUTATION,305,AMPUTATION OF LOWER LIMB EXCEPT TOES,08,DISEASES AND DISORDERS OF THE MUSCULOSKELETAL SYSTEM AND CONNECTIVE TISSUE,2,Moderate,Moderate,Surgical,Medicaid,,,,,Y,147148.51,51891.12
New York City,Manhattan,7002054,001464,New York-Presbyterian Hospital - Columbia Presbyterian Center,50 to 69,100,F,Multi-racial,Spanish/Hispanic,22,Emergency,Skilled Nursing Home,2022,END003,Diabetes mellitus with complication,MST024,BELOW KNEE AMPUTATION,305,AMPUTATION OF LOWER LIMB EXCEPT TOES,08,DISEASES AND DISORDERS OF THE MUSCULOSKELETAL SYSTEM AND CONNECTIVE TISSUE,3,Major,Major,Surgical,Medicaid,,,,,Y,402681.50,98830.93
Long Island,Nassau,2951001,000541,North Shore University Hospital,50 to 69,113,M,Other Race,Not Span/Hispanic,10,Emergency,Home or Self Care,2022,END003,Diabetes mellitus with complication,MST001,ARTHROCENTESIS,305,AMPUTATION OF LOWER LIMB EXCEPT TOES,08,DISEASES AND DISORDERS OF THE MUSCULOSKELETAL SYSTEM AND CONNECTIVE TISSUE,3,Major,Major,Surgical,Medicaid,Medicaid,,,,Y,143067.23,23487.79
Long Island,Nassau,2951001,000541,North Shore University Hospital,50 to 69,110,M,White,Not Span/Hispanic,18,Emergency,Home w/ Home Health Services,2022,SKN004,Non-pressure ulcer of skin,CAR008,ANGIOPLASTY AND RELATED VESSEL PROCEDURES (ENDOVASCULAR; EXCLUDING CAROTID),305,AMPUTATION OF LOWER LIMB EXCEPT TOES,08,DISEASES AND DISORDERS OF THE MUSCULOSKELETAL SYSTEM AND CONNECTIVE TISSUE,4,Extreme,Moderate,Surgical,Medicaid,,,,,Y,350084.81,58028.76
Long Island,Nassau,2951001,000541,North Shore University Hospital,70 or Older,110,M,White,Not Span/Hispanic,8,Emergency,Home w/ Home Health Services,2022,END003,Diabetes mellitus with complication,MST023,TOE AND MID FOOT AMPUTATION,305,AMPUTATION OF LOWER LIMB EXCEPT TOES,08,DISEASES AND DISORDERS OF THE MUSCULOSKELETAL SYSTEM AND CONNECTIVE TISSUE,3,Major,Major,Surgical,Medicare,Medicare,,,,Y,111478.83,19609.58
Long Island,Nassau,2951001,000541,North Shore University Hospital,70 or Older,113,M,White,Not Span/Hispanic,16,Emergency,Skilled Nursing Home,2022,END003,Diabetes mellitus with complication,MST023,TOE AND MID FOOT AMPUTATION,305,AMPUTATION OF LOWER LIMB EXCEPT TOES,08,DISEASES AND DISORDERS OF THE MUSCULOSKELETAL SYSTEM AND CONNECTIVE TISSUE,3,Major,Major,Surgical,Medicare,,,,,Y,226459.44,39783.49
Long Island,Nassau,2951001,000541,North Shore University Hospital,50 to 69,112,M,White,Spanish/Hispanic,10,Emergency,Home or Self Care,2022,END003,Diabetes mellitus with complication,MST023,TOE AND MID FOOT AMPUTATION,305,AMPUTATION OF LOWER LIMB EXCEPT TOES,08,DISEASES AND DISORDERS OF THE MUSCULOSKELETAL SYSTEM AND CONNECTIVE TISSUE,3,Major,Minor,Surgical,Blue Cross/Blue Shield,,,,,Y,143705.96,24350.85
Long Island,Nassau,2951001,000541,North Shore University Hospital,70 or Older,113,M,Other Race,Spanish/Hispanic,7,Emergency,Home w/ Home Health Services,2022,END003,Diabetes mellitus with complication,MST023,TOE AND MID FOOT AMPUTATION,305,AMPUTATION OF LOWER LIMB EXCEPT TOES,08,DISEASES AND DISORDERS OF THE MUSCULOSKELETAL SYSTEM AND CONNECTIVE TISSUE,2,Moderate,Major,Surgical,Medicaid,Medicaid,,,,Y,120884.11,20164.20
Finger Lakes,Monroe,2701005,000413,Strong Memorial Hospital,50 to 69,144,M,White,Not Span/Hispanic,31,Emergency,Home or Self Care,2022,END003,Diabetes mellitus with complication,MST024,BELOW KNEE AMPUTATION,305,AMPUTATION OF LOWER LIMB EXCEPT TOES,08,DISEASES AND DISORDERS OF THE MUSCULOSKELETAL SYSTEM AND CONNECTIVE TISSUE,3,Major,Major,Surgical,Medicare,Medicaid,,,,Y,113976.43,56589.75
Finger Lakes,Monroe,2701005,000413,Strong Memorial Hospital,50 to 69,145,M,White,Not Span/Hispanic,6,Emergency,Home w/ Home Health Services,2022,END003,Diabetes mellitus with complication,MST023,TOE AND MID FOOT AMPUTATION,305,AMPUTATION OF LOWER LIMB EXCEPT TOES,08,DISEASES AND DISORDERS OF THE MUSCULOSKELETAL SYSTEM AND CONNECTIVE TISSUE,3,Major,Major,Surgical,Medicare,Blue Cross/Blue Shield,,,,Y,60487.28,21133.34
Finger Lakes,Monroe,2701005,000413,Strong Memorial Hospital,50 to 69,146,M,White,Not Span/Hispanic,26,Emergency,Home w/ Home Health Services,2022,INJ033,"Complication of cardiovascular device, implant or graft, initial encounter",MST025,ABOVE KNEE AND OTHER PROXIMAL LOWER EXTREMITY AMPUTATION,305,AMPUTATION OF LOWER LIMB EXCEPT TOES,08,DISEASES AND DISORDERS OF THE MUSCULOSKELETAL SYSTEM AND CONNECTIVE TISSUE,3,Major,Major,Surgical,Medicaid,,,,,Y,101922.19,47334.08
New York City,Manhattan,7002053,001463,NYU Langone Hospitals,70 or Older,113,M,Other Race,Spanish/Hispanic,10,Emergency,Skilled Nursing Home,2022,INJ037,"Complication of other surgical or medical care, injury, initial encounter",CAR008,ANGIOPLASTY AND RELATED VESSEL PROCEDURES (ENDOVASCULAR; EXCLUDING CAROTID),305,AMPUTATION OF LOWER LIMB EXCEPT TOES,08,DISEASES AND DISORDERS OF THE MUSCULOSKELETAL SYSTEM AND CONNECTIVE TISSUE,4,Extreme,Major,Surgical,Medicare,,,,,Y,414421.21,80778.93
New York City,Manhattan,7002054,001464,New York-Presbyterian Hospital - Columbia Presbyterian Center,50 to 69,104,F,Other Race,Spanish/Hispanic,10,Emergency,Skilled Nursing Home,2022,END003,Diabetes mellitus with complication,CAR008,ANGIOPLASTY AND RELATED VESSEL PROCEDURES (ENDOVASCULAR; EXCLUDING CAROTID),305,AMPUTATION OF LOWER LIMB EXCEPT TOES,08,DISEASES AND DISORDERS OF THE MUSCULOSKELETAL SYSTEM AND CONNECTIVE TISSUE,3,Major,Major,Surgical,Medicaid,,,,,Y,216121.22,57721.53
Hudson Valley,Dutchess,1302001,000181,Vassar Brothers Medical Center,50 to 69,125,M,White,Spanish/Hispanic,10,Emergency,Home w/ Home Health Services,2022,END003,Diabetes mellitus with complication,MST023,TOE AND MID FOOT AMPUTATION,305,AMPUTATION OF LOWER LIMB EXCEPT TOES,08,DISEASES AND DISORDERS OF THE MUSCULOSKELETAL SYSTEM AND CONNECTIVE TISSUE,3,Major,Moderate,Surgical,Medicare,Medicaid,,,,Y,64535.29,23477.10
New York City,Manhattan,7002001,001438,Bellevue Hospital Center,50 to 69,100,M,Black/African American,Unknown,28,Emergency,Skilled Nursing Home,2022,INJ037,"Complication of other surgical or medical care, injury, initial encounter",MST025,ABOVE KNEE AND OTHER PROXIMAL LOWER EXTREMITY AMPUTATION,305,AMPUTATION OF LOWER LIMB EXCEPT TOES,08,DISEASES AND DISORDERS OF THE MUSCULOSKELETAL SYSTEM AND CONNECTIVE TISSUE,4,Extreme,Major,Surgical,Medicaid,,,,,Y,255564.26,146970.92
Capital/Adirond,Warren,5601000,001005,Glens Falls Hospital,70 or Older,128,M,White,Not Span/Hispanic,8,Emergency,Home w/ Home Health Services,2022,MUS002,Osteomyelitis,MST023,TOE AND MID FOOT AMPUTATION,305,AMPUTATION OF LOWER LIMB EXCEPT TOES,08,DISEASES AND DISORDERS OF THE MUSCULOSKELETAL SYSTEM AND CONNECTIVE TISSUE,2,Moderate,Minor,Surgical,Medicare,Self-Pay,,,,Y,35098.91,13568.99
Capital/Adirond,Warren,5601000,001005,Glens Falls Hospital,50 to 69,128,M,White,Not Span/Hispanic,5,Emergency,Home or Self Care,2022,END003,Diabetes mellitus with complication,MST023,TOE AND MID FOOT AMPUTATION,305,AMPUTATION OF LOWER LIMB EXCEPT TOES,08,DISEASES AND DISORDERS OF THE MUSCULOSKELETAL SYSTEM AND CONNECTIVE TISSUE,2,Moderate,Minor,Surgical,Blue Cross/Blue Shield,,,,,Y,34313.34,12044.27
Capital/Adirond,Warren,5601000,001005,Glens Falls Hospital,70 or Older,128,F,White,Not Span/Hispanic,15,Emergency,Home w/ Home Health Services,2022,END003,Diabetes mellitus with complication,MST023,TOE AND MID FOOT AMPUTATION,305,AMPUTATION OF LOWER LIMB EXCEPT TOES,08,DISEASES AND DISORDERS OF THE MUSCULOSKELETAL SYSTEM AND CONNECTIVE TISSUE,3,Major,Extreme,Surgical,Medicare,,,,,Y,93121.46,39582.64