Hospital Service Area,Hospital County,Operating Certificate Number,Permanent Facility Id,Facility Name,Age Group,Zip Code - 3 digits,Gender,Race,Ethnicity,Length of Stay,Type of Admission,Patient Disposition,Discharge Year,CCS Diagnosis Code,CCS Diagnosis Description,CCS Procedure Code,CCS Procedure Description,APR DRG Code,APR DRG Description,APR MDC Code,APR MDC Description,APR Severity of Illness Code,APR Severity of Illness Description,APR Risk of Mortality,APR Medical Surgical Description,Payment Typology 1,Payment Typology 2,Payment Typology 3,Birth Weight,Abortion Edit Indicator,Emergency Department Indicator,Total Charges,Total Costs
New York City,Manhattan,7002054,001464,New York-Presbyterian Hospital - Columbia Presbyterian Center,50 to 69,100,F,White,Not Span/Hispanic,2,Emergency,Home w/ Home Health Services,2022,INJ005,"Fracture of the lower limb (except hip), initial encounter",MST011,FIXATION OF LEG AND FOOT BONES,313,KNEE AND LOWER LEG PROCEDURES EXCEPT FOOT,08,DISEASES AND DISORDERS OF THE MUSCULOSKELETAL SYSTEM AND CONNECTIVE TISSUE,1,Minor,Minor,Surgical,Medicaid,,,,,Y,58729.13,
New York City,Manhattan,7002054,001464,New York-Presbyterian Hospital - Columbia Presbyterian Center,30 to 49,104,F,Other Race,Unknown,1,Emergency,Home or Self Care,2022,INJ005,"Fracture of the lower limb (except hip), initial encounter",MST011,FIXATION OF LEG AND FOOT BONES,313,KNEE AND LOWER LEG PROCEDURES EXCEPT FOOT,08,DISEASES AND DISORDERS OF THE MUSCULOSKELETAL SYSTEM AND CONNECTIVE TISSUE,1,Minor,Minor,Surgical,Private Health Insurance,,,,,Y,91731.33,32885.39
New York City,Manhattan,7002001,001438,Bellevue Hospital Center,18 to 29,100,M,Other Race,Unknown,4,Elective,Home or Self Care,2022,INJ005,"Fracture of the lower limb (except hip), initial encounter",MST011,FIXATION OF LEG AND FOOT BONES,313,KNEE AND LOWER LEG PROCEDURES EXCEPT FOOT,08,DISEASES AND DISORDERS OF THE MUSCULOSKELETAL SYSTEM AND CONNECTIVE TISSUE,3,Major,Minor,Surgical,Private Health Insurance,,,,,N,82371.12,47370.31
New York City,Manhattan,7002001,001438,Bellevue Hospital Center,70 or Older,100,F,White,Unknown,4,Emergency,Skilled Nursing Home,2022,INJ005,"Fracture of the lower limb (except hip), initial encounter",MST011,FIXATION OF LEG AND FOOT BONES,313,KNEE AND LOWER LEG PROCEDURES EXCEPT FOOT,08,DISEASES AND DISORDERS OF THE MUSCULOSKELETAL SYSTEM AND CONNECTIVE TISSUE,2,Moderate,Minor,Surgical,Medicare,Private Health Insurance,,,,Y,62570.97,35983.56
New York City,Manhattan,7002054,001464,New York-Presbyterian Hospital - Columbia Presbyterian Center,0 to 17,103,M,Other Race,Unknown,1,Elective,Home or Self Care,2022,INJ007,"Dislocations, initial encounter",MST018,BONE EXCISION,313,KNEE AND LOWER LEG PROCEDURES EXCEPT FOOT,08,DISEASES AND DISORDERS OF THE MUSCULOSKELETAL SYSTEM AND CONNECTIVE TISSUE,1,Minor,Minor,Surgical,Private Health Insurance,Medicaid,,,,N,58447.27,19433.89
New York City,Manhattan,7002001,001438,Bellevue Hospital Center,0 to 17,113,M,Other Race,Unknown,21,Elective,Home or Self Care,2022,MUS002,Osteomyelitis,MST004,INCISION AND DRAINAGE OF MUSCULOSKELETAL TISSUE AND JOINTS,313,KNEE AND LOWER LEG PROCEDURES EXCEPT FOOT,08,DISEASES AND DISORDERS OF THE MUSCULOSKELETAL SYSTEM AND CONNECTIVE TISSUE,3,Major,Moderate,Surgical,Medicaid,,,,,N,175316.17,100821.52
New York City,Manhattan,7002001,001438,Bellevue Hospital Center,50 to 69,OOS,F,White,Spanish/Hispanic,3,Emergency,Home w/ Home Health Services,2022,INJ005,"Fracture of the lower limb (except hip), initial encounter",MST011,FIXATION OF LEG AND FOOT BONES,313,KNEE AND LOWER LEG PROCEDURES EXCEPT FOOT,08,DISEASES AND DISORDERS OF THE MUSCULOSKELETAL SYSTEM AND CONNECTIVE TISSUE,2,Moderate,Minor,Surgical,Private Health Insurance,,,,,Y,47850.82,27518.24
New York City,Manhattan,7002001,001438,Bellevue Hospital Center,0 to 17,113,M,Other Race,Spanish/Hispanic,1,Urgent,Home or Self Care,2022,INJ005,"Fracture of the lower limb (except hip), initial encounter",MST011,FIXATION OF LEG AND FOOT BONES,313,KNEE AND LOWER LEG PROCEDURES EXCEPT FOOT,08,DISEASES AND DISORDERS OF THE MUSCULOSKELETAL SYSTEM AND CONNECTIVE TISSUE,2,Moderate,Minor,Surgical,Medicaid,,,,,N,17758.97,10212.90
New York City,Manhattan,7002054,001464,New York-Presbyterian Hospital - Columbia Presbyterian Center,0 to 17,104,F,Other Race,Spanish/Hispanic,1,Elective,Home or Self Care,2022,MUS023,Acquired deformities (excluding foot),MST011,FIXATION OF LEG AND FOOT BONES,313,KNEE AND LOWER LEG PROCEDURES EXCEPT FOOT,08,DISEASES AND DISORDERS OF THE MUSCULOSKELETAL SYSTEM AND CONNECTIVE TISSUE,1,Minor,Minor,Surgical,Private Health Insurance,,,,,N,50084.89,17351.28
New York City,Manhattan,7002054,001464,New York-Presbyterian Hospital - Columbia Presbyterian Center,50 to 69,104,F,White,Not Span/Hispanic,3,Emergency,Home or Self Care,2022,INJ005,"Fracture of the lower limb (except hip), initial encounter",MST011,FIXATION OF LEG AND FOOT BONES,313,KNEE AND LOWER LEG PROCEDURES EXCEPT FOOT,08,DISEASES AND DISORDERS OF THE MUSCULOSKELETAL SYSTEM AND CONNECTIVE TISSUE,1,Minor,Minor,Surgical,Medicare,,,,,Y,97981.92,30392.39
New York City,Manhattan,7002001,001438,Bellevue Hospital Center,30 to 49,112,M,White,Unknown,2,Emergency,Home or Self Care,2022,INJ005,"Fracture of the lower limb (except hip), initial encounter",MST011,FIXATION OF LEG AND FOOT BONES,313,KNEE AND LOWER LEG PROCEDURES EXCEPT FOOT,08,DISEASES AND DISORDERS OF THE MUSCULOSKELETAL SYSTEM AND CONNECTIVE TISSUE,1,Minor,Minor,Surgical,Medicare,,,,,Y,48936.31,28142.49
New York City,Manhattan,7002054,001464,New York-Presbyterian Hospital - Columbia Presbyterian Center,50 to 69,100,M,White,Spanish/Hispanic,2,Emergency,Home w/ Home Health Services,2022,INJ005,"Fracture of the lower limb (except hip), initial encounter",MST011,FIXATION OF LEG AND FOOT BONES,313,KNEE AND LOWER LEG PROCEDURES EXCEPT FOOT,08,DISEASES AND DISORDERS OF THE MUSCULOSKELETAL SYSTEM AND CONNECTIVE TISSUE,1,Minor,Minor,Surgical,Medicaid,,,,,Y,70854.83,19878.13
New York City,Manhattan,7002054,001464,New York-Presbyterian Hospital - Columbia Presbyterian Center,0 to 17,113,M,Other Race,Not Span/Hispanic,1,Elective,Home or Self Care,2022,MAL008,Musculoskeletal congenital conditions,MST011,FIXATION OF LEG AND FOOT BONES,313,KNEE AND LOWER LEG PROCEDURES EXCEPT FOOT,08,DISEASES AND DISORDERS OF THE MUSCULOSKELETAL SYSTEM AND CONNECTIVE TISSUE,1,Minor,Minor,Surgical,Medicaid,,,,,N,53136.50,
Finger Lakes,Monroe,2701005,000413,Strong Memorial Hospital,50 to 69,145,M,White,Not Span/Hispanic,9,Emergency,Skilled Nursing Home,2022,INJ005,"Fracture of the lower limb (except hip), initial encounter",MST011,FIXATION OF LEG AND FOOT BONES,313,KNEE AND LOWER LEG PROCEDURES EXCEPT FOOT,08,DISEASES AND DISORDERS OF THE MUSCULOSKELETAL SYSTEM AND CONNECTIVE TISSUE,2,Moderate,Minor,Surgical,Medicare,Medicaid,,,,Y,54423.21,27549.39
Finger Lakes,Monroe,2701005,000413,Strong Memorial Hospital,0 to 17,144,M,White,Not Span/Hispanic,1,Emergency,Home or Self Care,2022,INJ005,"Fracture of the lower limb (except hip), initial encounter",MST011,FIXATION OF LEG AND FOOT BONES,313,KNEE AND LOWER LEG PROCEDURES EXCEPT FOOT,08,DISEASES AND DISORDERS OF THE MUSCULOSKELETAL SYSTEM AND CONNECTIVE TISSUE,1,Minor,Minor,Surgical,Blue Cross/Blue Shield,,,,,Y,23562.23,10137.95
Finger Lakes,Monroe,2701005,000413,Strong Memorial Hospital,18 to 29,144,F,White,Not Span/Hispanic,3,Emergency,Home or Self Care,2022,INJ005,"Fracture of the lower limb (except hip), initial encounter",MST011,FIXATION OF LEG AND FOOT BONES,313,KNEE AND LOWER LEG PROCEDURES EXCEPT FOOT,08,DISEASES AND DISORDERS OF THE MUSCULOSKELETAL SYSTEM AND CONNECTIVE TISSUE,2,Moderate,Minor,Surgical,Self-Pay,,,,,Y,34652.47,16071.31
Finger Lakes,Monroe,2701005,000413,Strong Memorial Hospital,18 to 29,146,M,Black/African American,Not Span/Hispanic,4,Emergency,Home w/ Home Health Services,2022,INJ035,"Complication of internal orthopedic device or implant, initial encounter",MST018,BONE EXCISION,313,KNEE AND LOWER LEG PROCEDURES EXCEPT FOOT,08,DISEASES AND DISORDERS OF THE MUSCULOSKELETAL SYSTEM AND CONNECTIVE TISSUE,2,Moderate,Minor,Surgical,Medicaid,,,,,Y,47635.83,22026.09
Finger Lakes,Monroe,2701005,000413,Strong Memorial Hospital,18 to 29,146,F,White,Spanish/Hispanic,1,Emergency,Home or Self Care,2022,INJ005,"Fracture of the lower limb (except hip), initial encounter",MST011,FIXATION OF LEG AND FOOT BONES,313,KNEE AND LOWER LEG PROCEDURES EXCEPT FOOT,08,DISEASES AND DISORDERS OF THE MUSCULOSKELETAL SYSTEM AND CONNECTIVE TISSUE,1,Minor,Minor,Surgical,Medicaid,,,,,Y,35093.97,15481.53
Finger Lakes,Monroe,2701005,000413,Strong Memorial Hospital,50 to 69,146,M,White,Not Span/Hispanic,5,Emergency,Home w/ Home Health Services,2022,INJ005,"Fracture of the lower limb (except hip), initial encounter",MST011,FIXATION OF LEG AND FOOT BONES,313,KNEE AND LOWER LEG PROCEDURES EXCEPT FOOT,08,DISEASES AND DISORDERS OF THE MUSCULOSKELETAL SYSTEM AND CONNECTIVE TISSUE,2,Moderate,Minor,Surgical,Medicaid,,,,,Y,43489.74,18755.71
Finger Lakes,Monroe,2701005,000413,Strong Memorial Hospital,50 to 69,146,M,Black/African American,Not Span/Hispanic,4,Emergency,Home or Self Care,2022,INJ005,"Fracture of the lower limb (except hip), initial encounter",MST011,FIXATION OF LEG AND FOOT BONES,313,KNEE AND LOWER LEG PROCEDURES EXCEPT FOOT,08,DISEASES AND DISORDERS OF THE MUSCULOSKELETAL SYSTEM AND CONNECTIVE TISSUE,2,Moderate,Moderate,Surgical,Medicaid,,,,,Y,49385.66,20060.54
Finger Lakes,Monroe,2701005,000413,Strong Memorial Hospital,50 to 69,144,F,White,Not Span/Hispanic,5,Emergency,Skilled Nursing Home,2022,INJ005,"Fracture of the lower limb (except hip), initial encounter",MST011,FIXATION OF LEG AND FOOT BONES,313,KNEE AND LOWER LEG PROCEDURES EXCEPT FOOT,08,DISEASES AND DISORDERS OF THE MUSCULOSKELETAL SYSTEM AND CONNECTIVE TISSUE,2,Moderate,Minor,Surgical,Medicare,Medicaid,,,,Y,46495.60,22124.63
Finger Lakes,Monroe,2701005,000413,Strong Memorial Hospital,30 to 49,145,F,White,Not Span/Hispanic,4,Emergency,Home or Self Care,2022,INJ005,"Fracture of the lower limb (except hip), initial encounter",MST011,FIXATION OF LEG AND FOOT BONES,313,KNEE AND LOWER LEG PROCEDURES EXCEPT FOOT,08,DISEASES AND DISORDERS OF THE MUSCULOSKELETAL SYSTEM AND CONNECTIVE TISSUE,2,Moderate,Moderate,Surgical,Medicare,,,,,Y,42283.57,20133.91
Finger Lakes,Monroe,2701005,000413,Strong Memorial Hospital,50 to 69,144,F,White,Not Span/Hispanic,11,Emergency,Home w/ Home Health Services,2022,INJ005,"Fracture of the lower limb (except hip), initial encounter",MST030,"MUSCULOSKELETAL PROCEDURES, NEC",313,KNEE AND LOWER LEG PROCEDURES EXCEPT FOOT,08,DISEASES AND DISORDERS OF THE MUSCULOSKELETAL SYSTEM AND CONNECTIVE TISSUE,2,Moderate,Minor,Surgical,Miscellaneous/Other,Medicaid,,,,Y,45547.33,22872.74
Finger Lakes,Monroe,2701005,000413,Strong Memorial Hospital,50 to 69,148,M,White,Not Span/Hispanic,1,Elective,Skilled Nursing Home,2022,MUS006,Osteoarthritis,MST014,JOINT FUSION (EXCLUDING SPINE),313,KNEE AND LOWER LEG PROCEDURES EXCEPT FOOT,08,DISEASES AND DISORDERS OF THE MUSCULOSKELETAL SYSTEM AND CONNECTIVE TISSUE,1,Minor,Minor,Surgical,Medicaid,,,,,N,54423.02,25294.04
Finger Lakes,Monroe,2701005,000413,Strong Memorial Hospital,70 or Older,148,M,White,Not Span/Hispanic,5,Emergency,Home w/ Home Health Services,2022,MUS013,Osteoporosis,MST011,FIXATION OF LEG AND FOOT BONES,313,KNEE AND LOWER LEG PROCEDURES EXCEPT FOOT,08,DISEASES AND DISORDERS OF THE MUSCULOSKELETAL SYSTEM AND CONNECTIVE TISSUE,2,Moderate,Moderate,Surgical,Medicare,Private Health Insurance,,,,Y,54538.90,25749.76
Finger Lakes,Monroe,2701005,000413,Strong Memorial Hospital,18 to 29,144,M,White,Not Span/Hispanic,1,Elective,Home or Self Care,2022,INJ005,"Fracture of the lower limb (except hip), initial encounter",MST011,FIXATION OF LEG AND FOOT BONES,313,KNEE AND LOWER LEG PROCEDURES EXCEPT FOOT,08,DISEASES AND DISORDERS OF THE MUSCULOSKELETAL SYSTEM AND CONNECTIVE TISSUE,1,Minor,Minor,Surgical,Medicaid,,,,,N,25494.92,12564.13
Finger Lakes,Monroe,2701005,000413,Strong Memorial Hospital,30 to 49,144,M,White,Not Span/Hispanic,1,Emergency,Home or Self Care,2022,INJ005,"Fracture of the lower limb (except hip), initial encounter",MST011,FIXATION OF LEG AND FOOT BONES,313,KNEE AND LOWER LEG PROCEDURES EXCEPT FOOT,08,DISEASES AND DISORDERS OF THE MUSCULOSKELETAL SYSTEM AND CONNECTIVE TISSUE,1,Minor,Minor,Surgical,Private Health Insurance,,,,,Y,30526.93,13334.34
Finger Lakes,Monroe,2701005,000413,Strong Memorial Hospital,18 to 29,145,M,White,Not Span/Hispanic,2,Emergency,Home or Self Care,2022,INJ005,"Fracture of the lower limb (except hip), initial encounter",MST011,FIXATION OF LEG AND FOOT BONES,313,KNEE AND LOWER LEG PROCEDURES EXCEPT FOOT,08,DISEASES AND DISORDERS OF THE MUSCULOSKELETAL SYSTEM AND CONNECTIVE TISSUE,1,Minor,Minor,Surgical,Blue Cross/Blue Shield,,,,,Y,36594.23,17035.48
Finger Lakes,Monroe,2701005,000413,Strong Memorial Hospital,50 to 69,144,F,White,Not Span/Hispanic,4,Elective,Home w/ Home Health Services,2022,MUS006,Osteoarthritis,MST014,JOINT FUSION (EXCLUDING SPINE),313,KNEE AND LOWER LEG PROCEDURES EXCEPT FOOT,08,DISEASES AND DISORDERS OF THE MUSCULOSKELETAL SYSTEM AND CONNECTIVE TISSUE,2,Moderate,Minor,Surgical,Miscellaneous/Other,Blue Cross/Blue Shield,,,,N,59996.36,30253.03
Finger Lakes,Monroe,2701005,000413,Strong Memorial Hospital,30 to 49,146,M,White,Not Span/Hispanic,3,Emergency,Home or Self Care,2022,INJ005,"Fracture of the lower limb (except hip), initial encounter",MST011,FIXATION OF LEG AND FOOT BONES,313,KNEE AND LOWER LEG PROCEDURES EXCEPT FOOT,08,DISEASES AND DISORDERS OF THE MUSCULOSKELETAL SYSTEM AND CONNECTIVE TISSUE,1,Minor,Minor,Surgical,Miscellaneous/Other,Private Health Insurance,,,,Y,40612.49,19091.66
Finger Lakes,Monroe,2701005,000413,Strong Memorial Hospital,50 to 69,145,F,White,Not Span/Hispanic,4,Emergency,Home or Self Care,2022,INJ005,"Fracture of the lower limb (except hip), initial encounter",MST011,FIXATION OF LEG AND FOOT BONES,313,KNEE AND LOWER LEG PROCEDURES EXCEPT FOOT,08,DISEASES AND DISORDERS OF THE MUSCULOSKELETAL SYSTEM AND CONNECTIVE TISSUE,2,Moderate,Minor,Surgical,Medicaid,,,,,Y,38743.15,18323.26
Finger Lakes,Monroe,2701005,000413,Strong Memorial Hospital,30 to 49,147,M,White,Not Span/Hispanic,3,Emergency,Home or Self Care,2022,INJ005,"Fracture of the lower limb (except hip), initial encounter",MST011,FIXATION OF LEG AND FOOT BONES,313,KNEE AND LOWER LEG PROCEDURES EXCEPT FOOT,08,DISEASES AND DISORDERS OF THE MUSCULOSKELETAL SYSTEM AND CONNECTIVE TISSUE,2,Moderate,Moderate,Surgical,Private Health Insurance,,,,,Y,42428.03,19648.45
Finger Lakes,Monroe,2701005,000413,Strong Memorial Hospital,50 to 69,144,F,White,Not Span/Hispanic,18,Emergency,Skilled Nursing Home,2022,INJ005,"Fracture of the lower limb (except hip), initial encounter",MST011,FIXATION OF LEG AND FOOT BONES,313,KNEE AND LOWER LEG PROCEDURES EXCEPT FOOT,08,DISEASES AND DISORDERS OF THE MUSCULOSKELETAL SYSTEM AND CONNECTIVE TISSUE,4,Extreme,Extreme,Surgical,Miscellaneous/Other,Medicare,Medicaid,,,Y,137117.34,55620.97
Finger Lakes,Monroe,2701005,000413,Strong Memorial Hospital,70 or Older,145,F,White,Not Span/Hispanic,2,Elective,Skilled Nursing Home,2022,MUS006,Osteoarthritis,MST008,ARTHROPLASTY OF OTHER JOINT (EXCLUDING KNEE AND HIP),313,KNEE AND LOWER LEG PROCEDURES EXCEPT FOOT,08,DISEASES AND DISORDERS OF THE MUSCULOSKELETAL SYSTEM AND CONNECTIVE TISSUE,2,Moderate,Minor,Surgical,Medicare,,,,,N,70526.96,34380.15
Finger Lakes,Monroe,2701005,000413,Strong Memorial Hospital,18 to 29,144,M,White,Not Span/Hispanic,2,Emergency,Home or Self Care,2022,INJ005,"Fracture of the lower limb (except hip), initial encounter",MST011,FIXATION OF LEG AND FOOT BONES,313,KNEE AND LOWER LEG PROCEDURES EXCEPT FOOT,08,DISEASES AND DISORDERS OF THE MUSCULOSKELETAL SYSTEM AND CONNECTIVE TISSUE,2,Moderate,Minor,Surgical,Private Health Insurance,,,,,Y,34901.00,15939.45
New York City,Manhattan,7002001,001438,Bellevue Hospital Center,50 to 69,100,F,Other Race,Spanish/Hispanic,8,Emergency,Court/Law Enforcement,2022,INJ005,"Fracture of the lower limb (except hip), initial encounter",MST011,FIXATION OF LEG AND FOOT BONES,313,KNEE AND LOWER LEG PROCEDURES EXCEPT FOOT,08,DISEASES AND DISORDERS OF THE MUSCULOSKELETAL SYSTEM AND CONNECTIVE TISSUE,2,Moderate,Minor,Surgical,Private Health Insurance,,,,,Y,85709.83,49290.35
New York City,Manhattan,7002001,001438,Bellevue Hospital Center,18 to 29,112,M,Other Race,Spanish/Hispanic,2,Emergency,Home or Self Care,2022,INJ005,"Fracture of the lower limb (except hip), initial encounter",MST011,FIXATION OF LEG AND FOOT BONES,313,KNEE AND LOWER LEG PROCEDURES EXCEPT FOOT,08,DISEASES AND DISORDERS OF THE MUSCULOSKELETAL SYSTEM AND CONNECTIVE TISSUE,1,Minor,Minor,Surgical,Medicaid,,,,,Y,37808.47,21743.05
New York City,Manhattan,7002001,001438,Bellevue Hospital Center,50 to 69,100,M,Other Race,Spanish/Hispanic,12,Emergency,Home or Self Care,2022,INJ005,"Fracture of the lower limb (except hip), initial encounter",MST011,FIXATION OF LEG AND FOOT BONES,313,KNEE AND LOWER LEG PROCEDURES EXCEPT FOOT,08,DISEASES AND DISORDERS OF THE MUSCULOSKELETAL SYSTEM AND CONNECTIVE TISSUE,2,Moderate,Minor,Surgical,Medicaid,,,,,Y,144030.77,82829.79
Finger Lakes,Monroe,2701005,000413,Strong Memorial Hospital,30 to 49,146,M,Black/African American,Not Span/Hispanic,1,Elective,Home or Self Care,2022,INJ042,"Fracture of lower limb (except hip), subsequent encounter",MST029,"MUSCULOSKELETAL DEVICE PROCEDURES, NEC",313,KNEE AND LOWER LEG PROCEDURES EXCEPT FOOT,08,DISEASES AND DISORDERS OF THE MUSCULOSKELETAL SYSTEM AND CONNECTIVE TISSUE,1,Minor,Minor,Surgical,Medicaid,,,,,N,37267.23,17779.52
Finger Lakes,Monroe,2701005,000413,Strong Memorial Hospital,50 to 69,146,F,Black/African American,Not Span/Hispanic,6,Emergency,Home w/ Home Health Services,2022,INJ005,"Fracture of the lower limb (except hip), initial encounter",MST011,FIXATION OF LEG AND FOOT BONES,313,KNEE AND LOWER LEG PROCEDURES EXCEPT FOOT,08,DISEASES AND DISORDERS OF THE MUSCULOSKELETAL SYSTEM AND CONNECTIVE TISSUE,2,Moderate,Moderate,Surgical,Medicare,Medicaid,,,,Y,41371.20,
Finger Lakes,Monroe,2701005,000413,Strong Memorial Hospital,50 to 69,144,F,White,Unknown,3,Emergency,Home w/ Home Health Services,2022,MUS013,Osteoporosis,MST011,FIXATION OF LEG AND FOOT BONES,313,KNEE AND LOWER LEG PROCEDURES EXCEPT FOOT,08,DISEASES AND DISORDERS OF THE MUSCULOSKELETAL SYSTEM AND CONNECTIVE TISSUE,3,Major,Minor,Surgical,Private Health Insurance,,,,,Y,54011.01,22528.62
Finger Lakes,Monroe,2701005,000413,Strong Memorial Hospital,50 to 69,144,M,White,Not Span/Hispanic,3,Emergency,Home or Self Care,2022,INJ005,"Fracture of the lower limb (except hip), initial encounter",MST011,FIXATION OF LEG AND FOOT BONES,313,KNEE AND LOWER LEG PROCEDURES EXCEPT FOOT,08,DISEASES AND DISORDERS OF THE MUSCULOSKELETAL SYSTEM AND CONNECTIVE TISSUE,1,Minor,Minor,Surgical,Private Health Insurance,,,,,Y,42999.63,19891.59
Finger Lakes,Monroe,2701005,000413,Strong Memorial Hospital,70 or Older,146,F,White,Not Span/Hispanic,5,Emergency,Home w/ Home Health Services,2022,INJ005,"Fracture of the lower limb (except hip), initial encounter",MST011,FIXATION OF LEG AND FOOT BONES,313,KNEE AND LOWER LEG PROCEDURES EXCEPT FOOT,08,DISEASES AND DISORDERS OF THE MUSCULOSKELETAL SYSTEM AND CONNECTIVE TISSUE,1,Minor,Moderate,Surgical,Miscellaneous/Other,Medicare,Medicaid,,,Y,37271.70,17772.68
New York City,Manhattan,7002001,001438,Bellevue Hospital Center,50 to 69,100,M,White,Unknown,5,Emergency,Home or Self Care,2022,INJ005,"Fracture of the lower limb (except hip), initial encounter",MST008,ARTHROPLASTY OF OTHER JOINT (EXCLUDING KNEE AND HIP),313,KNEE AND LOWER LEG PROCEDURES EXCEPT FOOT,08,DISEASES AND DISORDERS OF THE MUSCULOSKELETAL SYSTEM AND CONNECTIVE TISSUE,2,Moderate,Moderate,Surgical,Medicare,,,,,Y,64532.14,37111.40
New York City,Manhattan,7002053,001463,NYU Langone Hospitals,18 to 29,112,F,Other Race,Not Span/Hispanic,8,Emergency,Home w/ Home Health Services,2022,INJ035,"Complication of internal orthopedic device or implant, initial encounter",MST018,BONE EXCISION,313,KNEE AND LOWER LEG PROCEDURES EXCEPT FOOT,08,DISEASES AND DISORDERS OF THE MUSCULOSKELETAL SYSTEM AND CONNECTIVE TISSUE,2,Moderate,Minor,Surgical,Medicaid,,,,,Y,191288.81,51263.22
New York City,Manhattan,7002001,001438,Bellevue Hospital Center,18 to 29,100,F,Other Race,Unknown,2,Emergency,Home or Self Care,2022,INJ005,"Fracture of the lower limb (except hip), initial encounter",MST011,FIXATION OF LEG AND FOOT BONES,313,KNEE AND LOWER LEG PROCEDURES EXCEPT FOOT,08,DISEASES AND DISORDERS OF THE MUSCULOSKELETAL SYSTEM AND CONNECTIVE TISSUE,2,Moderate,Minor,Surgical,Medicaid,,,,,Y,45029.02,25895.47
New York City,Manhattan,7002001,001438,Bellevue Hospital Center,30 to 49,112,M,Other Race,Unknown,2,Emergency,Home w/ Home Health Services,2022,INJ005,"Fracture of the lower limb (except hip), initial encounter",MST011,FIXATION OF LEG AND FOOT BONES,313,KNEE AND LOWER LEG PROCEDURES EXCEPT FOOT,08,DISEASES AND DISORDERS OF THE MUSCULOSKELETAL SYSTEM AND CONNECTIVE TISSUE,2,Moderate,Minor,Surgical,Miscellaneous/Other,Medicaid,,,,Y,34246.34,19694.52
New York City,Manhattan,7002001,001438,Bellevue Hospital Center,30 to 49,,M,Multi-racial,Unknown,2,Emergency,Home or Self Care,2022,INJ005,"Fracture of the lower limb (except hip), initial encounter",MST020,SUBCUTANEOUS TISSUE AND FASCIA EXCISION,313,KNEE AND LOWER LEG PROCEDURES EXCEPT FOOT,08,DISEASES AND DISORDERS OF THE MUSCULOSKELETAL SYSTEM AND CONNECTIVE TISSUE,2,Moderate,Minor,Surgical,Miscellaneous/Other,,,,,Y,26793.30,15408.40
New York City,Manhattan,7002001,001438,Bellevue Hospital Center,30 to 49,104,F,Black/African American,Unknown,9,Emergency,Home w/ Home Health Services,2022,INJ035,"Complication of internal orthopedic device or implant, initial encounter",MST014,JOINT FUSION (EXCLUDING SPINE),313,KNEE AND LOWER LEG PROCEDURES EXCEPT FOOT,08,DISEASES AND DISORDERS OF THE MUSCULOSKELETAL SYSTEM AND CONNECTIVE TISSUE,4,Extreme,Minor,Surgical,Medicaid,,,,,Y,112395.32,64636.75
Finger Lakes,Monroe,2701005,000413,Strong Memorial Hospital,70 or Older,144,F,White,Not Span/Hispanic,6,Emergency,Skilled Nursing Home,2022,INJ005,"Fracture of the lower limb (except hip), initial encounter",MST011,FIXATION OF LEG AND FOOT BONES,313,KNEE AND LOWER LEG PROCEDURES EXCEPT FOOT,08,DISEASES AND DISORDERS OF THE MUSCULOSKELETAL SYSTEM AND CONNECTIVE TISSUE,3,Major,Moderate,Surgical,Medicare,,,,,Y,43352.55,20301.27
Finger Lakes,Monroe,2701005,000413,Strong Memorial Hospital,30 to 49,146,F,White,Not Span/Hispanic,1,Emergency,Home or Self Care,2022,INJ005,"Fracture of the lower limb (except hip), initial encounter",MST011,FIXATION OF LEG AND FOOT BONES,313,KNEE AND LOWER LEG PROCEDURES EXCEPT FOOT,08,DISEASES AND DISORDERS OF THE MUSCULOSKELETAL SYSTEM AND CONNECTIVE TISSUE,2,Moderate,Moderate,Surgical,Medicaid,,,,,Y,32945.83,14545.59
Finger Lakes,Monroe,2701005,000413,Strong Memorial Hospital,30 to 49,146,F,White,Not Span/Hispanic,3,Emergency,Home or Self Care,2022,INJ005,"Fracture of the lower limb (except hip), initial encounter",MST011,FIXATION OF LEG AND FOOT BONES,313,KNEE AND LOWER LEG PROCEDURES EXCEPT FOOT,08,DISEASES AND DISORDERS OF THE MUSCULOSKELETAL SYSTEM AND CONNECTIVE TISSUE,1,Minor,Minor,Surgical,Miscellaneous/Other,Blue Cross/Blue Shield,,,,Y,32619.22,15386.37
Finger Lakes,Monroe,2701005,000413,Strong Memorial Hospital,30 to 49,144,M,White,Not Span/Hispanic,3,Urgent,Home w/ Home Health Services,2022,INJ037,"Complication of other surgical or medical care, injury, initial encounter",MST018,BONE EXCISION,313,KNEE AND LOWER LEG PROCEDURES EXCEPT FOOT,08,DISEASES AND DISORDERS OF THE MUSCULOSKELETAL SYSTEM AND CONNECTIVE TISSUE,3,Major,Major,Surgical,Medicare,Medicaid,,,,N,30362.24,14610.55