Hospital Service Area,Hospital County,Operating Certificate Number,Permanent Facility Id,Facility Name,Age Group,Zip Code - 3 digits,Gender,Race,Ethnicity,Length of Stay,Type of Admission,Patient Disposition,Discharge Year,CCS Diagnosis Code,CCS Diagnosis Description,CCS Procedure Code,CCS Procedure Description,APR DRG Code,APR DRG Description,APR MDC Code,APR MDC Description,APR Severity of Illness Code,APR Severity of Illness Description,APR Risk of Mortality,APR Medical Surgical Description,Payment Typology 1,Payment Typology 2,Payment Typology 3,Birth Weight,Abortion Edit Indicator,Emergency Department Indicator,Total Charges,Total Costs
New York City,Manhattan,7002054,001464,New York-Presbyterian Hospital - Columbia Presbyterian Center,50 to 69,OOS,F,Other Race,Unknown,1,Elective,Home or Self Care,2022,NEO030,Breast cancer - all other types,LYM002,LYMPH NODE EXCISION (THERAPEUTIC),362,MASTECTOMY PROCEDURES,09,"DISEASES AND DISORDERS OF THE SKIN, SUBCUTANEOUS TISSUE AND BREAST",2,Moderate,Minor,Surgical,Private Health Insurance,,,,,N,83517.89,28768.95
New York City,Manhattan,7002054,001464,New York-Presbyterian Hospital - Columbia Presbyterian Center,70 or Older,OOS,F,White,Not Span/Hispanic,1,Elective,Home w/ Home Health Services,2022,NEO030,Breast cancer - all other types,SKB003,MASTECTOMY AND LUMPECTOMY,362,MASTECTOMY PROCEDURES,09,"DISEASES AND DISORDERS OF THE SKIN, SUBCUTANEOUS TISSUE AND BREAST",2,Moderate,Minor,Surgical,Medicare,Private Health Insurance,,,,N,63267.21,21429.42
New York City,Manhattan,7002054,001464,New York-Presbyterian Hospital - Columbia Presbyterian Center,50 to 69,100,F,White,Spanish/Hispanic,4,Elective,Home or Self Care,2022,NEO029,Breast cancer - ductal carcinoma in situ (DCIS),SKB003,MASTECTOMY AND LUMPECTOMY,362,MASTECTOMY PROCEDURES,09,"DISEASES AND DISORDERS OF THE SKIN, SUBCUTANEOUS TISSUE AND BREAST",4,Extreme,Extreme,Surgical,Medicaid,,,,,N,231619.26,77066.11
New York City,Manhattan,7002001,001438,Bellevue Hospital Center,50 to 69,114,F,Other Race,Spanish/Hispanic,1,Elective,Home or Self Care,2022,NEO029,Breast cancer - ductal carcinoma in situ (DCIS),SKB003,MASTECTOMY AND LUMPECTOMY,362,MASTECTOMY PROCEDURES,09,"DISEASES AND DISORDERS OF THE SKIN, SUBCUTANEOUS TISSUE AND BREAST",1,Minor,Minor,Surgical,Private Health Insurance,,,,,N,43373.77,24943.56
New York City,Manhattan,7002001,001438,Bellevue Hospital Center,50 to 69,112,F,Black/African American,Unknown,1,Elective,Home or Self Care,2022,NEO029,Breast cancer - ductal carcinoma in situ (DCIS),SKB003,MASTECTOMY AND LUMPECTOMY,362,MASTECTOMY PROCEDURES,09,"DISEASES AND DISORDERS OF THE SKIN, SUBCUTANEOUS TISSUE AND BREAST",2,Moderate,Minor,Surgical,Medicaid,,,,,N,72836.63,41887.18
New York City,Manhattan,7002053,001463,NYU Langone Hospitals,18 to 29,109,F,White,Not Span/Hispanic,1,Elective,Home or Self Care,2022,FAC004,Encounter for prophylactic or other procedures,SKB003,MASTECTOMY AND LUMPECTOMY,362,MASTECTOMY PROCEDURES,09,"DISEASES AND DISORDERS OF THE SKIN, SUBCUTANEOUS TISSUE AND BREAST",2,Moderate,Minor,Surgical,Blue Cross/Blue Shield,,,,,N,134801.58,21799.12
New York City,Manhattan,7002053,001463,NYU Langone Hospitals,50 to 69,110,F,Other Race,Not Span/Hispanic,1,Elective,Home w/ Home Health Services,2022,NEO030,Breast cancer - all other types,SKB003,MASTECTOMY AND LUMPECTOMY,362,MASTECTOMY PROCEDURES,09,"DISEASES AND DISORDERS OF THE SKIN, SUBCUTANEOUS TISSUE AND BREAST",2,Moderate,Minor,Surgical,Medicare,,,,,N,172582.73,26262.05
New York City,Manhattan,7002053,001463,NYU Langone Hospitals,30 to 49,112,F,White,Not Span/Hispanic,3,Elective,Home w/ Home Health Services,2022,FAC004,Encounter for prophylactic or other procedures,SKB004,BREAST RECONSTRUCTION,362,MASTECTOMY PROCEDURES,09,"DISEASES AND DISORDERS OF THE SKIN, SUBCUTANEOUS TISSUE AND BREAST",1,Minor,Minor,Surgical,Blue Cross/Blue Shield,,,,,N,162653.35,31424.54
New York City,Manhattan,7002053,001463,NYU Langone Hospitals,30 to 49,111,F,White,Not Span/Hispanic,1,Elective,Home or Self Care,2022,NEO030,Breast cancer - all other types,SKB003,MASTECTOMY AND LUMPECTOMY,362,MASTECTOMY PROCEDURES,09,"DISEASES AND DISORDERS OF THE SKIN, SUBCUTANEOUS TISSUE AND BREAST",2,Moderate,Minor,Surgical,Blue Cross/Blue Shield,,,,,N,138346.93,22338.07
New York City,Manhattan,7002001,001438,Bellevue Hospital Center,50 to 69,100,F,Black/African American,Unknown,1,Elective,Home or Self Care,2022,NEO029,Breast cancer - ductal carcinoma in situ (DCIS),SKB003,MASTECTOMY AND LUMPECTOMY,362,MASTECTOMY PROCEDURES,09,"DISEASES AND DISORDERS OF THE SKIN, SUBCUTANEOUS TISSUE AND BREAST",2,Moderate,Minor,Surgical,Medicaid,,,,,N,40142.10,23085.08
New York City,Manhattan,7002001,001438,Bellevue Hospital Center,50 to 69,116,F,Other Race,Spanish/Hispanic,1,Elective,Home or Self Care,2022,NEO030,Breast cancer - all other types,SKB003,MASTECTOMY AND LUMPECTOMY,362,MASTECTOMY PROCEDURES,09,"DISEASES AND DISORDERS OF THE SKIN, SUBCUTANEOUS TISSUE AND BREAST",1,Minor,Moderate,Surgical,Medicare,Medicaid,,,,N,22485.06,12930.80
New York City,Manhattan,7002054,001464,New York-Presbyterian Hospital - Columbia Presbyterian Center,30 to 49,104,F,Other Race,Spanish/Hispanic,1,Elective,Home or Self Care,2022,NEO030,Breast cancer - all other types,SKB003,MASTECTOMY AND LUMPECTOMY,362,MASTECTOMY PROCEDURES,09,"DISEASES AND DISORDERS OF THE SKIN, SUBCUTANEOUS TISSUE AND BREAST",2,Moderate,Moderate,Surgical,Medicaid,,,,,N,66926.94,22259.27
New York City,Manhattan,7002054,001464,New York-Presbyterian Hospital - Columbia Presbyterian Center,50 to 69,104,F,Other Race,Unknown,1,Elective,Home or Self Care,2022,NEO029,Breast cancer - ductal carcinoma in situ (DCIS),SKB004,BREAST RECONSTRUCTION,362,MASTECTOMY PROCEDURES,09,"DISEASES AND DISORDERS OF THE SKIN, SUBCUTANEOUS TISSUE AND BREAST",2,Moderate,Minor,Surgical,Medicaid,,,,,N,130614.33,
New York City,Manhattan,7002054,001464,New York-Presbyterian Hospital - Columbia Presbyterian Center,30 to 49,100,F,White,Not Span/Hispanic,1,Elective,Home or Self Care,2022,SYM017,Abnormal findings without diagnosis,SKB003,MASTECTOMY AND LUMPECTOMY,362,MASTECTOMY PROCEDURES,09,"DISEASES AND DISORDERS OF THE SKIN, SUBCUTANEOUS TISSUE AND BREAST",2,Moderate,Minor,Surgical,Private Health Insurance,,,,,N,84799.80,27954.86
New York City,Manhattan,7002054,001464,New York-Presbyterian Hospital - Columbia Presbyterian Center,50 to 69,104,F,Other Race,Spanish/Hispanic,1,Elective,Home or Self Care,2022,NEO030,Breast cancer - all other types,SKB003,MASTECTOMY AND LUMPECTOMY,362,MASTECTOMY PROCEDURES,09,"DISEASES AND DISORDERS OF THE SKIN, SUBCUTANEOUS TISSUE AND BREAST",2,Moderate,Minor,Surgical,Medicaid,,,,,N,75478.62,24839.07
New York City,Manhattan,7002054,001464,New York-Presbyterian Hospital - Columbia Presbyterian Center,30 to 49,100,F,Other Race,Spanish/Hispanic,1,Elective,Home or Self Care,2022,NEO030,Breast cancer - all other types,SKB003,MASTECTOMY AND LUMPECTOMY,362,MASTECTOMY PROCEDURES,09,"DISEASES AND DISORDERS OF THE SKIN, SUBCUTANEOUS TISSUE AND BREAST",2,Moderate,Minor,Surgical,Private Health Insurance,,,,,N,111696.27,
New York City,Manhattan,7002053,001463,NYU Langone Hospitals,30 to 49,112,F,Black/African American,Not Span/Hispanic,1,Elective,Home w/ Home Health Services,2022,NEO030,Breast cancer - all other types,SKB003,MASTECTOMY AND LUMPECTOMY,362,MASTECTOMY PROCEDURES,09,"DISEASES AND DISORDERS OF THE SKIN, SUBCUTANEOUS TISSUE AND BREAST",1,Minor,Moderate,Surgical,Private Health Insurance,,,,,N,133444.22,21175.28
New York City,Manhattan,7002053,001463,NYU Langone Hospitals,30 to 49,112,F,Black/African American,Spanish/Hispanic,3,Elective,Home w/ Home Health Services,2022,NEO030,Breast cancer - all other types,SKB003,MASTECTOMY AND LUMPECTOMY,362,MASTECTOMY PROCEDURES,09,"DISEASES AND DISORDERS OF THE SKIN, SUBCUTANEOUS TISSUE AND BREAST",2,Moderate,Minor,Surgical,Private Health Insurance,Blue Cross/Blue Shield,,,,N,172139.90,32254.65
New York City,Manhattan,7002053,001463,NYU Langone Hospitals,50 to 69,105,F,White,Not Span/Hispanic,4,Elective,Home w/ Home Health Services,2022,FAC004,Encounter for prophylactic or other procedures,SKB003,MASTECTOMY AND LUMPECTOMY,362,MASTECTOMY PROCEDURES,09,"DISEASES AND DISORDERS OF THE SKIN, SUBCUTANEOUS TISSUE AND BREAST",2,Moderate,Moderate,Surgical,Blue Cross/Blue Shield,,,,,N,164227.14,34588.87
New York City,Manhattan,7002053,001463,NYU Langone Hospitals,50 to 69,OOS,F,Other Race,Not Span/Hispanic,1,Elective,Home w/ Home Health Services,2022,NEO029,Breast cancer - ductal carcinoma in situ (DCIS),SKB003,MASTECTOMY AND LUMPECTOMY,362,MASTECTOMY PROCEDURES,09,"DISEASES AND DISORDERS OF THE SKIN, SUBCUTANEOUS TISSUE AND BREAST",2,Moderate,Minor,Surgical,Medicare,Blue Cross/Blue Shield,,,,N,220108.85,28272.96
New York City,Manhattan,7002054,001464,New York-Presbyterian Hospital - Columbia Presbyterian Center,50 to 69,112,F,Other Race,Spanish/Hispanic,1,Elective,Home or Self Care,2022,NEO029,Breast cancer - ductal carcinoma in situ (DCIS),SKB003,MASTECTOMY AND LUMPECTOMY,362,MASTECTOMY PROCEDURES,09,"DISEASES AND DISORDERS OF THE SKIN, SUBCUTANEOUS TISSUE AND BREAST",2,Moderate,Minor,Surgical,Medicare,Medicaid,,,,N,69616.11,22768.44
New York City,Manhattan,7002054,001464,New York-Presbyterian Hospital - Columbia Presbyterian Center,30 to 49,109,F,Other Race,Not Span/Hispanic,1,Elective,Home or Self Care,2022,NEO030,Breast cancer - all other types,SKB003,MASTECTOMY AND LUMPECTOMY,362,MASTECTOMY PROCEDURES,09,"DISEASES AND DISORDERS OF THE SKIN, SUBCUTANEOUS TISSUE AND BREAST",1,Minor,Moderate,Surgical,Private Health Insurance,,,,,N,71572.16,22560.79
New York City,Manhattan,7002054,001464,New York-Presbyterian Hospital - Columbia Presbyterian Center,30 to 49,104,F,Other Race,Spanish/Hispanic,1,Elective,Home or Self Care,2022,NEO030,Breast cancer - all other types,SKB003,MASTECTOMY AND LUMPECTOMY,362,MASTECTOMY PROCEDURES,09,"DISEASES AND DISORDERS OF THE SKIN, SUBCUTANEOUS TISSUE AND BREAST",2,Moderate,Moderate,Surgical,Private Health Insurance,,,,,N,74319.19,25126.42
New York City,Manhattan,7002054,001464,New York-Presbyterian Hospital - Columbia Presbyterian Center,30 to 49,OOS,F,Other Race,Unknown,1,Elective,Home or Self Care,2022,NEO030,Breast cancer - all other types,SKB003,MASTECTOMY AND LUMPECTOMY,362,MASTECTOMY PROCEDURES,09,"DISEASES AND DISORDERS OF THE SKIN, SUBCUTANEOUS TISSUE AND BREAST",2,Moderate,Minor,Surgical,Private Health Insurance,,,,,N,114559.93,40607.01
New York City,Manhattan,7002001,001438,Bellevue Hospital Center,50 to 69,104,F,Other Race,Spanish/Hispanic,1,Elective,Home w/ Home Health Services,2022,NEO030,Breast cancer - all other types,SKB003,MASTECTOMY AND LUMPECTOMY,362,MASTECTOMY PROCEDURES,09,"DISEASES AND DISORDERS OF THE SKIN, SUBCUTANEOUS TISSUE AND BREAST",1,Minor,Moderate,Surgical,Self-Pay,,,,,N,57128.92,32853.93
New York City,Manhattan,7002053,001463,NYU Langone Hospitals,30 to 49,112,F,White,Not Span/Hispanic,3,Elective,Home w/ Home Health Services,2022,NEO029,Breast cancer - ductal carcinoma in situ (DCIS),SKB003,MASTECTOMY AND LUMPECTOMY,362,MASTECTOMY PROCEDURES,09,"DISEASES AND DISORDERS OF THE SKIN, SUBCUTANEOUS TISSUE AND BREAST",2,Moderate,Minor,Surgical,Blue Cross/Blue Shield,,,,,N,201903.73,36547.53
New York City,Manhattan,7002053,001463,NYU Langone Hospitals,70 or Older,100,F,White,Not Span/Hispanic,2,Elective,Home w/ Home Health Services,2022,NEO030,Breast cancer - all other types,SKB003,MASTECTOMY AND LUMPECTOMY,362,MASTECTOMY PROCEDURES,09,"DISEASES AND DISORDERS OF THE SKIN, SUBCUTANEOUS TISSUE AND BREAST",1,Minor,Moderate,Surgical,Medicare,,,,,N,83621.18,17588.05
New York City,Manhattan,7002001,001438,Bellevue Hospital Center,30 to 49,113,F,Other Race,Spanish/Hispanic,5,Elective,Home w/ Home Health Services,2022,NEO029,Breast cancer - ductal carcinoma in situ (DCIS),SKB003,MASTECTOMY AND LUMPECTOMY,362,MASTECTOMY PROCEDURES,09,"DISEASES AND DISORDERS OF THE SKIN, SUBCUTANEOUS TISSUE AND BREAST",2,Moderate,Minor,Surgical,Private Health Insurance,,,,,N,79697.66,45832.85
New York City,Manhattan,7002054,001464,New York-Presbyterian Hospital - Columbia Presbyterian Center,50 to 69,100,F,Black/African American,Not Span/Hispanic,2,Elective,Home w/ Home Health Services,2022,NEO030,Breast cancer - all other types,SKB003,MASTECTOMY AND LUMPECTOMY,362,MASTECTOMY PROCEDURES,09,"DISEASES AND DISORDERS OF THE SKIN, SUBCUTANEOUS TISSUE AND BREAST",2,Moderate,Moderate,Surgical,Medicare,,,,,N,160448.03,61051.97
New York City,Manhattan,7002054,001464,New York-Presbyterian Hospital - Columbia Presbyterian Center,70 or Older,104,F,Other Race,Spanish/Hispanic,1,Elective,Home w/ Home Health Services,2022,NEO029,Breast cancer - ductal carcinoma in situ (DCIS),SKB003,MASTECTOMY AND LUMPECTOMY,362,MASTECTOMY PROCEDURES,09,"DISEASES AND DISORDERS OF THE SKIN, SUBCUTANEOUS TISSUE AND BREAST",2,Moderate,Minor,Surgical,Medicaid,,,,,N,64015.37,
New York City,Manhattan,7002054,001464,New York-Presbyterian Hospital - Columbia Presbyterian Center,50 to 69,105,F,Multi-racial,Not Span/Hispanic,1,Elective,Home or Self Care,2022,NEO030,Breast cancer - all other types,SKB003,MASTECTOMY AND LUMPECTOMY,362,MASTECTOMY PROCEDURES,09,"DISEASES AND DISORDERS OF THE SKIN, SUBCUTANEOUS TISSUE AND BREAST",1,Minor,Minor,Surgical,Private Health Insurance,,,,,N,70594.36,22167.36
New York City,Manhattan,7002054,001464,New York-Presbyterian Hospital - Columbia Presbyterian Center,50 to 69,104,F,Black/African American,Not Span/Hispanic,2,Elective,Home w/ Home Health Services,2022,NEO029,Breast cancer - ductal carcinoma in situ (DCIS),SKB003,MASTECTOMY AND LUMPECTOMY,362,MASTECTOMY PROCEDURES,09,"DISEASES AND DISORDERS OF THE SKIN, SUBCUTANEOUS TISSUE AND BREAST",2,Moderate,Minor,Surgical,Medicaid,,,,,N,78361.95,25262.13
Long Island,Nassau,2951001,000541,North Shore University Hospital,50 to 69,118,F,White,Not Span/Hispanic,3,Elective,Home w/ Home Health Services,2022,NEO070,Secondary malignancies,LYM003,LYMPH NODE DISSECTION,362,MASTECTOMY PROCEDURES,09,"DISEASES AND DISORDERS OF THE SKIN, SUBCUTANEOUS TISSUE AND BREAST",2,Moderate,Minor,Surgical,Blue Cross/Blue Shield,,,,,N,139507.19,26922.33
New York City,Manhattan,7002054,001464,New York-Presbyterian Hospital - Columbia Presbyterian Center,30 to 49,,F,Multi-racial,Not Span/Hispanic,1,Elective,Home or Self Care,2022,NEO030,Breast cancer - all other types,SKB003,MASTECTOMY AND LUMPECTOMY,362,MASTECTOMY PROCEDURES,09,"DISEASES AND DISORDERS OF THE SKIN, SUBCUTANEOUS TISSUE AND BREAST",2,Moderate,Minor,Surgical,Private Health Insurance,,,,,N,98687.25,36838.41
New York City,Manhattan,7002054,001464,New York-Presbyterian Hospital - Columbia Presbyterian Center,50 to 69,100,F,Other Race,Unknown,1,Elective,Home or Self Care,2022,NEO029,Breast cancer - ductal carcinoma in situ (DCIS),SKB003,MASTECTOMY AND LUMPECTOMY,362,MASTECTOMY PROCEDURES,09,"DISEASES AND DISORDERS OF THE SKIN, SUBCUTANEOUS TISSUE AND BREAST",2,Moderate,Minor,Surgical,Private Health Insurance,,,,,N,86473.50,29088.95
Capital/Adirond,Warren,5601000,001005,Glens Falls Hospital,50 to 69,128,F,Other Race,Unknown,1,Elective,Home or Self Care,2022,NEO030,Breast cancer - all other types,SKB003,MASTECTOMY AND LUMPECTOMY,362,MASTECTOMY PROCEDURES,09,"DISEASES AND DISORDERS OF THE SKIN, SUBCUTANEOUS TISSUE AND BREAST",1,Minor,Minor,Surgical,Private Health Insurance,,,,,N,50771.52,18114.85
Capital/Adirond,Warren,5601000,001005,Glens Falls Hospital,30 to 49,128,F,White,Not Span/Hispanic,1,Elective,Home or Self Care,2022,NEO029,Breast cancer - ductal carcinoma in situ (DCIS),SKB003,MASTECTOMY AND LUMPECTOMY,362,MASTECTOMY PROCEDURES,09,"DISEASES AND DISORDERS OF THE SKIN, SUBCUTANEOUS TISSUE AND BREAST",2,Moderate,Minor,Surgical,Private Health Insurance,,,,,N,61761.78,23118.68
Capital/Adirond,Warren,5601000,001005,Glens Falls Hospital,50 to 69,128,F,White,Not Span/Hispanic,1,Elective,Home w/ Home Health Services,2022,NEO030,Breast cancer - all other types,SKB003,MASTECTOMY AND LUMPECTOMY,362,MASTECTOMY PROCEDURES,09,"DISEASES AND DISORDERS OF THE SKIN, SUBCUTANEOUS TISSUE AND BREAST",2,Moderate,Minor,Surgical,"Managed Care, Unspecified",,,,,N,66182.30,23349.44
Capital/Adirond,Warren,5601000,001005,Glens Falls Hospital,30 to 49,128,F,White,Not Span/Hispanic,1,Elective,Home w/ Home Health Services,2022,NEO030,Breast cancer - all other types,SKB003,MASTECTOMY AND LUMPECTOMY,362,MASTECTOMY PROCEDURES,09,"DISEASES AND DISORDERS OF THE SKIN, SUBCUTANEOUS TISSUE AND BREAST",2,Moderate,Minor,Surgical,Private Health Insurance,,,,,N,71179.94,25400.47
Capital/Adirond,Warren,5601000,001005,Glens Falls Hospital,50 to 69,128,F,White,Not Span/Hispanic,1,Elective,Home w/ Home Health Services,2022,NEO029,Breast cancer - ductal carcinoma in situ (DCIS),SKB003,MASTECTOMY AND LUMPECTOMY,362,MASTECTOMY PROCEDURES,09,"DISEASES AND DISORDERS OF THE SKIN, SUBCUTANEOUS TISSUE AND BREAST",2,Moderate,Minor,Surgical,Blue Cross/Blue Shield,,,,,N,55369.95,18794.60
Capital/Adirond,Warren,5601000,001005,Glens Falls Hospital,70 or Older,128,F,White,Not Span/Hispanic,4,Elective,Home w/ Home Health Services,2022,NEO030,Breast cancer - all other types,SKB003,MASTECTOMY AND LUMPECTOMY,362,MASTECTOMY PROCEDURES,09,"DISEASES AND DISORDERS OF THE SKIN, SUBCUTANEOUS TISSUE AND BREAST",1,Minor,Minor,Surgical,Medicare,Blue Cross/Blue Shield,,,,N,21603.08,5825.37
Capital/Adirond,Warren,5601000,001005,Glens Falls Hospital,70 or Older,128,F,White,Not Span/Hispanic,1,Elective,Home or Self Care,2022,NEO029,Breast cancer - ductal carcinoma in situ (DCIS),SKB003,MASTECTOMY AND LUMPECTOMY,362,MASTECTOMY PROCEDURES,09,"DISEASES AND DISORDERS OF THE SKIN, SUBCUTANEOUS TISSUE AND BREAST",1,Minor,Minor,Surgical,Medicare,,,,,N,14741.93,4199.71
Capital/Adirond,Warren,5601000,001005,Glens Falls Hospital,30 to 49,128,F,White,Not Span/Hispanic,1,Elective,Home or Self Care,2022,NEO030,Breast cancer - all other types,SKB003,MASTECTOMY AND LUMPECTOMY,362,MASTECTOMY PROCEDURES,09,"DISEASES AND DISORDERS OF THE SKIN, SUBCUTANEOUS TISSUE AND BREAST",2,Moderate,Minor,Surgical,Blue Cross/Blue Shield,,,,,N,64279.18,23137.52
New York City,Manhattan,7002001,001438,Bellevue Hospital Center,30 to 49,104,F,Other Race,Spanish/Hispanic,2,Elective,Home or Self Care,2022,NEO030,Breast cancer - all other types,SKB003,MASTECTOMY AND LUMPECTOMY,362,MASTECTOMY PROCEDURES,09,"DISEASES AND DISORDERS OF THE SKIN, SUBCUTANEOUS TISSUE AND BREAST",2,Moderate,Moderate,Surgical,Medicaid,,,,,N,44509.13,25596.49
New York City,Manhattan,7002054,001464,New York-Presbyterian Hospital - Columbia Presbyterian Center,50 to 69,100,F,Other Race,Spanish/Hispanic,2,Elective,Home w/ Home Health Services,2022,NEO030,Breast cancer - all other types,SKB003,MASTECTOMY AND LUMPECTOMY,362,MASTECTOMY PROCEDURES,09,"DISEASES AND DISORDERS OF THE SKIN, SUBCUTANEOUS TISSUE AND BREAST",1,Minor,Minor,Surgical,Medicaid,,,,,N,80314.82,24721.23
New York City,Manhattan,7002001,001438,Bellevue Hospital Center,70 or Older,111,F,Other Race,Spanish/Hispanic,1,Elective,Home or Self Care,2022,NEO030,Breast cancer - all other types,SKB003,MASTECTOMY AND LUMPECTOMY,362,MASTECTOMY PROCEDURES,09,"DISEASES AND DISORDERS OF THE SKIN, SUBCUTANEOUS TISSUE AND BREAST",1,Minor,Minor,Surgical,Medicare,Medicaid,,,,N,41493.21,23862.08
Capital/Adirond,Warren,5601000,001005,Glens Falls Hospital,50 to 69,128,F,White,Not Span/Hispanic,1,Elective,Home w/ Home Health Services,2022,NEO030,Breast cancer - all other types,SKB003,MASTECTOMY AND LUMPECTOMY,362,MASTECTOMY PROCEDURES,09,"DISEASES AND DISORDERS OF THE SKIN, SUBCUTANEOUS TISSUE AND BREAST",1,Minor,Minor,Surgical,Blue Cross/Blue Shield,,,,,N,40027.12,13268.27
Capital/Adirond,Warren,5601000,001005,Glens Falls Hospital,70 or Older,128,F,White,Not Span/Hispanic,5,Elective,Home w/ Home Health Services,2022,NEO030,Breast cancer - all other types,SKB003,MASTECTOMY AND LUMPECTOMY,362,MASTECTOMY PROCEDURES,09,"DISEASES AND DISORDERS OF THE SKIN, SUBCUTANEOUS TISSUE AND BREAST",1,Minor,Minor,Surgical,Medicare,Private Health Insurance,,,,N,42613.27,15729.47
Capital/Adirond,Warren,5601000,001005,Glens Falls Hospital,50 to 69,128,F,White,Not Span/Hispanic,1,Elective,Home or Self Care,2022,NEO030,Breast cancer - all other types,SKB003,MASTECTOMY AND LUMPECTOMY,362,MASTECTOMY PROCEDURES,09,"DISEASES AND DISORDERS OF THE SKIN, SUBCUTANEOUS TISSUE AND BREAST",2,Moderate,Minor,Surgical,Private Health Insurance,Medicare,Medicaid,,,N,49447.64,18314.26
New York City,Manhattan,7002001,001438,Bellevue Hospital Center,50 to 69,112,F,Black/African American,Unknown,2,Elective,Home w/ Home Health Services,2022,NEO030,Breast cancer - all other types,SKB003,MASTECTOMY AND LUMPECTOMY,362,MASTECTOMY PROCEDURES,09,"DISEASES AND DISORDERS OF THE SKIN, SUBCUTANEOUS TISSUE AND BREAST",2,Moderate,Moderate,Surgical,Private Health Insurance,Private Health Insurance,,,,N,52904.85,30424.73
Long Island,Nassau,2951001,000541,North Shore University Hospital,50 to 69,115,F,White,Not Span/Hispanic,1,Urgent,Home w/ Home Health Services,2022,NEO030,Breast cancer - all other types,SKB003,MASTECTOMY AND LUMPECTOMY,362,MASTECTOMY PROCEDURES,09,"DISEASES AND DISORDERS OF THE SKIN, SUBCUTANEOUS TISSUE AND BREAST",2,Moderate,Minor,Surgical,Blue Cross/Blue Shield,,,,,N,57176.61,10656.63
Long Island,Nassau,2951001,000541,North Shore University Hospital,50 to 69,117,F,White,Not Span/Hispanic,2,Elective,Home or Self Care,2022,NEO029,Breast cancer - ductal carcinoma in situ (DCIS),LYM001,LYMPH NODE BIOPSY,362,MASTECTOMY PROCEDURES,09,"DISEASES AND DISORDERS OF THE SKIN, SUBCUTANEOUS TISSUE AND BREAST",2,Moderate,Minor,Surgical,Private Health Insurance,,,,,N,110938.34,19567.98
Long Island,Nassau,2951001,000541,North Shore University Hospital,30 to 49,113,F,Other Race,Not Span/Hispanic,2,Elective,Home w/ Home Health Services,2022,NEO030,Breast cancer - all other types,SKB003,MASTECTOMY AND LUMPECTOMY,362,MASTECTOMY PROCEDURES,09,"DISEASES AND DISORDERS OF THE SKIN, SUBCUTANEOUS TISSUE AND BREAST",1,Minor,Minor,Surgical,Medicaid,Medicaid,,,,N,83092.12,15092.24
Long Island,Nassau,2951001,000541,North Shore University Hospital,30 to 49,113,F,White,Not Span/Hispanic,1,Elective,Home w/ Home Health Services,2022,NEO029,Breast cancer - ductal carcinoma in situ (DCIS),LYM001,LYMPH NODE BIOPSY,362,MASTECTOMY PROCEDURES,09,"DISEASES AND DISORDERS OF THE SKIN, SUBCUTANEOUS TISSUE AND BREAST",2,Moderate,Minor,Surgical,Blue Cross/Blue Shield,,,,,N,125374.02,26367.66
Long Island,Nassau,2951001,000541,North Shore University Hospital,50 to 69,113,F,White,Spanish/Hispanic,3,Urgent,Home w/ Home Health Services,2022,NEO030,Breast cancer - all other types,SKB003,MASTECTOMY AND LUMPECTOMY,362,MASTECTOMY PROCEDURES,09,"DISEASES AND DISORDERS OF THE SKIN, SUBCUTANEOUS TISSUE AND BREAST",2,Moderate,Minor,Surgical,Private Health Insurance,,,,,N,112525.61,20942.68
Long Island,Nassau,2951001,000541,North Shore University Hospital,50 to 69,113,F,Other Race,Not Span/Hispanic,3,Elective,Home w/ Home Health Services,2022,NEO029,Breast cancer - ductal carcinoma in situ (DCIS),LYM001,LYMPH NODE BIOPSY,362,MASTECTOMY PROCEDURES,09,"DISEASES AND DISORDERS OF THE SKIN, SUBCUTANEOUS TISSUE AND BREAST",2,Moderate,Moderate,Surgical,Private Health Insurance,,,,,N,112541.97,20703.14
New York City,Manhattan,7002001,001438,Bellevue Hospital Center,30 to 49,113,F,Other Race,Unknown,1,Elective,Home or Self Care,2022,NEO030,Breast cancer - all other types,SKB003,MASTECTOMY AND LUMPECTOMY,362,MASTECTOMY PROCEDURES,09,"DISEASES AND DISORDERS OF THE SKIN, SUBCUTANEOUS TISSUE AND BREAST",1,Minor,Minor,Surgical,Medicaid,,,,,N,42287.25,24318.72