Hospital Service Area,Hospital County,Operating Certificate Number,Permanent Facility Id,Facility Name,Age Group,Zip Code - 3 digits,Gender,Race,Ethnicity,Length of Stay,Type of Admission,Patient Disposition,Discharge Year,CCS Diagnosis Code,CCS Diagnosis Description,CCS Procedure Code,CCS Procedure Description,APR DRG Code,APR DRG Description,APR MDC Code,APR MDC Description,APR Severity of Illness Code,APR Severity of Illness Description,APR Risk of Mortality,APR Medical Surgical Description,Payment Typology 1,Payment Typology 2,Payment Typology 3,Birth Weight,Abortion Edit Indicator,Emergency Department Indicator,Total Charges,Total Costs
New York City,Manhattan,7002001,001438,Bellevue Hospital Center,70 or Older,100,M,Other Race,Spanish/Hispanic,6,Emergency,Home or Self Care,2022,CIR039,Other specified diseases of veins and lymphatics,IMG008,ULTRASONOGRAPHY,385,"OTHER SKIN, SUBCUTANEOUS TISSUE AND BREAST DISORDERS",09,"DISEASES AND DISORDERS OF THE SKIN, SUBCUTANEOUS TISSUE AND BREAST",2,Moderate,Moderate,Medical,Medicaid,,,,,Y,54260.60,31204.40
New York City,Manhattan,7002054,001464,New York-Presbyterian Hospital - Columbia Presbyterian Center,50 to 69,104,F,White,Not Span/Hispanic,1,Emergency,Left Against Medical Advice,2022,GEN017,Nonmalignant breast conditions,,,385,"OTHER SKIN, SUBCUTANEOUS TISSUE AND BREAST DISORDERS",09,"DISEASES AND DISORDERS OF THE SKIN, SUBCUTANEOUS TISSUE AND BREAST",1,Minor,Moderate,Medical,Medicare,Medicaid,,,,Y,17974.95,4099.48
New York City,Manhattan,7002054,001464,New York-Presbyterian Hospital - Columbia Presbyterian Center,0 to 17,100,F,Other Race,Spanish/Hispanic,4,Emergency,Home or Self Care,2022,SKN002,Other specified inflammatory condition of skin,ADM017,ADMINISTRATION OF NUTRITIONAL AND ELECTROLYTIC SUBSTANCES,385,"OTHER SKIN, SUBCUTANEOUS TISSUE AND BREAST DISORDERS",09,"DISEASES AND DISORDERS OF THE SKIN, SUBCUTANEOUS TISSUE AND BREAST",1,Minor,Minor,Medical,Medicaid,,,,,Y,62029.75,16994.05
New York City,Manhattan,7002054,001464,New York-Presbyterian Hospital - Columbia Presbyterian Center,50 to 69,113,M,Other Race,Spanish/Hispanic,5,Emergency,Home or Self Care,2022,CIR039,Other specified diseases of veins and lymphatics,,,385,"OTHER SKIN, SUBCUTANEOUS TISSUE AND BREAST DISORDERS",09,"DISEASES AND DISORDERS OF THE SKIN, SUBCUTANEOUS TISSUE AND BREAST",2,Moderate,Moderate,Medical,Medicaid,,,,,Y,71568.07,15536.27
New York City,Manhattan,7002054,001464,New York-Presbyterian Hospital - Columbia Presbyterian Center,18 to 29,OOS,F,Other Race,Unknown,3,Emergency,Home or Self Care,2022,GEN017,Nonmalignant breast conditions,ADM015,ADMINISTRATION OF ANTIBIOTICS,385,"OTHER SKIN, SUBCUTANEOUS TISSUE AND BREAST DISORDERS",09,"DISEASES AND DISORDERS OF THE SKIN, SUBCUTANEOUS TISSUE AND BREAST",2,Moderate,Moderate,Medical,Blue Cross/Blue Shield,,,,,Y,47096.61,10131.19
New York City,Manhattan,7002054,001464,New York-Presbyterian Hospital - Columbia Presbyterian Center,0 to 17,107,M,Other Race,Spanish/Hispanic,2,Emergency,Home or Self Care,2022,GEN017,Nonmalignant breast conditions,OTR004,ISOLATION PROCEDURES,385,"OTHER SKIN, SUBCUTANEOUS TISSUE AND BREAST DISORDERS",09,"DISEASES AND DISORDERS OF THE SKIN, SUBCUTANEOUS TISSUE AND BREAST",2,Moderate,Moderate,Medical,Private Health Insurance,,,04500,,Y,37911.63,7905.90
New York City,Manhattan,7002054,001464,New York-Presbyterian Hospital - Columbia Presbyterian Center,0 to 17,100,F,Multi-racial,Not Span/Hispanic,1,Emergency,Home or Self Care,2022,SKN002,Other specified inflammatory condition of skin,SKB001,SKIN BIOPSY AND DIAGNOSTIC DRAINAGE,385,"OTHER SKIN, SUBCUTANEOUS TISSUE AND BREAST DISORDERS",09,"DISEASES AND DISORDERS OF THE SKIN, SUBCUTANEOUS TISSUE AND BREAST",1,Minor,Minor,Medical,Medicaid,,,,,Y,20712.09,5655.94
New York City,Manhattan,7002001,001438,Bellevue Hospital Center,18 to 29,113,M,Other Race,Spanish/Hispanic,6,Emergency,Court/Law Enforcement,2022,SKN002,Other specified inflammatory condition of skin,ADM021,"ADMINISTRATION OF THERAPEUTIC SUBSTANCES, NEC",385,"OTHER SKIN, SUBCUTANEOUS TISSUE AND BREAST DISORDERS",09,"DISEASES AND DISORDERS OF THE SKIN, SUBCUTANEOUS TISSUE AND BREAST",3,Major,Minor,Medical,Medicaid,,,,,Y,39493.18,22711.90
New York City,Manhattan,7002053,001463,NYU Langone Hospitals,30 to 49,112,M,White,Not Span/Hispanic,1,Elective,Home or Self Care,2022,NEO073,Benign neoplasms,MST003,"SUBCUTANEOUS TISSUE, FASCIA, AND MUSCLE BIOPSY",385,"OTHER SKIN, SUBCUTANEOUS TISSUE AND BREAST DISORDERS",09,"DISEASES AND DISORDERS OF THE SKIN, SUBCUTANEOUS TISSUE AND BREAST",1,Minor,Minor,Medical,Private Health Insurance,,,,,N,38332.18,8129.99
New York City,Manhattan,7002001,001438,Bellevue Hospital Center,0 to 17,112,M,Black/African American,Unknown,1,Urgent,Home or Self Care,2022,SYM014,Skin/Subcutaneous signs and symptoms,ADM021,"ADMINISTRATION OF THERAPEUTIC SUBSTANCES, NEC",385,"OTHER SKIN, SUBCUTANEOUS TISSUE AND BREAST DISORDERS",09,"DISEASES AND DISORDERS OF THE SKIN, SUBCUTANEOUS TISSUE AND BREAST",1,Minor,Minor,Medical,Medicaid,,,,,N,5790.55,3330.05
Finger Lakes,Monroe,2701005,000413,Strong Memorial Hospital,50 to 69,146,F,Other Race,Spanish/Hispanic,4,Emergency,Home or Self Care,2022,SKN007,Other specified and unspecified skin disorders,,,385,"OTHER SKIN, SUBCUTANEOUS TISSUE AND BREAST DISORDERS",09,"DISEASES AND DISORDERS OF THE SKIN, SUBCUTANEOUS TISSUE AND BREAST",2,Moderate,Minor,Medical,Medicare,Medicaid,,,,Y,16235.06,7066.76
Finger Lakes,Monroe,2701005,000413,Strong Memorial Hospital,0 to 17,144,M,White,Not Span/Hispanic,2,Urgent,Home or Self Care,2022,NEO073,Benign neoplasms,,,385,"OTHER SKIN, SUBCUTANEOUS TISSUE AND BREAST DISORDERS",09,"DISEASES AND DISORDERS OF THE SKIN, SUBCUTANEOUS TISSUE AND BREAST",2,Moderate,Moderate,Medical,Medicaid,,,04000,,N,11230.58,3919.37
New York City,Manhattan,7002053,001463,NYU Langone Hospitals,0 to 17,116,M,Other Race,Spanish/Hispanic,2,Emergency,Home or Self Care,2022,SKN002,Other specified inflammatory condition of skin,OTR004,ISOLATION PROCEDURES,385,"OTHER SKIN, SUBCUTANEOUS TISSUE AND BREAST DISORDERS",09,"DISEASES AND DISORDERS OF THE SKIN, SUBCUTANEOUS TISSUE AND BREAST",3,Major,Major,Medical,Medicaid,,,,,Y,33249.76,8000.55
New York City,Manhattan,7002001,001438,Bellevue Hospital Center,18 to 29,112,M,Other Race,Unknown,5,Emergency,Home or Self Care,2022,SYM014,Skin/Subcutaneous signs and symptoms,IMG005,MAGNETIC RESONANCE IMAGING (MRI),385,"OTHER SKIN, SUBCUTANEOUS TISSUE AND BREAST DISORDERS",09,"DISEASES AND DISORDERS OF THE SKIN, SUBCUTANEOUS TISSUE AND BREAST",1,Minor,Minor,Medical,Medicaid,,,,,Y,35311.52,20307.09
Finger Lakes,Monroe,2701005,000413,Strong Memorial Hospital,70 or Older,146,F,White,Not Span/Hispanic,14,Emergency,Skilled Nursing Home,2022,CIR039,Other specified diseases of veins and lymphatics,,,385,"OTHER SKIN, SUBCUTANEOUS TISSUE AND BREAST DISORDERS",09,"DISEASES AND DISORDERS OF THE SKIN, SUBCUTANEOUS TISSUE AND BREAST",3,Major,Major,Medical,Medicare,Federal/State/Local/VA,Blue Cross/Blue Shield,,,Y,40693.95,19893.92
New York City,Manhattan,7002001,001438,Bellevue Hospital Center,18 to 29,112,F,Other Race,Spanish/Hispanic,1,Emergency,Home or Self Care,2022,GEN017,Nonmalignant breast conditions,IMG009,PLAIN RADIOGRAPHY,385,"OTHER SKIN, SUBCUTANEOUS TISSUE AND BREAST DISORDERS",09,"DISEASES AND DISORDERS OF THE SKIN, SUBCUTANEOUS TISSUE AND BREAST",1,Minor,Minor,Medical,Medicaid,,,,,Y,9007.79,5180.24
New York City,Manhattan,7002054,001464,New York-Presbyterian Hospital - Columbia Presbyterian Center,30 to 49,100,M,Multi-racial,Spanish/Hispanic,5,Emergency,Home or Self Care,2022,NEO073,Benign neoplasms,ADM021,"ADMINISTRATION OF THERAPEUTIC SUBSTANCES, NEC",385,"OTHER SKIN, SUBCUTANEOUS TISSUE AND BREAST DISORDERS",09,"DISEASES AND DISORDERS OF THE SKIN, SUBCUTANEOUS TISSUE AND BREAST",2,Moderate,Moderate,Medical,Medicaid,,,,,Y,87624.61,19748.25
New York City,Manhattan,7002054,001464,New York-Presbyterian Hospital - Columbia Presbyterian Center,0 to 17,100,M,Other Race,Spanish/Hispanic,1,Emergency,Home or Self Care,2022,SKN002,Other specified inflammatory condition of skin,,,385,"OTHER SKIN, SUBCUTANEOUS TISSUE AND BREAST DISORDERS",09,"DISEASES AND DISORDERS OF THE SKIN, SUBCUTANEOUS TISSUE AND BREAST",1,Minor,Minor,Medical,Medicaid,,,,,Y,22621.05,
New York City,Manhattan,7002054,001464,New York-Presbyterian Hospital - Columbia Presbyterian Center,70 or Older,100,F,White,Spanish/Hispanic,1,Emergency,Home or Self Care,2022,GEN017,Nonmalignant breast conditions,,,385,"OTHER SKIN, SUBCUTANEOUS TISSUE AND BREAST DISORDERS",09,"DISEASES AND DISORDERS OF THE SKIN, SUBCUTANEOUS TISSUE AND BREAST",2,Moderate,Minor,Medical,Medicare,,,,,Y,23961.01,
New York City,Manhattan,7002054,001464,New York-Presbyterian Hospital - Columbia Presbyterian Center,0 to 17,115,F,Other Race,Not Span/Hispanic,4,Emergency,Home or Self Care,2022,NEO073,Benign neoplasms,,,385,"OTHER SKIN, SUBCUTANEOUS TISSUE AND BREAST DISORDERS",09,"DISEASES AND DISORDERS OF THE SKIN, SUBCUTANEOUS TISSUE AND BREAST",1,Minor,Minor,Medical,Private Health Insurance,,,,,Y,71011.35,18849.96
New York City,Manhattan,7002053,001463,NYU Langone Hospitals,70 or Older,100,F,White,Not Span/Hispanic,3,Emergency,Skilled Nursing Home,2022,MAL010,Other specified and unspecified congenital anomalies,,,385,"OTHER SKIN, SUBCUTANEOUS TISSUE AND BREAST DISORDERS",09,"DISEASES AND DISORDERS OF THE SKIN, SUBCUTANEOUS TISSUE AND BREAST",3,Major,Major,Medical,Medicare,Medicaid,,,,Y,61913.66,21338.88
New York City,Manhattan,7002053,001463,NYU Langone Hospitals,70 or Older,113,M,White,Not Span/Hispanic,3,Emergency,Home or Self Care,2022,SKN002,Other specified inflammatory condition of skin,,,385,"OTHER SKIN, SUBCUTANEOUS TISSUE AND BREAST DISORDERS",09,"DISEASES AND DISORDERS OF THE SKIN, SUBCUTANEOUS TISSUE AND BREAST",3,Major,Major,Medical,Medicare,Blue Cross/Blue Shield,,,,Y,49250.43,16164.07
New York City,Manhattan,7002001,001438,Bellevue Hospital Center,18 to 29,113,M,Other Race,Spanish/Hispanic,7,Emergency,Home or Self Care,2022,SKN002,Other specified inflammatory condition of skin,IMG006,COMPUTERIZED TOMOGRAPHY (CT) WITH CONTRAST,385,"OTHER SKIN, SUBCUTANEOUS TISSUE AND BREAST DISORDERS",09,"DISEASES AND DISORDERS OF THE SKIN, SUBCUTANEOUS TISSUE AND BREAST",2,Moderate,Minor,Medical,Medicaid,,,,,Y,47299.36,27201.11
New York City,Manhattan,7002001,001438,Bellevue Hospital Center,30 to 49,112,F,Other Race,Spanish/Hispanic,1,Elective,Home or Self Care,2022,MUS025,Other specified connective tissue disease,MST020,SUBCUTANEOUS TISSUE AND FASCIA EXCISION,385,"OTHER SKIN, SUBCUTANEOUS TISSUE AND BREAST DISORDERS",09,"DISEASES AND DISORDERS OF THE SKIN, SUBCUTANEOUS TISSUE AND BREAST",2,Moderate,Minor,Medical,Medicaid,,,,,N,27919.56,16056.09
Finger Lakes,Monroe,2701005,000413,Strong Memorial Hospital,0 to 17,144,M,White,Not Span/Hispanic,1,Emergency,Home or Self Care,2022,SKN002,Other specified inflammatory condition of skin,SKB001,SKIN BIOPSY AND DIAGNOSTIC DRAINAGE,385,"OTHER SKIN, SUBCUTANEOUS TISSUE AND BREAST DISORDERS",09,"DISEASES AND DISORDERS OF THE SKIN, SUBCUTANEOUS TISSUE AND BREAST",2,Moderate,Minor,Medical,Medicaid,,,,,Y,5302.38,2054.97
Finger Lakes,Monroe,2701005,000413,Strong Memorial Hospital,50 to 69,,F,Other Race,Unknown,5,Emergency,Skilled Nursing Home,2022,SKN007,Other specified and unspecified skin disorders,SKB001,SKIN BIOPSY AND DIAGNOSTIC DRAINAGE,385,"OTHER SKIN, SUBCUTANEOUS TISSUE AND BREAST DISORDERS",09,"DISEASES AND DISORDERS OF THE SKIN, SUBCUTANEOUS TISSUE AND BREAST",2,Moderate,Major,Medical,Medicare,,,,,Y,20891.29,8905.88
Finger Lakes,Monroe,2701005,000413,Strong Memorial Hospital,50 to 69,146,F,Black/African American,Not Span/Hispanic,3,Emergency,Home or Self Care,2022,SKN007,Other specified and unspecified skin disorders,,,385,"OTHER SKIN, SUBCUTANEOUS TISSUE AND BREAST DISORDERS",09,"DISEASES AND DISORDERS OF THE SKIN, SUBCUTANEOUS TISSUE AND BREAST",1,Minor,Minor,Medical,Medicaid,,,,,Y,16607.91,6661.97
New York City,Manhattan,7002001,001438,Bellevue Hospital Center,30 to 49,113,M,Black/African American,Unknown,1,Elective,Court/Law Enforcement,2022,SKN007,Other specified and unspecified skin disorders,SKB008,SKIN EXCISION AND DEBRIDEMENT,385,"OTHER SKIN, SUBCUTANEOUS TISSUE AND BREAST DISORDERS",09,"DISEASES AND DISORDERS OF THE SKIN, SUBCUTANEOUS TISSUE AND BREAST",2,Moderate,Minor,Medical,Medicaid,,,,,N,12670.79,7286.77
New York City,Manhattan,7002053,001463,NYU Langone Hospitals,50 to 69,100,F,Multi-racial,Spanish/Hispanic,2,Emergency,Home w/ Home Health Services,2022,CIR039,Other specified diseases of veins and lymphatics,,,385,"OTHER SKIN, SUBCUTANEOUS TISSUE AND BREAST DISORDERS",09,"DISEASES AND DISORDERS OF THE SKIN, SUBCUTANEOUS TISSUE AND BREAST",2,Moderate,Moderate,Medical,Medicare,Private Health Insurance,,,,Y,42244.93,12187.43
New York City,Manhattan,7002053,001463,NYU Langone Hospitals,30 to 49,100,F,Black/African American,Not Span/Hispanic,7,Emergency,Home or Self Care,2022,GEN017,Nonmalignant breast conditions,,,385,"OTHER SKIN, SUBCUTANEOUS TISSUE AND BREAST DISORDERS",09,"DISEASES AND DISORDERS OF THE SKIN, SUBCUTANEOUS TISSUE AND BREAST",2,Moderate,Moderate,Medical,Private Health Insurance,,,,,Y,128132.05,43233.42
New York City,Manhattan,7002001,001438,Bellevue Hospital Center,50 to 69,100,M,Black/African American,Unknown,17,Urgent,Home or Self Care,2022,SYM014,Skin/Subcutaneous signs and symptoms,MST003,"SUBCUTANEOUS TISSUE, FASCIA, AND MUSCLE BIOPSY",385,"OTHER SKIN, SUBCUTANEOUS TISSUE AND BREAST DISORDERS",09,"DISEASES AND DISORDERS OF THE SKIN, SUBCUTANEOUS TISSUE AND BREAST",2,Moderate,Moderate,Medical,Medicaid,,,,,N,117001.58,67285.74
New York City,Manhattan,7002054,001464,New York-Presbyterian Hospital - Columbia Presbyterian Center,0 to 17,109,F,White,Not Span/Hispanic,1,Emergency,Home or Self Care,2022,SKN002,Other specified inflammatory condition of skin,SKB001,SKIN BIOPSY AND DIAGNOSTIC DRAINAGE,385,"OTHER SKIN, SUBCUTANEOUS TISSUE AND BREAST DISORDERS",09,"DISEASES AND DISORDERS OF THE SKIN, SUBCUTANEOUS TISSUE AND BREAST",1,Minor,Minor,Medical,Self-Pay,,,,,Y,22937.77,5986.84
New York City,Manhattan,7002054,001464,New York-Presbyterian Hospital - Columbia Presbyterian Center,30 to 49,125,F,Other Race,Spanish/Hispanic,3,Emergency,Home or Self Care,2022,SKN002,Other specified inflammatory condition of skin,SKB001,SKIN BIOPSY AND DIAGNOSTIC DRAINAGE,385,"OTHER SKIN, SUBCUTANEOUS TISSUE AND BREAST DISORDERS",09,"DISEASES AND DISORDERS OF THE SKIN, SUBCUTANEOUS TISSUE AND BREAST",1,Minor,Minor,Medical,Blue Cross/Blue Shield,,,,,Y,62801.26,12793.52
New York City,Manhattan,7002054,001464,New York-Presbyterian Hospital - Columbia Presbyterian Center,30 to 49,114,F,Other Race,Spanish/Hispanic,2,Emergency,Home or Self Care,2022,SKN002,Other specified inflammatory condition of skin,,,385,"OTHER SKIN, SUBCUTANEOUS TISSUE AND BREAST DISORDERS",09,"DISEASES AND DISORDERS OF THE SKIN, SUBCUTANEOUS TISSUE AND BREAST",1,Minor,Minor,Medical,Medicaid,,,,,Y,27445.19,6066.80
Long Island,Nassau,2951001,000541,North Shore University Hospital,18 to 29,115,M,White,Not Span/Hispanic,4,Emergency,Home or Self Care,2022,SKN007,Other specified and unspecified skin disorders,,,385,"OTHER SKIN, SUBCUTANEOUS TISSUE AND BREAST DISORDERS",09,"DISEASES AND DISORDERS OF THE SKIN, SUBCUTANEOUS TISSUE AND BREAST",1,Minor,Minor,Medical,Medicaid,,,,,Y,55584.38,9104.27
Long Island,Nassau,2951001,000541,North Shore University Hospital,30 to 49,114,F,Black/African American,Not Span/Hispanic,4,Emergency,Home or Self Care,2022,GEN017,Nonmalignant breast conditions,,,385,"OTHER SKIN, SUBCUTANEOUS TISSUE AND BREAST DISORDERS",09,"DISEASES AND DISORDERS OF THE SKIN, SUBCUTANEOUS TISSUE AND BREAST",1,Minor,Minor,Medical,Blue Cross/Blue Shield,,,,,Y,64890.53,11840.70
Long Island,Nassau,2951001,000541,North Shore University Hospital,50 to 69,110,F,Other Race,Not Span/Hispanic,3,Emergency,Home or Self Care,2022,SKN005,Contact dermatitis,ENT003,ENT DIAGNOSTIC PROCEDURES (NON-ENDOSCOPIC),385,"OTHER SKIN, SUBCUTANEOUS TISSUE AND BREAST DISORDERS",09,"DISEASES AND DISORDERS OF THE SKIN, SUBCUTANEOUS TISSUE AND BREAST",1,Minor,Minor,Medical,Medicare,Medicare,Medicaid,,,Y,58818.36,10243.74
Long Island,Nassau,2951001,000541,North Shore University Hospital,50 to 69,114,F,White,Not Span/Hispanic,2,Emergency,Home w/ Home Health Services,2022,SKN005,Contact dermatitis,,,385,"OTHER SKIN, SUBCUTANEOUS TISSUE AND BREAST DISORDERS",09,"DISEASES AND DISORDERS OF THE SKIN, SUBCUTANEOUS TISSUE AND BREAST",2,Moderate,Moderate,Medical,Medicare,Blue Cross/Blue Shield,,,,Y,47247.39,8982.79
Long Island,Nassau,2951001,000541,North Shore University Hospital,50 to 69,114,F,White,Not Span/Hispanic,4,Emergency,Home or Self Care,2022,CIR039,Other specified diseases of veins and lymphatics,,,385,"OTHER SKIN, SUBCUTANEOUS TISSUE AND BREAST DISORDERS",09,"DISEASES AND DISORDERS OF THE SKIN, SUBCUTANEOUS TISSUE AND BREAST",2,Moderate,Moderate,Medical,Medicaid,Medicaid,,,,Y,68225.07,10222.64
Finger Lakes,Monroe,2701005,000413,Strong Memorial Hospital,70 or Older,146,F,White,Not Span/Hispanic,1,Emergency,Home or Self Care,2022,SKN002,Other specified inflammatory condition of skin,,,385,"OTHER SKIN, SUBCUTANEOUS TISSUE AND BREAST DISORDERS",09,"DISEASES AND DISORDERS OF THE SKIN, SUBCUTANEOUS TISSUE AND BREAST",2,Moderate,Moderate,Medical,Medicare,,,,,Y,5629.49,2173.38
New York City,Manhattan,7002001,001438,Bellevue Hospital Center,30 to 49,OOS,M,Other Race,Unknown,1,Emergency,Court/Law Enforcement,2022,INF009,"Parasitic, other specified and unspecified infections",MAM007,ELECTROCARDIOGRAM (ECG),385,"OTHER SKIN, SUBCUTANEOUS TISSUE AND BREAST DISORDERS",09,"DISEASES AND DISORDERS OF THE SKIN, SUBCUTANEOUS TISSUE AND BREAST",2,Moderate,Moderate,Medical,Private Health Insurance,,,,,Y,9492.58,5459.03
New York City,Manhattan,7002053,001463,NYU Langone Hospitals,50 to 69,105,F,White,Not Span/Hispanic,5,Emergency,Home or Self Care,2022,SKN002,Other specified inflammatory condition of skin,MAM011,ELECTROENCEPHALOGRAM (EEG),385,"OTHER SKIN, SUBCUTANEOUS TISSUE AND BREAST DISORDERS",09,"DISEASES AND DISORDERS OF THE SKIN, SUBCUTANEOUS TISSUE AND BREAST",2,Moderate,Moderate,Medical,Private Health Insurance,,,,,Y,174693.80,27691.50
New York City,Manhattan,7002053,001463,NYU Langone Hospitals,70 or Older,100,M,Other Race,Spanish/Hispanic,1,Emergency,Home or Self Care,2022,CIR039,Other specified diseases of veins and lymphatics,,,385,"OTHER SKIN, SUBCUTANEOUS TISSUE AND BREAST DISORDERS",09,"DISEASES AND DISORDERS OF THE SKIN, SUBCUTANEOUS TISSUE AND BREAST",1,Minor,Minor,Medical,Medicaid,,,,,Y,40608.74,11533.51
New York City,Manhattan,7002054,001464,New York-Presbyterian Hospital - Columbia Presbyterian Center,30 to 49,109,M,White,Not Span/Hispanic,1,Emergency,Home or Self Care,2022,SKN002,Other specified inflammatory condition of skin,,,385,"OTHER SKIN, SUBCUTANEOUS TISSUE AND BREAST DISORDERS",09,"DISEASES AND DISORDERS OF THE SKIN, SUBCUTANEOUS TISSUE AND BREAST",2,Moderate,Moderate,Medical,Medicaid,,,,,Y,25629.03,5205.15
Capital/Adirond,Warren,5601000,001005,Glens Falls Hospital,50 to 69,128,M,White,Not Span/Hispanic,14,Emergency,Home or Self Care,2022,SKN007,Other specified and unspecified skin disorders,,,385,"OTHER SKIN, SUBCUTANEOUS TISSUE AND BREAST DISORDERS",09,"DISEASES AND DISORDERS OF THE SKIN, SUBCUTANEOUS TISSUE AND BREAST",3,Major,Major,Medical,Medicare,Medicaid,,,,Y,50083.22,20460.95
Capital/Adirond,Warren,5601000,001005,Glens Falls Hospital,50 to 69,128,M,White,Not Span/Hispanic,1,Emergency,Home or Self Care,2022,SKN007,Other specified and unspecified skin disorders,,,385,"OTHER SKIN, SUBCUTANEOUS TISSUE AND BREAST DISORDERS",09,"DISEASES AND DISORDERS OF THE SKIN, SUBCUTANEOUS TISSUE AND BREAST",1,Minor,Minor,Medical,Medicaid,,,,,Y,5490.27,1732.77
Hudson Valley,Dutchess,1302001,000181,Vassar Brothers Medical Center,50 to 69,125,M,Other Race,Not Span/Hispanic,2,Emergency,Home or Self Care,2022,SKN002,Other specified inflammatory condition of skin,,,385,"OTHER SKIN, SUBCUTANEOUS TISSUE AND BREAST DISORDERS",09,"DISEASES AND DISORDERS OF THE SKIN, SUBCUTANEOUS TISSUE AND BREAST",1,Minor,Minor,Medical,Private Health Insurance,,,,,Y,19773.06,4394.01
New York City,Manhattan,7002001,001438,Bellevue Hospital Center,70 or Older,100,F,Other Race,Unknown,41,Emergency,Inpatient Rehabilitation Facility,2022,SYM014,Skin/Subcutaneous signs and symptoms,ADM021,"ADMINISTRATION OF THERAPEUTIC SUBSTANCES, NEC",385,"OTHER SKIN, SUBCUTANEOUS TISSUE AND BREAST DISORDERS",09,"DISEASES AND DISORDERS OF THE SKIN, SUBCUTANEOUS TISSUE AND BREAST",1,Minor,Moderate,Medical,Medicare,Medicaid,,,,Y,277581.11,159632.46
New York City,Manhattan,7002053,001463,NYU Langone Hospitals,50 to 69,114,M,Other Race,Unknown,1,Emergency,Home or Self Care,2022,SKN007,Other specified and unspecified skin disorders,IMG008,ULTRASONOGRAPHY,385,"OTHER SKIN, SUBCUTANEOUS TISSUE AND BREAST DISORDERS",09,"DISEASES AND DISORDERS OF THE SKIN, SUBCUTANEOUS TISSUE AND BREAST",2,Moderate,Major,Medical,Blue Cross/Blue Shield,,,,,Y,35037.05,7834.50
New York City,Manhattan,7002053,001463,NYU Langone Hospitals,0 to 17,112,F,White,Not Span/Hispanic,1,Elective,Home or Self Care,2022,NEO073,Benign neoplasms,MST020,SUBCUTANEOUS TISSUE AND FASCIA EXCISION,385,"OTHER SKIN, SUBCUTANEOUS TISSUE AND BREAST DISORDERS",09,"DISEASES AND DISORDERS OF THE SKIN, SUBCUTANEOUS TISSUE AND BREAST",1,Minor,Minor,Medical,Private Health Insurance,,,,,N,33121.12,7789.22
New York City,Manhattan,7002054,001464,New York-Presbyterian Hospital - Columbia Presbyterian Center,18 to 29,104,F,Black/African American,Spanish/Hispanic,4,Emergency,Home or Self Care,2022,GEN017,Nonmalignant breast conditions,,,385,"OTHER SKIN, SUBCUTANEOUS TISSUE AND BREAST DISORDERS",09,"DISEASES AND DISORDERS OF THE SKIN, SUBCUTANEOUS TISSUE AND BREAST",1,Minor,Minor,Medical,Medicaid,,,,,Y,55233.06,12135.09
New York City,Manhattan,7002054,001464,New York-Presbyterian Hospital - Columbia Presbyterian Center,50 to 69,OOS,F,White,Not Span/Hispanic,12,Emergency,Home w/ Home Health Services,2022,SKN007,Other specified and unspecified skin disorders,RES001,BRONCHOSCOPY (DIAGNOSTIC),385,"OTHER SKIN, SUBCUTANEOUS TISSUE AND BREAST DISORDERS",09,"DISEASES AND DISORDERS OF THE SKIN, SUBCUTANEOUS TISSUE AND BREAST",3,Major,Major,Medical,Private Health Insurance,,,,,Y,213809.38,48353.55
New York City,Manhattan,7002001,001438,Bellevue Hospital Center,50 to 69,100,M,Other Race,Unknown,8,Emergency,Home or Self Care,2022,NEO026,Skin cancers - basal cell carcinoma,,,385,"OTHER SKIN, SUBCUTANEOUS TISSUE AND BREAST DISORDERS",09,"DISEASES AND DISORDERS OF THE SKIN, SUBCUTANEOUS TISSUE AND BREAST",3,Major,Major,Medical,Medicare,Medicaid,,,,Y,75860.08,43625.92
New York City,Manhattan,7002001,001438,Bellevue Hospital Center,30 to 49,112,F,White,Unknown,1,Emergency,Home or Self Care,2022,SYM014,Skin/Subcutaneous signs and symptoms,SKB001,SKIN BIOPSY AND DIAGNOSTIC DRAINAGE,385,"OTHER SKIN, SUBCUTANEOUS TISSUE AND BREAST DISORDERS",09,"DISEASES AND DISORDERS OF THE SKIN, SUBCUTANEOUS TISSUE AND BREAST",1,Minor,Minor,Medical,Private Health Insurance,,,,,Y,9458.56,5439.47
New York City,Manhattan,7002001,001438,Bellevue Hospital Center,70 or Older,113,F,Other Race,Spanish/Hispanic,1,Emergency,Home or Self Care,2022,CIR039,Other specified diseases of veins and lymphatics,IMG008,ULTRASONOGRAPHY,385,"OTHER SKIN, SUBCUTANEOUS TISSUE AND BREAST DISORDERS",09,"DISEASES AND DISORDERS OF THE SKIN, SUBCUTANEOUS TISSUE AND BREAST",1,Minor,Minor,Medical,Medicaid,,,,,Y,11707.08,6732.55