Hospital Service Area,Hospital County,Operating Certificate Number,Permanent Facility Id,Facility Name,Age Group,Zip Code - 3 digits,Gender,Race,Ethnicity,Length of Stay,Type of Admission,Patient Disposition,Discharge Year,CCS Diagnosis Code,CCS Diagnosis Description,CCS Procedure Code,CCS Procedure Description,APR DRG Code,APR DRG Description,APR MDC Code,APR MDC Description,APR Severity of Illness Code,APR Severity of Illness Description,APR Risk of Mortality,APR Medical Surgical Description,Payment Typology 1,Payment Typology 2,Payment Typology 3,Birth Weight,Abortion Edit Indicator,Emergency Department Indicator,Total Charges,Total Costs
New York City,Manhattan,7002054,001464,New York-Presbyterian Hospital - Columbia Presbyterian Center,30 to 49,OOS,F,Other Race,Spanish/Hispanic,1,Elective,Home or Self Care,2022,END015,Other specified and unspecified endocrine disorders,ENP004,ADRENALECTOMY,401,ADRENAL PROCEDURES,10,"ENDOCRINE, NUTRITIONAL AND METABOLIC DISEASES AND DISORDERS",1,Minor,Minor,Surgical,Private Health Insurance,,,,,N,49923.47,
New York City,Manhattan,7002054,001464,New York-Presbyterian Hospital - Columbia Presbyterian Center,50 to 69,104,F,Other Race,Spanish/Hispanic,4,Elective,Home or Self Care,2022,NEO056,Endocrine system cancers - all other types,ENP004,ADRENALECTOMY,401,ADRENAL PROCEDURES,10,"ENDOCRINE, NUTRITIONAL AND METABOLIC DISEASES AND DISORDERS",1,Minor,Minor,Surgical,Blue Cross/Blue Shield,Medicaid,,,,N,101438.26,27302.33
New York City,Manhattan,7002053,001463,NYU Langone Hospitals,30 to 49,117,F,White,Not Span/Hispanic,1,Elective,Home or Self Care,2022,NEO073,Benign neoplasms,ENP004,ADRENALECTOMY,401,ADRENAL PROCEDURES,10,"ENDOCRINE, NUTRITIONAL AND METABOLIC DISEASES AND DISORDERS",2,Moderate,Moderate,Surgical,Medicare,Blue Cross/Blue Shield,,,,N,107349.72,17734.51
New York City,Manhattan,7002053,001463,NYU Langone Hospitals,50 to 69,111,M,White,Not Span/Hispanic,1,Elective,Home or Self Care,2022,NEO070,Secondary malignancies,ENP004,ADRENALECTOMY,401,ADRENAL PROCEDURES,10,"ENDOCRINE, NUTRITIONAL AND METABOLIC DISEASES AND DISORDERS",1,Minor,Minor,Surgical,Medicare,,,,,N,149096.48,23091.06
New York City,Manhattan,7002054,001464,New York-Presbyterian Hospital - Columbia Presbyterian Center,18 to 29,OOS,F,White,Not Span/Hispanic,1,Elective,Home or Self Care,2022,NEO073,Benign neoplasms,ENP004,ADRENALECTOMY,401,ADRENAL PROCEDURES,10,"ENDOCRINE, NUTRITIONAL AND METABOLIC DISEASES AND DISORDERS",1,Minor,Minor,Surgical,Private Health Insurance,,,,,N,69863.54,21624.08
New York City,Manhattan,7002001,001438,Bellevue Hospital Center,50 to 69,113,F,Other Race,Unknown,4,Elective,Home or Self Care,2022,NEO073,Benign neoplasms,ENP004,ADRENALECTOMY,401,ADRENAL PROCEDURES,10,"ENDOCRINE, NUTRITIONAL AND METABOLIC DISEASES AND DISORDERS",1,Minor,Minor,Surgical,Medicare,Medicaid,,,,N,64204.56,36923.02
New York City,Manhattan,7002054,001464,New York-Presbyterian Hospital - Columbia Presbyterian Center,30 to 49,OOS,F,White,Not Span/Hispanic,3,Elective,Home or Self Care,2022,NEO053,Endocrine system cancers - adrenocortical,ENP004,ADRENALECTOMY,401,ADRENAL PROCEDURES,10,"ENDOCRINE, NUTRITIONAL AND METABOLIC DISEASES AND DISORDERS",1,Minor,Minor,Surgical,Private Health Insurance,,,,,N,76013.60,20001.96
New York City,Manhattan,7002054,001464,New York-Presbyterian Hospital - Columbia Presbyterian Center,50 to 69,100,M,Other Race,Spanish/Hispanic,3,Elective,Home or Self Care,2022,NEO073,Benign neoplasms,ENP004,ADRENALECTOMY,401,ADRENAL PROCEDURES,10,"ENDOCRINE, NUTRITIONAL AND METABOLIC DISEASES AND DISORDERS",1,Minor,Minor,Surgical,Blue Cross/Blue Shield,Medicaid,,,,N,106052.51,28851.80
New York City,Manhattan,7002053,001463,NYU Langone Hospitals,50 to 69,104,F,Other Race,Spanish/Hispanic,5,Elective,Home w/ Home Health Services,2022,NEO056,Endocrine system cancers - all other types,ENP004,ADRENALECTOMY,401,ADRENAL PROCEDURES,10,"ENDOCRINE, NUTRITIONAL AND METABOLIC DISEASES AND DISORDERS",3,Major,Major,Surgical,Medicaid,,,,,N,175373.02,37112.43
New York City,Manhattan,7002001,001438,Bellevue Hospital Center,50 to 69,111,F,Other Race,Unknown,2,Elective,Home or Self Care,2022,NEO073,Benign neoplasms,ENP004,ADRENALECTOMY,401,ADRENAL PROCEDURES,10,"ENDOCRINE, NUTRITIONAL AND METABOLIC DISEASES AND DISORDERS",1,Minor,Minor,Surgical,Medicaid,,,,,N,49929.80,28713.83
Finger Lakes,Monroe,2701005,000413,Strong Memorial Hospital,30 to 49,144,F,White,Not Span/Hispanic,2,Elective,Home or Self Care,2022,NEO073,Benign neoplasms,ENP004,ADRENALECTOMY,401,ADRENAL PROCEDURES,10,"ENDOCRINE, NUTRITIONAL AND METABOLIC DISEASES AND DISORDERS",1,Minor,Minor,Surgical,Blue Cross/Blue Shield,Medicare,,,,N,31043.87,14859.86
Finger Lakes,Monroe,2701005,000413,Strong Memorial Hospital,50 to 69,145,M,White,Not Span/Hispanic,1,Elective,Home or Self Care,2022,END015,Other specified and unspecified endocrine disorders,ENP004,ADRENALECTOMY,401,ADRENAL PROCEDURES,10,"ENDOCRINE, NUTRITIONAL AND METABOLIC DISEASES AND DISORDERS",1,Minor,Moderate,Surgical,Blue Cross/Blue Shield,,,,,N,49557.66,23999.50
Finger Lakes,Monroe,2701005,000413,Strong Memorial Hospital,50 to 69,146,M,White,Not Span/Hispanic,1,Elective,Home or Self Care,2022,NEO072,Neoplasms of unspecified nature or uncertain behavior,ENP004,ADRENALECTOMY,401,ADRENAL PROCEDURES,10,"ENDOCRINE, NUTRITIONAL AND METABOLIC DISEASES AND DISORDERS",1,Minor,Minor,Surgical,Blue Cross/Blue Shield,,,,,N,26037.02,12247.96
Finger Lakes,Monroe,2701005,000413,Strong Memorial Hospital,50 to 69,144,M,White,Not Span/Hispanic,1,Elective,Home or Self Care,2022,END015,Other specified and unspecified endocrine disorders,ENP004,ADRENALECTOMY,401,ADRENAL PROCEDURES,10,"ENDOCRINE, NUTRITIONAL AND METABOLIC DISEASES AND DISORDERS",1,Minor,Minor,Surgical,Medicare,Medicaid,,,,N,25554.75,12269.55
New York City,Manhattan,7002054,001464,New York-Presbyterian Hospital - Columbia Presbyterian Center,50 to 69,105,M,White,Not Span/Hispanic,6,Elective,Home w/ Home Health Services,2022,NEO070,Secondary malignancies,ENP004,ADRENALECTOMY,401,ADRENAL PROCEDURES,10,"ENDOCRINE, NUTRITIONAL AND METABOLIC DISEASES AND DISORDERS",4,Extreme,Extreme,Surgical,Blue Cross/Blue Shield,,,,,N,253265.24,92785.67
New York City,Manhattan,7002054,001464,New York-Presbyterian Hospital - Columbia Presbyterian Center,0 to 17,100,M,Other Race,Unknown,6,Elective,Home or Self Care,2022,NEO056,Endocrine system cancers - all other types,ENP004,ADRENALECTOMY,401,ADRENAL PROCEDURES,10,"ENDOCRINE, NUTRITIONAL AND METABOLIC DISEASES AND DISORDERS",3,Major,Major,Surgical,Private Health Insurance,,,,,N,199093.47,75479.57
New York City,Manhattan,7002054,001464,New York-Presbyterian Hospital - Columbia Presbyterian Center,50 to 69,103,F,White,Unknown,1,Elective,Home or Self Care,2022,END015,Other specified and unspecified endocrine disorders,ENP004,ADRENALECTOMY,401,ADRENAL PROCEDURES,10,"ENDOCRINE, NUTRITIONAL AND METABOLIC DISEASES AND DISORDERS",1,Minor,Minor,Surgical,Private Health Insurance,,,,,N,62427.86,18751.00
New York City,Manhattan,7002053,001463,NYU Langone Hospitals,30 to 49,100,F,Other Race,Spanish/Hispanic,1,Elective,Home or Self Care,2022,NEO073,Benign neoplasms,ENP004,ADRENALECTOMY,401,ADRENAL PROCEDURES,10,"ENDOCRINE, NUTRITIONAL AND METABOLIC DISEASES AND DISORDERS",1,Minor,Minor,Surgical,Private Health Insurance,,,,,N,118042.73,19191.83
New York City,Manhattan,7002053,001463,NYU Langone Hospitals,50 to 69,111,M,Other Race,Unknown,5,Elective,Home w/ Home Health Services,2022,NEO056,Endocrine system cancers - all other types,ENP004,ADRENALECTOMY,401,ADRENAL PROCEDURES,10,"ENDOCRINE, NUTRITIONAL AND METABOLIC DISEASES AND DISORDERS",3,Major,Extreme,Surgical,Medicaid,,,,,N,284282.69,51510.85
New York City,Manhattan,7002054,001464,New York-Presbyterian Hospital - Columbia Presbyterian Center,70 or Older,104,M,White,Not Span/Hispanic,1,Elective,Home or Self Care,2022,NEO073,Benign neoplasms,ENP004,ADRENALECTOMY,401,ADRENAL PROCEDURES,10,"ENDOCRINE, NUTRITIONAL AND METABOLIC DISEASES AND DISORDERS",1,Minor,Moderate,Surgical,Medicare,Blue Cross/Blue Shield,,,,N,54744.51,16345.00
New York City,Manhattan,7002054,001464,New York-Presbyterian Hospital - Columbia Presbyterian Center,0 to 17,104,F,Other Race,Spanish/Hispanic,7,Elective,Home or Self Care,2022,NEO056,Endocrine system cancers - all other types,ENP004,ADRENALECTOMY,401,ADRENAL PROCEDURES,10,"ENDOCRINE, NUTRITIONAL AND METABOLIC DISEASES AND DISORDERS",2,Moderate,Moderate,Surgical,Medicaid,,,,,N,250572.38,93333.94
New York City,Manhattan,7002054,001464,New York-Presbyterian Hospital - Columbia Presbyterian Center,50 to 69,OOS,M,White,Not Span/Hispanic,1,Elective,Home or Self Care,2022,NEO073,Benign neoplasms,ENP004,ADRENALECTOMY,401,ADRENAL PROCEDURES,10,"ENDOCRINE, NUTRITIONAL AND METABOLIC DISEASES AND DISORDERS",1,Minor,Minor,Surgical,Medicare,Private Health Insurance,,,,N,50224.89,13955.70
Finger Lakes,Monroe,2701005,000413,Strong Memorial Hospital,30 to 49,144,M,White,Not Span/Hispanic,3,Elective,Home or Self Care,2022,END015,Other specified and unspecified endocrine disorders,ENP004,ADRENALECTOMY,401,ADRENAL PROCEDURES,10,"ENDOCRINE, NUTRITIONAL AND METABOLIC DISEASES AND DISORDERS",1,Minor,Minor,Surgical,Federal/State/Local/VA,,,,,N,34021.78,16546.58
Finger Lakes,Monroe,2701005,000413,Strong Memorial Hospital,50 to 69,145,M,White,Not Span/Hispanic,1,Elective,Home or Self Care,2022,NEO072,Neoplasms of unspecified nature or uncertain behavior,ENP004,ADRENALECTOMY,401,ADRENAL PROCEDURES,10,"ENDOCRINE, NUTRITIONAL AND METABOLIC DISEASES AND DISORDERS",1,Minor,Minor,Surgical,Private Health Insurance,,,,,N,32186.72,15649.03
Finger Lakes,Monroe,2701005,000413,Strong Memorial Hospital,70 or Older,144,F,White,Not Span/Hispanic,4,Elective,Home or Self Care,2022,NEO053,Endocrine system cancers - adrenocortical,ENP004,ADRENALECTOMY,401,ADRENAL PROCEDURES,10,"ENDOCRINE, NUTRITIONAL AND METABOLIC DISEASES AND DISORDERS",2,Moderate,Moderate,Surgical,Medicare,,,,,N,73248.06,30540.06
Finger Lakes,Monroe,2701005,000413,Strong Memorial Hospital,70 or Older,149,F,Other Race,Unknown,3,Elective,Home or Self Care,2022,NEO073,Benign neoplasms,ENP004,ADRENALECTOMY,401,ADRENAL PROCEDURES,10,"ENDOCRINE, NUTRITIONAL AND METABOLIC DISEASES AND DISORDERS",3,Major,Major,Surgical,Medicare,,,,,N,49141.50,22245.95
New York City,Manhattan,7002001,001438,Bellevue Hospital Center,30 to 49,113,F,White,Not Span/Hispanic,2,Elective,Home or Self Care,2022,NEO073,Benign neoplasms,ENP004,ADRENALECTOMY,401,ADRENAL PROCEDURES,10,"ENDOCRINE, NUTRITIONAL AND METABOLIC DISEASES AND DISORDERS",1,Minor,Minor,Surgical,Self-Pay,,,,,N,41219.56,23704.71
New York City,Manhattan,7002054,001464,New York-Presbyterian Hospital - Columbia Presbyterian Center,30 to 49,OOS,F,White,Not Span/Hispanic,1,Elective,Home or Self Care,2022,END015,Other specified and unspecified endocrine disorders,ENP004,ADRENALECTOMY,401,ADRENAL PROCEDURES,10,"ENDOCRINE, NUTRITIONAL AND METABOLIC DISEASES AND DISORDERS",1,Minor,Minor,Surgical,Private Health Insurance,,,,,N,38562.93,11243.09
New York City,Manhattan,7002054,001464,New York-Presbyterian Hospital - Columbia Presbyterian Center,50 to 69,112,F,Other Race,Not Span/Hispanic,1,Elective,Home or Self Care,2022,END015,Other specified and unspecified endocrine disorders,ENP004,ADRENALECTOMY,401,ADRENAL PROCEDURES,10,"ENDOCRINE, NUTRITIONAL AND METABOLIC DISEASES AND DISORDERS",1,Minor,Minor,Surgical,Private Health Insurance,,,,,N,42051.20,
New York City,Manhattan,7002054,001464,New York-Presbyterian Hospital - Columbia Presbyterian Center,18 to 29,125,M,White,Not Span/Hispanic,1,Elective,Home or Self Care,2022,NEO073,Benign neoplasms,ENP004,ADRENALECTOMY,401,ADRENAL PROCEDURES,10,"ENDOCRINE, NUTRITIONAL AND METABOLIC DISEASES AND DISORDERS",1,Minor,Minor,Surgical,Blue Cross/Blue Shield,,,,,N,46222.98,13721.47
New York City,Manhattan,7002054,001464,New York-Presbyterian Hospital - Columbia Presbyterian Center,30 to 49,104,F,Other Race,Spanish/Hispanic,6,Elective,Home or Self Care,2022,NEO053,Endocrine system cancers - adrenocortical,GIS015,OMENTECTOMY OR PERITONEUM RESECTION,401,ADRENAL PROCEDURES,10,"ENDOCRINE, NUTRITIONAL AND METABOLIC DISEASES AND DISORDERS",3,Major,Major,Surgical,Private Health Insurance,,,,,N,184531.70,48467.42
New York City,Manhattan,7002054,001464,New York-Presbyterian Hospital - Columbia Presbyterian Center,70 or Older,113,F,Other Race,Unknown,2,Elective,Home or Self Care,2022,NEO073,Benign neoplasms,ENP004,ADRENALECTOMY,401,ADRENAL PROCEDURES,10,"ENDOCRINE, NUTRITIONAL AND METABOLIC DISEASES AND DISORDERS",1,Minor,Minor,Surgical,Medicare,Private Health Insurance,,,,N,75444.75,21413.11
New York City,Manhattan,7002054,001464,New York-Presbyterian Hospital - Columbia Presbyterian Center,30 to 49,OOS,F,White,Not Span/Hispanic,1,Elective,Home or Self Care,2022,END015,Other specified and unspecified endocrine disorders,ENP004,ADRENALECTOMY,401,ADRENAL PROCEDURES,10,"ENDOCRINE, NUTRITIONAL AND METABOLIC DISEASES AND DISORDERS",1,Minor,Minor,Surgical,Blue Cross/Blue Shield,,,,,N,46002.76,
New York City,Manhattan,7002054,001464,New York-Presbyterian Hospital - Columbia Presbyterian Center,50 to 69,OOS,M,Other Race,Unknown,1,Elective,Home or Self Care,2022,END015,Other specified and unspecified endocrine disorders,ENP004,ADRENALECTOMY,401,ADRENAL PROCEDURES,10,"ENDOCRINE, NUTRITIONAL AND METABOLIC DISEASES AND DISORDERS",1,Minor,Minor,Surgical,Blue Cross/Blue Shield,,,,,N,68240.65,18914.29
Finger Lakes,Monroe,2701005,000413,Strong Memorial Hospital,30 to 49,148,M,White,Unknown,1,Elective,Home or Self Care,2022,NEO073,Benign neoplasms,ENP004,ADRENALECTOMY,401,ADRENAL PROCEDURES,10,"ENDOCRINE, NUTRITIONAL AND METABOLIC DISEASES AND DISORDERS",1,Minor,Minor,Surgical,Federal/State/Local/VA,,,,,N,25677.14,12580.74
New York City,Manhattan,7002054,001464,New York-Presbyterian Hospital - Columbia Presbyterian Center,50 to 69,112,F,White,Not Span/Hispanic,1,Elective,Home or Self Care,2022,END015,Other specified and unspecified endocrine disorders,ENP004,ADRENALECTOMY,401,ADRENAL PROCEDURES,10,"ENDOCRINE, NUTRITIONAL AND METABOLIC DISEASES AND DISORDERS",1,Minor,Minor,Surgical,Private Health Insurance,,,,,N,48231.59,
New York City,Manhattan,7002053,001463,NYU Langone Hospitals,50 to 69,OOS,F,White,Not Span/Hispanic,1,Elective,Home or Self Care,2022,NEO073,Benign neoplasms,ENP004,ADRENALECTOMY,401,ADRENAL PROCEDURES,10,"ENDOCRINE, NUTRITIONAL AND METABOLIC DISEASES AND DISORDERS",1,Minor,Minor,Surgical,Private Health Insurance,,,,,N,113223.10,18082.15
New York City,Manhattan,7002053,001463,NYU Langone Hospitals,70 or Older,100,M,White,Not Span/Hispanic,11,Elective,Home or Self Care,2022,NEO073,Benign neoplasms,ENP004,ADRENALECTOMY,401,ADRENAL PROCEDURES,10,"ENDOCRINE, NUTRITIONAL AND METABOLIC DISEASES AND DISORDERS",3,Major,Major,Surgical,Private Health Insurance,,,,,N,444871.29,85138.29
New York City,Manhattan,7002053,001463,NYU Langone Hospitals,30 to 49,103,F,White,Not Span/Hispanic,1,Elective,Home or Self Care,2022,NEO072,Neoplasms of unspecified nature or uncertain behavior,ENP004,ADRENALECTOMY,401,ADRENAL PROCEDURES,10,"ENDOCRINE, NUTRITIONAL AND METABOLIC DISEASES AND DISORDERS",1,Minor,Minor,Surgical,Blue Cross/Blue Shield,,,,,N,136207.97,21559.73
New York City,Manhattan,7002053,001463,NYU Langone Hospitals,30 to 49,112,F,Black/African American,Not Span/Hispanic,5,Elective,Home or Self Care,2022,NEO073,Benign neoplasms,ENP004,ADRENALECTOMY,401,ADRENAL PROCEDURES,10,"ENDOCRINE, NUTRITIONAL AND METABOLIC DISEASES AND DISORDERS",1,Minor,Minor,Surgical,Private Health Insurance,,,,,N,180967.73,38795.38
New York City,Manhattan,7002053,001463,NYU Langone Hospitals,50 to 69,103,F,White,Not Span/Hispanic,2,Elective,Home or Self Care,2022,NEO073,Benign neoplasms,ENP004,ADRENALECTOMY,401,ADRENAL PROCEDURES,10,"ENDOCRINE, NUTRITIONAL AND METABOLIC DISEASES AND DISORDERS",1,Minor,Moderate,Surgical,Medicaid,,,,,N,136912.63,23916.57
New York City,Manhattan,7002053,001463,NYU Langone Hospitals,50 to 69,103,M,White,Not Span/Hispanic,1,Elective,Home or Self Care,2022,NEO073,Benign neoplasms,ENP004,ADRENALECTOMY,401,ADRENAL PROCEDURES,10,"ENDOCRINE, NUTRITIONAL AND METABOLIC DISEASES AND DISORDERS",1,Minor,Minor,Surgical,Medicare,Blue Cross/Blue Shield,,,,N,131383.14,20850.51
New York City,Manhattan,7002053,001463,NYU Langone Hospitals,30 to 49,103,F,Other Race,Not Span/Hispanic,4,Elective,Home or Self Care,2022,NEO073,Benign neoplasms,ENP004,ADRENALECTOMY,401,ADRENAL PROCEDURES,10,"ENDOCRINE, NUTRITIONAL AND METABOLIC DISEASES AND DISORDERS",1,Minor,Minor,Surgical,Blue Cross/Blue Shield,,,,,N,179294.65,36183.20
New York City,Manhattan,7002053,001463,NYU Langone Hospitals,30 to 49,112,M,White,Not Span/Hispanic,1,Elective,Home or Self Care,2022,NEO073,Benign neoplasms,ENP004,ADRENALECTOMY,401,ADRENAL PROCEDURES,10,"ENDOCRINE, NUTRITIONAL AND METABOLIC DISEASES AND DISORDERS",1,Minor,Moderate,Surgical,Blue Cross/Blue Shield,,,,,N,128820.74,20391.03
New York City,Manhattan,7002053,001463,NYU Langone Hospitals,50 to 69,104,M,Black/African American,Not Span/Hispanic,1,Elective,Home or Self Care,2022,NEO073,Benign neoplasms,ENP004,ADRENALECTOMY,401,ADRENAL PROCEDURES,10,"ENDOCRINE, NUTRITIONAL AND METABOLIC DISEASES AND DISORDERS",1,Minor,Minor,Surgical,Private Health Insurance,,,,,N,156926.31,24413.76
New York City,Manhattan,7002053,001463,NYU Langone Hospitals,30 to 49,100,F,Other Race,Not Span/Hispanic,16,Emergency,Home w/ Home Health Services,2022,NEO073,Benign neoplasms,ENP004,ADRENALECTOMY,401,ADRENAL PROCEDURES,10,"ENDOCRINE, NUTRITIONAL AND METABOLIC DISEASES AND DISORDERS",3,Major,Moderate,Surgical,Private Health Insurance,,,,,Y,439170.33,96249.30
New York City,Manhattan,7002054,001464,New York-Presbyterian Hospital - Columbia Presbyterian Center,50 to 69,125,M,White,Not Span/Hispanic,2,Elective,Home or Self Care,2022,NEO073,Benign neoplasms,ENP004,ADRENALECTOMY,401,ADRENAL PROCEDURES,10,"ENDOCRINE, NUTRITIONAL AND METABOLIC DISEASES AND DISORDERS",1,Minor,Minor,Surgical,Blue Cross/Blue Shield,,,,,N,87932.91,29065.22
New York City,Manhattan,7002054,001464,New York-Presbyterian Hospital - Columbia Presbyterian Center,50 to 69,112,F,Black/African American,Not Span/Hispanic,1,Elective,Home or Self Care,2022,NEO073,Benign neoplasms,ENP004,ADRENALECTOMY,401,ADRENAL PROCEDURES,10,"ENDOCRINE, NUTRITIONAL AND METABOLIC DISEASES AND DISORDERS",1,Minor,Moderate,Surgical,Medicare,Medicaid,,,,N,58518.23,17544.64
New York City,Manhattan,7002053,001463,NYU Langone Hospitals,30 to 49,OOS,F,Black/African American,Not Span/Hispanic,1,Elective,Home or Self Care,2022,END015,Other specified and unspecified endocrine disorders,ENP004,ADRENALECTOMY,401,ADRENAL PROCEDURES,10,"ENDOCRINE, NUTRITIONAL AND METABOLIC DISEASES AND DISORDERS",1,Minor,Minor,Surgical,Medicare,,,,,N,118216.72,19079.38
Finger Lakes,Monroe,2701005,000413,Strong Memorial Hospital,70 or Older,148,F,White,Not Span/Hispanic,1,Elective,Home or Self Care,2022,NEO073,Benign neoplasms,ENP004,ADRENALECTOMY,401,ADRENAL PROCEDURES,10,"ENDOCRINE, NUTRITIONAL AND METABOLIC DISEASES AND DISORDERS",1,Minor,Minor,Surgical,Medicare,Blue Cross/Blue Shield,,,,N,27453.54,12949.41
New York City,Manhattan,7002053,001463,NYU Langone Hospitals,30 to 49,115,M,White,Unknown,1,Elective,Home or Self Care,2022,NEO073,Benign neoplasms,ENP004,ADRENALECTOMY,401,ADRENAL PROCEDURES,10,"ENDOCRINE, NUTRITIONAL AND METABOLIC DISEASES AND DISORDERS",1,Minor,Minor,Surgical,Private Health Insurance,,,,,N,124210.04,19131.05
New York City,Manhattan,7002053,001463,NYU Langone Hospitals,30 to 49,112,M,Other Race,Spanish/Hispanic,1,Elective,Home or Self Care,2022,END015,Other specified and unspecified endocrine disorders,ENP004,ADRENALECTOMY,401,ADRENAL PROCEDURES,10,"ENDOCRINE, NUTRITIONAL AND METABOLIC DISEASES AND DISORDERS",1,Minor,Moderate,Surgical,Blue Cross/Blue Shield,Private Health Insurance,,,,N,103988.89,17607.79
New York City,Manhattan,7002053,001463,NYU Langone Hospitals,30 to 49,109,F,White,Not Span/Hispanic,1,Elective,Home or Self Care,2022,NEO073,Benign neoplasms,ENP004,ADRENALECTOMY,401,ADRENAL PROCEDURES,10,"ENDOCRINE, NUTRITIONAL AND METABOLIC DISEASES AND DISORDERS",1,Minor,Minor,Surgical,Medicaid,,,,,N,108201.31,17637.97
New York City,Manhattan,7002053,001463,NYU Langone Hospitals,50 to 69,OOS,M,White,Not Span/Hispanic,1,Elective,Home or Self Care,2022,NEO073,Benign neoplasms,ENP004,ADRENALECTOMY,401,ADRENAL PROCEDURES,10,"ENDOCRINE, NUTRITIONAL AND METABOLIC DISEASES AND DISORDERS",1,Minor,Minor,Surgical,Blue Cross/Blue Shield,,,,,N,116231.05,19112.60
New York City,Manhattan,7002053,001463,NYU Langone Hospitals,50 to 69,100,F,Black/African American,Not Span/Hispanic,1,Elective,Home or Self Care,2022,NEO073,Benign neoplasms,ENP004,ADRENALECTOMY,401,ADRENAL PROCEDURES,10,"ENDOCRINE, NUTRITIONAL AND METABOLIC DISEASES AND DISORDERS",1,Minor,Minor,Surgical,Blue Cross/Blue Shield,Medicare,,,,N,148829.06,21070.23
New York City,Manhattan,7002053,001463,NYU Langone Hospitals,30 to 49,115,F,White,Not Span/Hispanic,1,Elective,Home or Self Care,2022,NEO073,Benign neoplasms,ENP004,ADRENALECTOMY,401,ADRENAL PROCEDURES,10,"ENDOCRINE, NUTRITIONAL AND METABOLIC DISEASES AND DISORDERS",1,Minor,Minor,Surgical,Blue Cross/Blue Shield,,,,,N,113466.52,18422.48
New York City,Manhattan,7002053,001463,NYU Langone Hospitals,70 or Older,109,F,Other Race,Not Span/Hispanic,1,Elective,Home or Self Care,2022,NEO073,Benign neoplasms,ENP004,ADRENALECTOMY,401,ADRENAL PROCEDURES,10,"ENDOCRINE, NUTRITIONAL AND METABOLIC DISEASES AND DISORDERS",1,Minor,Minor,Surgical,Medicare,Private Health Insurance,,,,N,114519.13,17737.84
New York City,Manhattan,7002054,001464,New York-Presbyterian Hospital - Columbia Presbyterian Center,18 to 29,105,F,White,Not Span/Hispanic,1,Elective,Home or Self Care,2022,NEO073,Benign neoplasms,ENP004,ADRENALECTOMY,401,ADRENAL PROCEDURES,10,"ENDOCRINE, NUTRITIONAL AND METABOLIC DISEASES AND DISORDERS",1,Minor,Minor,Surgical,Private Health Insurance,,,,,N,46772.73,13953.78
New York City,Manhattan,7002053,001463,NYU Langone Hospitals,30 to 49,112,F,White,Not Span/Hispanic,1,Elective,Home or Self Care,2022,END015,Other specified and unspecified endocrine disorders,ENP004,ADRENALECTOMY,401,ADRENAL PROCEDURES,10,"ENDOCRINE, NUTRITIONAL AND METABOLIC DISEASES AND DISORDERS",1,Minor,Minor,Surgical,Medicaid,,,,,N,110334.88,17751.95
New York City,Manhattan,7002053,001463,NYU Langone Hospitals,50 to 69,103,F,White,Not Span/Hispanic,1,Elective,Home or Self Care,2022,NEO073,Benign neoplasms,ENP004,ADRENALECTOMY,401,ADRENAL PROCEDURES,10,"ENDOCRINE, NUTRITIONAL AND METABOLIC DISEASES AND DISORDERS",1,Minor,Minor,Surgical,Medicare,,,,,N,120369.69,18965.83
Hudson Valley,Dutchess,1302001,000181,Vassar Brothers Medical Center,70 or Older,125,F,White,Not Span/Hispanic,1,Elective,Home or Self Care,2022,NEO072,Neoplasms of unspecified nature or uncertain behavior,ENP004,ADRENALECTOMY,401,ADRENAL PROCEDURES,10,"ENDOCRINE, NUTRITIONAL AND METABOLIC DISEASES AND DISORDERS",1,Minor,Minor,Surgical,Medicare,,,,,N,153789.57,71900.17
New York City,Manhattan,7002054,001464,New York-Presbyterian Hospital - Columbia Presbyterian Center,70 or Older,OOS,F,White,Not Span/Hispanic,1,Elective,Home or Self Care,2022,NEO073,Benign neoplasms,ENP004,ADRENALECTOMY,401,ADRENAL PROCEDURES,10,"ENDOCRINE, NUTRITIONAL AND METABOLIC DISEASES AND DISORDERS",1,Minor,Minor,Surgical,Medicare,Private Health Insurance,,,,N,49609.99,14682.30
New York City,Manhattan,7002053,001463,NYU Langone Hospitals,50 to 69,117,F,White,Not Span/Hispanic,2,Elective,Home or Self Care,2022,NEO073,Benign neoplasms,ENP004,ADRENALECTOMY,401,ADRENAL PROCEDURES,10,"ENDOCRINE, NUTRITIONAL AND METABOLIC DISEASES AND DISORDERS",2,Moderate,Moderate,Surgical,Medicare,,,,,N,149255.05,27821.91