Hospital Service Area,Hospital County,Operating Certificate Number,Permanent Facility Id,Facility Name,Age Group,Zip Code - 3 digits,Gender,Race,Ethnicity,Length of Stay,Type of Admission,Patient Disposition,Discharge Year,CCS Diagnosis Code,CCS Diagnosis Description,CCS Procedure Code,CCS Procedure Description,APR DRG Code,APR DRG Description,APR MDC Code,APR MDC Description,APR Severity of Illness Code,APR Severity of Illness Description,APR Risk of Mortality,APR Medical Surgical Description,Payment Typology 1,Payment Typology 2,Payment Typology 3,Birth Weight,Abortion Edit Indicator,Emergency Department Indicator,Total Charges,Total Costs
New York City,Manhattan,7002054,001464,New York-Presbyterian Hospital - Columbia Presbyterian Center,0 to 17,100,F,White,Not Span/Hispanic,34,Emergency,Expired,2022,NEO048,Nervous system cancers - brain,IMG005,MAGNETIC RESONANCE IMAGING (MRI),041,NERVOUS SYSTEM MALIGNANCY,01,DISEASES AND DISORDERS OF THE NERVOUS SYSTEM,4,Extreme,Extreme,Medical,Medicaid,,,,,Y,478039.14,178303.80
New York City,Manhattan,7002054,001464,New York-Presbyterian Hospital - Columbia Presbyterian Center,50 to 69,100,M,Black/African American,Not Span/Hispanic,7,Emergency,Skilled Nursing Home,2022,NEO070,Secondary malignancies,OTR004,ISOLATION PROCEDURES,041,NERVOUS SYSTEM MALIGNANCY,01,DISEASES AND DISORDERS OF THE NERVOUS SYSTEM,4,Extreme,Major,Medical,Medicare,Medicaid,,,,Y,142159.16,30834.00
New York City,Manhattan,7002001,001438,Bellevue Hospital Center,30 to 49,100,F,Black/African American,Unknown,29,Emergency,Hospice - Medical Facility,2022,NEO070,Secondary malignancies,IMG005,MAGNETIC RESONANCE IMAGING (MRI),041,NERVOUS SYSTEM MALIGNANCY,01,DISEASES AND DISORDERS OF THE NERVOUS SYSTEM,4,Extreme,Extreme,Medical,Medicare,Medicaid,,,,Y,216169.45,124315.59
New York City,Manhattan,7002001,001438,Bellevue Hospital Center,30 to 49,113,F,Other Race,Spanish/Hispanic,9,Emergency,Home or Self Care,2022,NEO070,Secondary malignancies,IMG005,MAGNETIC RESONANCE IMAGING (MRI),041,NERVOUS SYSTEM MALIGNANCY,01,DISEASES AND DISORDERS OF THE NERVOUS SYSTEM,4,Extreme,Major,Medical,Medicaid,,,,,Y,76902.93,44225.64
New York City,Manhattan,7002054,001464,New York-Presbyterian Hospital - Columbia Presbyterian Center,30 to 49,105,M,Black/African American,Not Span/Hispanic,7,Emergency,Home or Self Care,2022,NEO070,Secondary malignancies,RES005,CHEST TUBE PLACEMENT AND THERAPEUTIC THORACENTESIS,041,NERVOUS SYSTEM MALIGNANCY,01,DISEASES AND DISORDERS OF THE NERVOUS SYSTEM,4,Extreme,Extreme,Medical,Medicaid,,,,,Y,221280.45,55859.70
New York City,Manhattan,7002001,001438,Bellevue Hospital Center,50 to 69,113,F,Other Race,Spanish/Hispanic,10,Emergency,Home or Self Care,2022,NEO048,Nervous system cancers - brain,IMG007,COMPUTERIZED TOMOGRAPHY (CT) WITHOUT CONTRAST,041,NERVOUS SYSTEM MALIGNANCY,01,DISEASES AND DISORDERS OF THE NERVOUS SYSTEM,3,Major,Major,Medical,Medicaid,,,,,Y,72818.06,41876.50
New York City,Manhattan,7002054,001464,New York-Presbyterian Hospital - Columbia Presbyterian Center,50 to 69,OOS,F,Other Race,Unknown,7,Emergency,Hospice - Medical Facility,2022,NEO070,Secondary malignancies,,,041,NERVOUS SYSTEM MALIGNANCY,01,DISEASES AND DISORDERS OF THE NERVOUS SYSTEM,3,Major,Major,Medical,Private Health Insurance,Medicare,,,,Y,106541.83,22757.25
Finger Lakes,Monroe,2701005,000413,Strong Memorial Hospital,50 to 69,142,M,White,Not Span/Hispanic,1,Elective,Home or Self Care,2022,NEO048,Nervous system cancers - brain,CNS001,MINIMALLY INVASIVE CNS BIOPSY,041,NERVOUS SYSTEM MALIGNANCY,01,DISEASES AND DISORDERS OF THE NERVOUS SYSTEM,2,Moderate,Minor,Medical,Blue Cross/Blue Shield,,,,,N,34004.27,14444.74
Finger Lakes,Monroe,2701005,000413,Strong Memorial Hospital,50 to 69,148,F,White,Unknown,15,Emergency,Hospice - Medical Facility,2022,NEO070,Secondary malignancies,CNS002,LUMBAR PUNCTURE,041,NERVOUS SYSTEM MALIGNANCY,01,DISEASES AND DISORDERS OF THE NERVOUS SYSTEM,4,Extreme,Major,Medical,Blue Cross/Blue Shield,,,,,Y,85378.89,30245.80
Finger Lakes,Monroe,2701005,000413,Strong Memorial Hospital,50 to 69,145,F,White,Not Span/Hispanic,3,Emergency,Home or Self Care,2022,NEO070,Secondary malignancies,,,041,NERVOUS SYSTEM MALIGNANCY,01,DISEASES AND DISORDERS OF THE NERVOUS SYSTEM,2,Moderate,Moderate,Medical,Medicaid,,,,,Y,27791.63,8215.05
Finger Lakes,Monroe,2701005,000413,Strong Memorial Hospital,50 to 69,146,F,Black/African American,Not Span/Hispanic,4,Emergency,Expired,2022,NEO070,Secondary malignancies,,,041,NERVOUS SYSTEM MALIGNANCY,01,DISEASES AND DISORDERS OF THE NERVOUS SYSTEM,3,Major,Major,Medical,Blue Cross/Blue Shield,,,,,Y,18537.72,6974.10
Finger Lakes,Monroe,2701005,000413,Strong Memorial Hospital,70 or Older,144,M,White,Not Span/Hispanic,1,Emergency,Home or Self Care,2022,NEO048,Nervous system cancers - brain,,,041,NERVOUS SYSTEM MALIGNANCY,01,DISEASES AND DISORDERS OF THE NERVOUS SYSTEM,3,Major,Major,Medical,Medicare,,,,,Y,13783.40,3437.38
Finger Lakes,Monroe,2701005,000413,Strong Memorial Hospital,70 or Older,144,M,White,Not Span/Hispanic,1,Elective,Home or Self Care,2022,NEO048,Nervous system cancers - brain,CNS001,MINIMALLY INVASIVE CNS BIOPSY,041,NERVOUS SYSTEM MALIGNANCY,01,DISEASES AND DISORDERS OF THE NERVOUS SYSTEM,1,Minor,Minor,Medical,Medicare,,,,,N,23521.20,12000.10
Finger Lakes,Monroe,2701005,000413,Strong Memorial Hospital,50 to 69,146,M,Black/African American,Not Span/Hispanic,7,Emergency,Home or Self Care,2022,NEO070,Secondary malignancies,,,041,NERVOUS SYSTEM MALIGNANCY,01,DISEASES AND DISORDERS OF THE NERVOUS SYSTEM,4,Extreme,Major,Medical,Medicare,Blue Cross/Blue Shield,,,,Y,27041.13,10994.02
Finger Lakes,Monroe,2701005,000413,Strong Memorial Hospital,50 to 69,146,F,White,Not Span/Hispanic,1,Emergency,Home or Self Care,2022,NEO048,Nervous system cancers - brain,,,041,NERVOUS SYSTEM MALIGNANCY,01,DISEASES AND DISORDERS OF THE NERVOUS SYSTEM,2,Moderate,Moderate,Medical,Blue Cross/Blue Shield,,,,,Y,13629.94,3722.51
Finger Lakes,Monroe,2701005,000413,Strong Memorial Hospital,70 or Older,144,M,White,Not Span/Hispanic,24,Emergency,Hospice - Medical Facility,2022,NEO048,Nervous system cancers - brain,,,041,NERVOUS SYSTEM MALIGNANCY,01,DISEASES AND DISORDERS OF THE NERVOUS SYSTEM,4,Extreme,Extreme,Medical,Medicare,,,,,Y,81900.20,36728.04
Finger Lakes,Monroe,2701005,000413,Strong Memorial Hospital,70 or Older,146,M,White,Not Span/Hispanic,7,Emergency,Home w/ Home Health Services,2022,NEO048,Nervous system cancers - brain,,,041,NERVOUS SYSTEM MALIGNANCY,01,DISEASES AND DISORDERS OF THE NERVOUS SYSTEM,3,Major,Extreme,Medical,Medicare,,,,,Y,43995.17,14916.72
New York City,Manhattan,7002053,001463,NYU Langone Hospitals,50 to 69,114,F,Black/African American,Not Span/Hispanic,3,Emergency,Home w/ Home Health Services,2022,NEO070,Secondary malignancies,MAM011,ELECTROENCEPHALOGRAM (EEG),041,NERVOUS SYSTEM MALIGNANCY,01,DISEASES AND DISORDERS OF THE NERVOUS SYSTEM,4,Extreme,Major,Medical,Medicare,Medicaid,,,,Y,119381.49,19899.60
New York City,Manhattan,7002001,001438,Bellevue Hospital Center,50 to 69,100,M,Other Race,Not Span/Hispanic,4,Emergency,Home or Self Care,2022,NEO070,Secondary malignancies,MAM007,ELECTROCARDIOGRAM (ECG),041,NERVOUS SYSTEM MALIGNANCY,01,DISEASES AND DISORDERS OF THE NERVOUS SYSTEM,2,Moderate,Moderate,Medical,Medicare,,,,,Y,38266.62,22006.52
New York City,Manhattan,7002001,001438,Bellevue Hospital Center,50 to 69,113,F,Other Race,Spanish/Hispanic,1,Emergency,Home or Self Care,2022,NEO048,Nervous system cancers - brain,ADM015,ADMINISTRATION OF ANTIBIOTICS,041,NERVOUS SYSTEM MALIGNANCY,01,DISEASES AND DISORDERS OF THE NERVOUS SYSTEM,1,Minor,Minor,Medical,Medicaid,,,,,Y,9530.83,5481.03
New York City,Manhattan,7002001,001438,Bellevue Hospital Center,50 to 69,100,F,Other Race,Spanish/Hispanic,9,Emergency,Home or Self Care,2022,NEO070,Secondary malignancies,IMG005,MAGNETIC RESONANCE IMAGING (MRI),041,NERVOUS SYSTEM MALIGNANCY,01,DISEASES AND DISORDERS OF THE NERVOUS SYSTEM,3,Major,Major,Medical,Medicaid,,,,,Y,87276.79,50191.49
Finger Lakes,Monroe,2701005,000413,Strong Memorial Hospital,50 to 69,147,M,White,Not Span/Hispanic,1,Emergency,Home or Self Care,2022,NEO070,Secondary malignancies,,,041,NERVOUS SYSTEM MALIGNANCY,01,DISEASES AND DISORDERS OF THE NERVOUS SYSTEM,2,Moderate,Moderate,Medical,Blue Cross/Blue Shield,,,,,Y,18471.71,4488.51
New York City,Manhattan,7002001,001438,Bellevue Hospital Center,30 to 49,113,F,Other Race,Spanish/Hispanic,10,Emergency,Home or Self Care,2022,NEO070,Secondary malignancies,IMG005,MAGNETIC RESONANCE IMAGING (MRI),041,NERVOUS SYSTEM MALIGNANCY,01,DISEASES AND DISORDERS OF THE NERVOUS SYSTEM,4,Extreme,Major,Medical,Medicaid,,,,,Y,93049.26,53511.14
New York City,Manhattan,7002053,001463,NYU Langone Hospitals,70 or Older,104,F,Other Race,Not Span/Hispanic,3,Emergency,Home w/ Home Health Services,2022,NEO048,Nervous system cancers - brain,MAM011,ELECTROENCEPHALOGRAM (EEG),041,NERVOUS SYSTEM MALIGNANCY,01,DISEASES AND DISORDERS OF THE NERVOUS SYSTEM,4,Extreme,Major,Medical,Medicare,,,,,N,78456.86,16191.74
New York City,Manhattan,7002053,001463,NYU Langone Hospitals,0 to 17,112,F,White,Not Span/Hispanic,8,Emergency,Home w/ Home Health Services,2022,NEO048,Nervous system cancers - brain,,,041,NERVOUS SYSTEM MALIGNANCY,01,DISEASES AND DISORDERS OF THE NERVOUS SYSTEM,3,Major,Major,Medical,Medicaid,,,,,Y,83876.09,25784.95
New York City,Manhattan,7002054,001464,New York-Presbyterian Hospital - Columbia Presbyterian Center,70 or Older,104,F,Other Race,Spanish/Hispanic,15,Emergency,Hospice - Medical Facility,2022,NEO048,Nervous system cancers - brain,MAM011,ELECTROENCEPHALOGRAM (EEG),041,NERVOUS SYSTEM MALIGNANCY,01,DISEASES AND DISORDERS OF THE NERVOUS SYSTEM,3,Major,Major,Medical,Medicare,,,,,Y,185414.69,40131.13
New York City,Manhattan,7002054,001464,New York-Presbyterian Hospital - Columbia Presbyterian Center,70 or Older,100,M,Other Race,Spanish/Hispanic,7,Emergency,Home or Self Care,2022,NEO048,Nervous system cancers - brain,MAM011,ELECTROENCEPHALOGRAM (EEG),041,NERVOUS SYSTEM MALIGNANCY,01,DISEASES AND DISORDERS OF THE NERVOUS SYSTEM,3,Major,Major,Medical,Medicare,,,,,Y,131769.32,27634.87
New York City,Manhattan,7002054,001464,New York-Presbyterian Hospital - Columbia Presbyterian Center,50 to 69,OOS,F,White,Not Span/Hispanic,13,Elective,Home or Self Care,2022,NEO048,Nervous system cancers - brain,CNS001,MINIMALLY INVASIVE CNS BIOPSY,041,NERVOUS SYSTEM MALIGNANCY,01,DISEASES AND DISORDERS OF THE NERVOUS SYSTEM,3,Major,Moderate,Medical,Private Health Insurance,,,,,N,404021.17,159464.43
New York City,Manhattan,7002053,001463,NYU Langone Hospitals,30 to 49,113,M,White,Not Span/Hispanic,4,Emergency,Home w/ Home Health Services,2022,NEO048,Nervous system cancers - brain,MAM011,ELECTROENCEPHALOGRAM (EEG),041,NERVOUS SYSTEM MALIGNANCY,01,DISEASES AND DISORDERS OF THE NERVOUS SYSTEM,3,Major,Major,Medical,Private Health Insurance,,,,,Y,111431.64,23329.22
New York City,Manhattan,7002053,001463,NYU Langone Hospitals,70 or Older,103,F,White,Not Span/Hispanic,6,Emergency,Inpatient Rehabilitation Facility,2022,NEO048,Nervous system cancers - brain,CNS001,MINIMALLY INVASIVE CNS BIOPSY,041,NERVOUS SYSTEM MALIGNANCY,01,DISEASES AND DISORDERS OF THE NERVOUS SYSTEM,2,Moderate,Major,Medical,Medicare,Private Health Insurance,,,,Y,206627.04,50151.54
New York City,Manhattan,7002001,001438,Bellevue Hospital Center,50 to 69,112,F,Other Race,Spanish/Hispanic,8,Emergency,Home or Self Care,2022,NEO070,Secondary malignancies,IMG005,MAGNETIC RESONANCE IMAGING (MRI),041,NERVOUS SYSTEM MALIGNANCY,01,DISEASES AND DISORDERS OF THE NERVOUS SYSTEM,3,Major,Extreme,Medical,Medicare,Medicaid,,,,Y,63053.68,36261.16
Finger Lakes,Monroe,2701005,000413,Strong Memorial Hospital,50 to 69,148,M,White,Not Span/Hispanic,2,Emergency,Home or Self Care,2022,NEO070,Secondary malignancies,,,041,NERVOUS SYSTEM MALIGNANCY,01,DISEASES AND DISORDERS OF THE NERVOUS SYSTEM,3,Major,Extreme,Medical,Medicare,,,,,Y,29943.75,7727.31
Finger Lakes,Monroe,2701005,000413,Strong Memorial Hospital,70 or Older,146,M,White,Not Span/Hispanic,1,Emergency,Hospice - Medical Facility,2022,NEO048,Nervous system cancers - brain,,,041,NERVOUS SYSTEM MALIGNANCY,01,DISEASES AND DISORDERS OF THE NERVOUS SYSTEM,2,Moderate,Moderate,Medical,Medicare,,,,,Y,7955.43,2692.58
Finger Lakes,Monroe,2701005,000413,Strong Memorial Hospital,70 or Older,146,F,White,Not Span/Hispanic,6,Emergency,Expired,2022,NEO070,Secondary malignancies,ADM012,CHEMOTHERAPY,041,NERVOUS SYSTEM MALIGNANCY,01,DISEASES AND DISORDERS OF THE NERVOUS SYSTEM,4,Extreme,Extreme,Medical,Medicare,Private Health Insurance,,,,Y,72625.42,23124.14
Finger Lakes,Monroe,2701005,000413,Strong Memorial Hospital,70 or Older,144,F,White,Not Span/Hispanic,1,Emergency,Skilled Nursing Home,2022,NEO070,Secondary malignancies,,,041,NERVOUS SYSTEM MALIGNANCY,01,DISEASES AND DISORDERS OF THE NERVOUS SYSTEM,4,Extreme,Extreme,Medical,Medicare,,,,,Y,9333.63,2648.17
Finger Lakes,Monroe,2701005,000413,Strong Memorial Hospital,70 or Older,144,M,White,Not Span/Hispanic,4,Urgent,Hospice - Home,2022,NEO048,Nervous system cancers - brain,,,041,NERVOUS SYSTEM MALIGNANCY,01,DISEASES AND DISORDERS OF THE NERVOUS SYSTEM,3,Major,Major,Medical,Medicare,Private Health Insurance,,,,N,8077.80,5006.70
New York City,Manhattan,7002054,001464,New York-Presbyterian Hospital - Columbia Presbyterian Center,50 to 69,OOS,M,White,Not Span/Hispanic,16,Emergency,Hospice - Medical Facility,2022,NEO056,Endocrine system cancers - all other types,ADM015,ADMINISTRATION OF ANTIBIOTICS,041,NERVOUS SYSTEM MALIGNANCY,01,DISEASES AND DISORDERS OF THE NERVOUS SYSTEM,3,Major,Major,Medical,Private Health Insurance,,,,,Y,256600.19,54755.54
New York City,Manhattan,7002054,001464,New York-Presbyterian Hospital - Columbia Presbyterian Center,50 to 69,104,F,Other Race,Unknown,2,Emergency,Home w/ Home Health Services,2022,NEO048,Nervous system cancers - brain,,,041,NERVOUS SYSTEM MALIGNANCY,01,DISEASES AND DISORDERS OF THE NERVOUS SYSTEM,3,Major,Major,Medical,Medicare,,,,,Y,41800.74,8895.35
Finger Lakes,Monroe,2701005,000413,Strong Memorial Hospital,70 or Older,145,F,Other Race,Not Span/Hispanic,12,Emergency,Hospice - Home,2022,NEO048,Nervous system cancers - brain,ESA001,HEMODIALYSIS,041,NERVOUS SYSTEM MALIGNANCY,01,DISEASES AND DISORDERS OF THE NERVOUS SYSTEM,3,Major,Extreme,Medical,Medicare,,,,,Y,83211.87,31792.53
New York City,Manhattan,7002054,001464,New York-Presbyterian Hospital - Columbia Presbyterian Center,30 to 49,105,M,White,Not Span/Hispanic,1,Urgent,Home or Self Care,2022,NEO048,Nervous system cancers - brain,CNS001,MINIMALLY INVASIVE CNS BIOPSY,041,NERVOUS SYSTEM MALIGNANCY,01,DISEASES AND DISORDERS OF THE NERVOUS SYSTEM,1,Minor,Minor,Medical,Private Health Insurance,,,,,N,152839.86,63064.25
New York City,Manhattan,7002054,001464,New York-Presbyterian Hospital - Columbia Presbyterian Center,70 or Older,104,F,Black/African American,Not Span/Hispanic,3,Emergency,Home w/ Home Health Services,2022,NEO070,Secondary malignancies,,,041,NERVOUS SYSTEM MALIGNANCY,01,DISEASES AND DISORDERS OF THE NERVOUS SYSTEM,3,Major,Major,Medical,Medicare,,,,,Y,51334.71,11010.45
New York City,Manhattan,7002054,001464,New York-Presbyterian Hospital - Columbia Presbyterian Center,70 or Older,113,M,White,Not Span/Hispanic,1,Urgent,Expired,2022,NEO048,Nervous system cancers - brain,ADM021,"ADMINISTRATION OF THERAPEUTIC SUBSTANCES, NEC",041,NERVOUS SYSTEM MALIGNANCY,01,DISEASES AND DISORDERS OF THE NERVOUS SYSTEM,2,Moderate,Major,Medical,Medicare,Private Health Insurance,,,,N,11011.92,2412.80
New York City,Manhattan,7002053,001463,NYU Langone Hospitals,70 or Older,100,F,White,Spanish/Hispanic,3,Emergency,Hospice - Home,2022,NEO070,Secondary malignancies,,,041,NERVOUS SYSTEM MALIGNANCY,01,DISEASES AND DISORDERS OF THE NERVOUS SYSTEM,3,Major,Major,Medical,Medicare,Medicaid,,,,Y,109413.39,30736.05
New York City,Manhattan,7002054,001464,New York-Presbyterian Hospital - Columbia Presbyterian Center,70 or Older,OOS,M,Other Race,Spanish/Hispanic,5,Emergency,Home or Self Care,2022,NEO048,Nervous system cancers - brain,,,041,NERVOUS SYSTEM MALIGNANCY,01,DISEASES AND DISORDERS OF THE NERVOUS SYSTEM,2,Moderate,Major,Medical,Private Health Insurance,,,,,N,91799.12,23690.83
New York City,Manhattan,7002054,001464,New York-Presbyterian Hospital - Columbia Presbyterian Center,70 or Older,109,F,Other Race,Not Span/Hispanic,12,Emergency,Inpatient Rehabilitation Facility,2022,NEO048,Nervous system cancers - brain,CNS002,LUMBAR PUNCTURE,041,NERVOUS SYSTEM MALIGNANCY,01,DISEASES AND DISORDERS OF THE NERVOUS SYSTEM,3,Major,Major,Medical,Medicare,,,,,Y,253256.53,60063.82
New York City,Manhattan,7002054,001464,New York-Presbyterian Hospital - Columbia Presbyterian Center,70 or Older,113,M,White,Not Span/Hispanic,16,Urgent,Hospice - Medical Facility,2022,NEO048,Nervous system cancers - brain,MAM011,ELECTROENCEPHALOGRAM (EEG),041,NERVOUS SYSTEM MALIGNANCY,01,DISEASES AND DISORDERS OF THE NERVOUS SYSTEM,4,Extreme,Extreme,Medical,Medicare,Private Health Insurance,,,,N,332716.89,102939.10
Long Island,Nassau,2951001,000541,North Shore University Hospital,70 or Older,114,F,White,Not Span/Hispanic,4,Emergency,Skilled Nursing Home,2022,NEO048,Nervous system cancers - brain,OTR004,ISOLATION PROCEDURES,041,NERVOUS SYSTEM MALIGNANCY,01,DISEASES AND DISORDERS OF THE NERVOUS SYSTEM,2,Moderate,Major,Medical,Medicare,Blue Cross/Blue Shield,,,,Y,69677.52,10067.86
Long Island,Nassau,2951001,000541,North Shore University Hospital,30 to 49,114,F,Other Race,Not Span/Hispanic,6,Emergency,Inpatient Rehabilitation Facility,2022,NEO048,Nervous system cancers - brain,,,041,NERVOUS SYSTEM MALIGNANCY,01,DISEASES AND DISORDERS OF THE NERVOUS SYSTEM,3,Major,Moderate,Medical,Medicare,Medicare,Medicaid,,,Y,81720.52,13724.75
Long Island,Nassau,2951001,000541,North Shore University Hospital,50 to 69,113,F,White,Not Span/Hispanic,7,Emergency,Home or Self Care,2022,NEO070,Secondary malignancies,CNS002,LUMBAR PUNCTURE,041,NERVOUS SYSTEM MALIGNANCY,01,DISEASES AND DISORDERS OF THE NERVOUS SYSTEM,2,Moderate,Major,Medical,Medicare,Blue Cross/Blue Shield,,,,Y,108631.48,16180.82
Long Island,Nassau,2951001,000541,North Shore University Hospital,50 to 69,113,F,Other Race,Unknown,1,Emergency,Home or Self Care,2022,NEO070,Secondary malignancies,,,041,NERVOUS SYSTEM MALIGNANCY,01,DISEASES AND DISORDERS OF THE NERVOUS SYSTEM,3,Major,Moderate,Medical,Private Health Insurance,,,,,Y,35129.32,4331.10
Long Island,Nassau,2951001,000541,North Shore University Hospital,30 to 49,113,M,Other Race,Not Span/Hispanic,1,Emergency,Left Against Medical Advice,2022,NEO070,Secondary malignancies,,,041,NERVOUS SYSTEM MALIGNANCY,01,DISEASES AND DISORDERS OF THE NERVOUS SYSTEM,2,Moderate,Major,Medical,Medicaid,Medicaid,,,,Y,42833.55,5277.75
Long Island,Nassau,2951001,000541,North Shore University Hospital,70 or Older,113,M,White,Not Span/Hispanic,15,Elective,Skilled Nursing Home,2022,NEO070,Secondary malignancies,MAM011,ELECTROENCEPHALOGRAM (EEG),041,NERVOUS SYSTEM MALIGNANCY,01,DISEASES AND DISORDERS OF THE NERVOUS SYSTEM,3,Major,Major,Medical,Medicare,Private Health Insurance,,,,N,309333.56,42998.51
Long Island,Nassau,2951001,000541,North Shore University Hospital,50 to 69,114,M,Other Race,Not Span/Hispanic,1,Emergency,Home or Self Care,2022,NEO048,Nervous system cancers - brain,,,041,NERVOUS SYSTEM MALIGNANCY,01,DISEASES AND DISORDERS OF THE NERVOUS SYSTEM,1,Minor,Moderate,Medical,Private Health Insurance,,,,,Y,27334.52,3490.44
Finger Lakes,Monroe,2701005,000413,Strong Memorial Hospital,50 to 69,145,M,White,Unknown,1,Elective,Home or Self Care,2022,NEO048,Nervous system cancers - brain,CNS001,MINIMALLY INVASIVE CNS BIOPSY,041,NERVOUS SYSTEM MALIGNANCY,01,DISEASES AND DISORDERS OF THE NERVOUS SYSTEM,2,Moderate,Minor,Medical,Blue Cross/Blue Shield,,,,,N,31383.90,13141.01
Finger Lakes,Monroe,2701005,000413,Strong Memorial Hospital,50 to 69,146,M,Black/African American,Not Span/Hispanic,1,Emergency,Expired,2022,NEO070,Secondary malignancies,ESA004,NON-INVASIVE VENTILATION,041,NERVOUS SYSTEM MALIGNANCY,01,DISEASES AND DISORDERS OF THE NERVOUS SYSTEM,3,Major,Major,Medical,Private Health Insurance,,,,,Y,17701.10,5265.65
New York City,Manhattan,7002054,001464,New York-Presbyterian Hospital - Columbia Presbyterian Center,70 or Older,100,M,Other Race,Spanish/Hispanic,2,Elective,Home w/ Home Health Services,2022,NEO048,Nervous system cancers - brain,CNS001,MINIMALLY INVASIVE CNS BIOPSY,041,NERVOUS SYSTEM MALIGNANCY,01,DISEASES AND DISORDERS OF THE NERVOUS SYSTEM,2,Moderate,Moderate,Medical,Medicare,,,,,N,78729.06,20433.49
New York City,Manhattan,7002053,001463,NYU Langone Hospitals,70 or Older,112,M,White,Not Span/Hispanic,1,Emergency,Hospice - Home,2022,NEO048,Nervous system cancers - brain,,,041,NERVOUS SYSTEM MALIGNANCY,01,DISEASES AND DISORDERS OF THE NERVOUS SYSTEM,3,Major,Moderate,Medical,Medicare,,,,,Y,59084.43,15565.73
New York City,Manhattan,7002053,001463,NYU Langone Hospitals,70 or Older,100,M,White,Not Span/Hispanic,5,Emergency,Skilled Nursing Home,2022,NEO048,Nervous system cancers - brain,CNS001,MINIMALLY INVASIVE CNS BIOPSY,041,NERVOUS SYSTEM MALIGNANCY,01,DISEASES AND DISORDERS OF THE NERVOUS SYSTEM,3,Major,Major,Medical,Medicare,Medicare,,,,Y,219415.20,42402.63
New York City,Manhattan,7002054,001464,New York-Presbyterian Hospital - Columbia Presbyterian Center,70 or Older,112,M,Other Race,Not Span/Hispanic,6,Emergency,Hospice - Medical Facility,2022,NEO070,Secondary malignancies,ADM015,ADMINISTRATION OF ANTIBIOTICS,041,NERVOUS SYSTEM MALIGNANCY,01,DISEASES AND DISORDERS OF THE NERVOUS SYSTEM,3,Major,Major,Medical,Medicare,Medicaid,,,,Y,109443.86,23080.28
New York City,Manhattan,7002054,001464,New York-Presbyterian Hospital - Columbia Presbyterian Center,0 to 17,112,M,White,Not Span/Hispanic,17,Emergency,Home or Self Care,2022,NEO048,Nervous system cancers - brain,CAR024,VENOUS AND ARTERIAL CATHETER PLACEMENT,041,NERVOUS SYSTEM MALIGNANCY,01,DISEASES AND DISORDERS OF THE NERVOUS SYSTEM,3,Major,Major,Medical,Medicaid,,,,,Y,314775.36,92715.54
Hudson Valley,Dutchess,1302001,000181,Vassar Brothers Medical Center,50 to 69,105,F,White,Not Span/Hispanic,7,Urgent,Home or Self Care,2022,NEO048,Nervous system cancers - brain,,,041,NERVOUS SYSTEM MALIGNANCY,01,DISEASES AND DISORDERS OF THE NERVOUS SYSTEM,2,Moderate,Minor,Medical,Private Health Insurance,,,,,N,42131.35,17184.16
Hudson Valley,Dutchess,1302001,000181,Vassar Brothers Medical Center,70 or Older,125,M,White,Not Span/Hispanic,10,Emergency,Home or Self Care,2022,NEO048,Nervous system cancers - brain,,,041,NERVOUS SYSTEM MALIGNANCY,01,DISEASES AND DISORDERS OF THE NERVOUS SYSTEM,3,Major,Moderate,Medical,Medicare,Federal/State/Local/VA,,,,Y,53257.47,20799.31
Capital/Adirond,Warren,5601000,001005,Glens Falls Hospital,50 to 69,128,M,White,Not Span/Hispanic,1,Emergency,Home or Self Care,2022,NEO070,Secondary malignancies,,,041,NERVOUS SYSTEM MALIGNANCY,01,DISEASES AND DISORDERS OF THE NERVOUS SYSTEM,2,Moderate,Moderate,Medical,Medicare,,,,,Y,9552.05,2590.79
Capital/Adirond,Warren,5601000,001005,Glens Falls Hospital,70 or Older,128,M,White,Not Span/Hispanic,3,Emergency,Short-term Hospital,2022,NEO048,Nervous system cancers - brain,,,041,NERVOUS SYSTEM MALIGNANCY,01,DISEASES AND DISORDERS OF THE NERVOUS SYSTEM,4,Extreme,Major,Medical,Medicare,,,,,Y,17711.21,5744.07
Capital/Adirond,Warren,5601000,001005,Glens Falls Hospital,70 or Older,128,F,White,Not Span/Hispanic,2,Emergency,Short-term Hospital,2022,NEO070,Secondary malignancies,,,041,NERVOUS SYSTEM MALIGNANCY,01,DISEASES AND DISORDERS OF THE NERVOUS SYSTEM,3,Major,Major,Medical,Medicare,Self-Pay,,,,Y,15444.38,4639.51
Capital/Adirond,Warren,5601000,001005,Glens Falls Hospital,50 to 69,128,F,White,Not Span/Hispanic,3,Emergency,Home or Self Care,2022,NEO070,Secondary malignancies,,,041,NERVOUS SYSTEM MALIGNANCY,01,DISEASES AND DISORDERS OF THE NERVOUS SYSTEM,3,Major,Major,Medical,Medicaid,,,,,Y,16356.65,5751.78