Hospital Service Area,Hospital County,Operating Certificate Number,Permanent Facility Id,Facility Name,Age Group,Zip Code - 3 digits,Gender,Race,Ethnicity,Length of Stay,Type of Admission,Patient Disposition,Discharge Year,CCS Diagnosis Code,CCS Diagnosis Description,CCS Procedure Code,CCS Procedure Description,APR DRG Code,APR DRG Description,APR MDC Code,APR MDC Description,APR Severity of Illness Code,APR Severity of Illness Description,APR Risk of Mortality,APR Medical Surgical Description,Payment Typology 1,Payment Typology 2,Payment Typology 3,Birth Weight,Abortion Edit Indicator,Emergency Department Indicator,Total Charges,Total Costs
New York City,Manhattan,7002054,001464,New York-Presbyterian Hospital - Columbia Presbyterian Center,30 to 49,104,M,Black/African American,Not Span/Hispanic,1,Emergency,Left Against Medical Advice,2022,END003,Diabetes mellitus with complication,,,420,DIABETES,10,"ENDOCRINE, NUTRITIONAL AND METABOLIC DISEASES AND DISORDERS",2,Moderate,Moderate,Medical,Medicaid,,,,,Y,19134.26,4097.57
New York City,Manhattan,7002054,001464,New York-Presbyterian Hospital - Columbia Presbyterian Center,30 to 49,100,F,White,Spanish/Hispanic,1,Emergency,Home or Self Care,2022,END003,Diabetes mellitus with complication,ADM007,INTRAVENOUS INDUCTION OF LABOR,420,DIABETES,10,"ENDOCRINE, NUTRITIONAL AND METABOLIC DISEASES AND DISORDERS",3,Major,Moderate,Medical,Private Health Insurance,,,,,Y,25272.18,5015.04
New York City,Manhattan,7002054,001464,New York-Presbyterian Hospital - Columbia Presbyterian Center,0 to 17,100,F,Other Race,Not Span/Hispanic,2,Emergency,Home or Self Care,2022,END003,Diabetes mellitus with complication,,,420,DIABETES,10,"ENDOCRINE, NUTRITIONAL AND METABOLIC DISEASES AND DISORDERS",2,Moderate,Minor,Medical,Blue Cross/Blue Shield,,,,,Y,36677.02,8781.76
New York City,Manhattan,7002054,001464,New York-Presbyterian Hospital - Columbia Presbyterian Center,50 to 69,104,M,Black/African American,Not Span/Hispanic,4,Emergency,Home or Self Care,2022,END003,Diabetes mellitus with complication,,,420,DIABETES,10,"ENDOCRINE, NUTRITIONAL AND METABOLIC DISEASES AND DISORDERS",2,Moderate,Minor,Medical,Private Health Insurance,,,,,Y,60469.69,12863.07
New York City,Manhattan,7002001,001438,Bellevue Hospital Center,30 to 49,112,M,Black/African American,Not Span/Hispanic,8,Emergency,Home or Self Care,2022,END003,Diabetes mellitus with complication,ADM007,INTRAVENOUS INDUCTION OF LABOR,420,DIABETES,10,"ENDOCRINE, NUTRITIONAL AND METABOLIC DISEASES AND DISORDERS",4,Extreme,Extreme,Medical,Medicaid,,,,,Y,68801.11,39566.42
New York City,Manhattan,7002001,001438,Bellevue Hospital Center,50 to 69,112,F,Other Race,Spanish/Hispanic,1,Emergency,Home or Self Care,2022,END003,Diabetes mellitus with complication,ADM021,"ADMINISTRATION OF THERAPEUTIC SUBSTANCES, NEC",420,DIABETES,10,"ENDOCRINE, NUTRITIONAL AND METABOLIC DISEASES AND DISORDERS",1,Minor,Moderate,Medical,Medicare,,,,,Y,10708.60,6158.34
New York City,Manhattan,7002054,001464,New York-Presbyterian Hospital - Columbia Presbyterian Center,50 to 69,115,M,Black/African American,Unknown,8,Emergency,Home or Self Care,2022,END003,Diabetes mellitus with complication,ESA001,HEMODIALYSIS,420,DIABETES,10,"ENDOCRINE, NUTRITIONAL AND METABOLIC DISEASES AND DISORDERS",3,Major,Major,Medical,Medicare,Private Health Insurance,,,,Y,139402.67,31716.40
New York City,Manhattan,7002054,001464,New York-Presbyterian Hospital - Columbia Presbyterian Center,70 or Older,100,M,Other Race,Spanish/Hispanic,3,Emergency,Home or Self Care,2022,END003,Diabetes mellitus with complication,ADM021,"ADMINISTRATION OF THERAPEUTIC SUBSTANCES, NEC",420,DIABETES,10,"ENDOCRINE, NUTRITIONAL AND METABOLIC DISEASES AND DISORDERS",3,Major,Moderate,Medical,Medicare,Medicaid,,,,Y,49713.89,10361.49
New York City,Manhattan,7002054,001464,New York-Presbyterian Hospital - Columbia Presbyterian Center,0 to 17,104,M,Multi-racial,Unknown,3,Emergency,Home or Self Care,2022,END003,Diabetes mellitus with complication,ADM017,ADMINISTRATION OF NUTRITIONAL AND ELECTROLYTIC SUBSTANCES,420,DIABETES,10,"ENDOCRINE, NUTRITIONAL AND METABOLIC DISEASES AND DISORDERS",2,Moderate,Minor,Medical,Medicaid,,,,,Y,54169.48,12381.68
New York City,Manhattan,7002054,001464,New York-Presbyterian Hospital - Columbia Presbyterian Center,50 to 69,100,F,Other Race,Spanish/Hispanic,2,Emergency,Left Against Medical Advice,2022,END003,Diabetes mellitus with complication,,,420,DIABETES,10,"ENDOCRINE, NUTRITIONAL AND METABOLIC DISEASES AND DISORDERS",2,Moderate,Minor,Medical,Medicaid,,,,,Y,38252.79,
New York City,Manhattan,7002054,001464,New York-Presbyterian Hospital - Columbia Presbyterian Center,50 to 69,109,M,White,Not Span/Hispanic,2,Emergency,Home or Self Care,2022,END003,Diabetes mellitus with complication,ADM021,"ADMINISTRATION OF THERAPEUTIC SUBSTANCES, NEC",420,DIABETES,10,"ENDOCRINE, NUTRITIONAL AND METABOLIC DISEASES AND DISORDERS",3,Major,Major,Medical,Private Health Insurance,,,,,Y,54285.13,18254.91
New York City,Manhattan,7002054,001464,New York-Presbyterian Hospital - Columbia Presbyterian Center,30 to 49,100,F,Black/African American,Not Span/Hispanic,3,Emergency,Home or Self Care,2022,END003,Diabetes mellitus with complication,ADM017,ADMINISTRATION OF NUTRITIONAL AND ELECTROLYTIC SUBSTANCES,420,DIABETES,10,"ENDOCRINE, NUTRITIONAL AND METABOLIC DISEASES AND DISORDERS",2,Moderate,Minor,Medical,Medicaid,,,,,Y,47925.35,10134.21
New York City,Manhattan,7002054,001464,New York-Presbyterian Hospital - Columbia Presbyterian Center,50 to 69,100,M,Other Race,Spanish/Hispanic,5,Emergency,Home or Self Care,2022,END003,Diabetes mellitus with complication,ADM017,ADMINISTRATION OF NUTRITIONAL AND ELECTROLYTIC SUBSTANCES,420,DIABETES,10,"ENDOCRINE, NUTRITIONAL AND METABOLIC DISEASES AND DISORDERS",2,Moderate,Major,Medical,Medicaid,,,,,Y,106421.20,36181.58
New York City,Manhattan,7002054,001464,New York-Presbyterian Hospital - Columbia Presbyterian Center,30 to 49,100,M,Black/African American,Not Span/Hispanic,4,Emergency,Home or Self Care,2022,END003,Diabetes mellitus with complication,ADM021,"ADMINISTRATION OF THERAPEUTIC SUBSTANCES, NEC",420,DIABETES,10,"ENDOCRINE, NUTRITIONAL AND METABOLIC DISEASES AND DISORDERS",1,Minor,Minor,Medical,Medicaid,,,,,Y,68660.80,14304.93
New York City,Manhattan,7002054,001464,New York-Presbyterian Hospital - Columbia Presbyterian Center,50 to 69,100,M,Other Race,Unknown,1,Emergency,Home or Self Care,2022,END003,Diabetes mellitus with complication,,,420,DIABETES,10,"ENDOCRINE, NUTRITIONAL AND METABOLIC DISEASES AND DISORDERS",1,Minor,Minor,Medical,Private Health Insurance,,,,,Y,21076.69,4351.48
New York City,Manhattan,7002054,001464,New York-Presbyterian Hospital - Columbia Presbyterian Center,70 or Older,100,F,White,Not Span/Hispanic,8,Emergency,Home or Self Care,2022,END003,Diabetes mellitus with complication,ADM019,POTENTIAL COVID-19 THERAPIES,420,DIABETES,10,"ENDOCRINE, NUTRITIONAL AND METABOLIC DISEASES AND DISORDERS",3,Major,Major,Medical,Medicare,,,,,Y,214199.10,76980.27
New York City,Manhattan,7002054,001464,New York-Presbyterian Hospital - Columbia Presbyterian Center,70 or Older,100,F,White,Spanish/Hispanic,20,Emergency,Skilled Nursing Home,2022,END003,Diabetes mellitus with complication,ADM017,ADMINISTRATION OF NUTRITIONAL AND ELECTROLYTIC SUBSTANCES,420,DIABETES,10,"ENDOCRINE, NUTRITIONAL AND METABOLIC DISEASES AND DISORDERS",3,Major,Extreme,Medical,Medicare,Medicaid,,,,Y,284979.49,73967.40
New York City,Manhattan,7002054,001464,New York-Presbyterian Hospital - Columbia Presbyterian Center,30 to 49,100,M,Black/African American,Not Span/Hispanic,2,Emergency,Home or Self Care,2022,END003,Diabetes mellitus with complication,ADM007,INTRAVENOUS INDUCTION OF LABOR,420,DIABETES,10,"ENDOCRINE, NUTRITIONAL AND METABOLIC DISEASES AND DISORDERS",3,Major,Major,Medical,Medicaid,,,,,Y,41164.17,8260.44
New York City,Manhattan,7002054,001464,New York-Presbyterian Hospital - Columbia Presbyterian Center,50 to 69,105,F,Black/African American,Not Span/Hispanic,1,Emergency,Left Against Medical Advice,2022,END003,Diabetes mellitus with complication,ADM021,"ADMINISTRATION OF THERAPEUTIC SUBSTANCES, NEC",420,DIABETES,10,"ENDOCRINE, NUTRITIONAL AND METABOLIC DISEASES AND DISORDERS",2,Moderate,Minor,Medical,Medicaid,,,,,Y,21407.46,
New York City,Manhattan,7002001,001438,Bellevue Hospital Center,30 to 49,100,M,Black/African American,Not Span/Hispanic,3,Emergency,Left Against Medical Advice,2022,END003,Diabetes mellitus with complication,ADM007,INTRAVENOUS INDUCTION OF LABOR,420,DIABETES,10,"ENDOCRINE, NUTRITIONAL AND METABOLIC DISEASES AND DISORDERS",3,Major,Major,Medical,Medicaid,,,,,Y,26769.39,15394.65
New York City,Manhattan,7002001,001438,Bellevue Hospital Center,70 or Older,100,M,White,Unknown,6,Emergency,Home or Self Care,2022,END003,Diabetes mellitus with complication,ADM007,INTRAVENOUS INDUCTION OF LABOR,420,DIABETES,10,"ENDOCRINE, NUTRITIONAL AND METABOLIC DISEASES AND DISORDERS",2,Moderate,Moderate,Medical,Medicare,,,,,Y,48463.47,27870.57
New York City,Manhattan,7002001,001438,Bellevue Hospital Center,30 to 49,114,M,Other Race,Unknown,5,Emergency,Home or Self Care,2022,END003,Diabetes mellitus with complication,CAR024,VENOUS AND ARTERIAL CATHETER PLACEMENT,420,DIABETES,10,"ENDOCRINE, NUTRITIONAL AND METABOLIC DISEASES AND DISORDERS",2,Moderate,Minor,Medical,Medicaid,,,,,Y,56260.30,32354.40
New York City,Manhattan,7002001,001438,Bellevue Hospital Center,30 to 49,113,M,Other Race,Unknown,3,Emergency,Court/Law Enforcement,2022,END003,Diabetes mellitus with complication,ADM007,INTRAVENOUS INDUCTION OF LABOR,420,DIABETES,10,"ENDOCRINE, NUTRITIONAL AND METABOLIC DISEASES AND DISORDERS",2,Moderate,Moderate,Medical,Medicaid,,,,,Y,28230.62,16234.98
New York City,Manhattan,7002001,001438,Bellevue Hospital Center,0 to 17,100,M,Black/African American,Unknown,10,Elective,Home or Self Care,2022,END003,Diabetes mellitus with complication,ADM007,INTRAVENOUS INDUCTION OF LABOR,420,DIABETES,10,"ENDOCRINE, NUTRITIONAL AND METABOLIC DISEASES AND DISORDERS",1,Minor,Minor,Medical,Medicaid,,,,,N,70427.76,40501.88
New York City,Manhattan,7002001,001438,Bellevue Hospital Center,70 or Older,114,M,Other Race,Spanish/Hispanic,4,Urgent,Home w/ Home Health Services,2022,END003,Diabetes mellitus with complication,ADM015,ADMINISTRATION OF ANTIBIOTICS,420,DIABETES,10,"ENDOCRINE, NUTRITIONAL AND METABOLIC DISEASES AND DISORDERS",3,Major,Major,Medical,Medicare,Medicaid,,,,N,30805.30,17715.64
New York City,Manhattan,7002054,001464,New York-Presbyterian Hospital - Columbia Presbyterian Center,50 to 69,100,M,Other Race,Spanish/Hispanic,6,Emergency,Home or Self Care,2022,END003,Diabetes mellitus with complication,ADM007,INTRAVENOUS INDUCTION OF LABOR,420,DIABETES,10,"ENDOCRINE, NUTRITIONAL AND METABOLIC DISEASES AND DISORDERS",4,Extreme,Major,Medical,Medicaid,,,,,Y,100740.39,23117.08
New York City,Manhattan,7002054,001464,New York-Presbyterian Hospital - Columbia Presbyterian Center,18 to 29,100,F,Other Race,Unknown,1,Emergency,Home or Self Care,2022,END003,Diabetes mellitus with complication,,,420,DIABETES,10,"ENDOCRINE, NUTRITIONAL AND METABOLIC DISEASES AND DISORDERS",2,Moderate,Minor,Medical,Medicaid,,,,,Y,29485.28,5571.52
New York City,Manhattan,7002054,001464,New York-Presbyterian Hospital - Columbia Presbyterian Center,18 to 29,100,F,Other Race,Spanish/Hispanic,2,Emergency,Home or Self Care,2022,END003,Diabetes mellitus with complication,ADM017,ADMINISTRATION OF NUTRITIONAL AND ELECTROLYTIC SUBSTANCES,420,DIABETES,10,"ENDOCRINE, NUTRITIONAL AND METABOLIC DISEASES AND DISORDERS",2,Moderate,Minor,Medical,Medicaid,,,,,Y,59722.68,18806.53
New York City,Manhattan,7002054,001464,New York-Presbyterian Hospital - Columbia Presbyterian Center,50 to 69,104,F,Black/African American,Not Span/Hispanic,3,Emergency,Home w/ Home Health Services,2022,END003,Diabetes mellitus with complication,,,420,DIABETES,10,"ENDOCRINE, NUTRITIONAL AND METABOLIC DISEASES AND DISORDERS",2,Moderate,Major,Medical,Medicare,Medicaid,,,,Y,53916.60,11288.75
New York City,Manhattan,7002054,001464,New York-Presbyterian Hospital - Columbia Presbyterian Center,18 to 29,100,M,Other Race,Spanish/Hispanic,2,Emergency,Home or Self Care,2022,END003,Diabetes mellitus with complication,,,420,DIABETES,10,"ENDOCRINE, NUTRITIONAL AND METABOLIC DISEASES AND DISORDERS",2,Moderate,Minor,Medical,Private Health Insurance,,,,,Y,40834.41,8307.64
New York City,Manhattan,7002054,001464,New York-Presbyterian Hospital - Columbia Presbyterian Center,30 to 49,100,M,White,Spanish/Hispanic,15,Emergency,Home or Self Care,2022,END003,Diabetes mellitus with complication,OTR004,ISOLATION PROCEDURES,420,DIABETES,10,"ENDOCRINE, NUTRITIONAL AND METABOLIC DISEASES AND DISORDERS",4,Extreme,Major,Medical,Medicaid,,,,,Y,246704.31,65782.33
New York City,Manhattan,7002054,001464,New York-Presbyterian Hospital - Columbia Presbyterian Center,50 to 69,100,M,White,Spanish/Hispanic,1,Emergency,Home or Self Care,2022,END003,Diabetes mellitus with complication,,,420,DIABETES,10,"ENDOCRINE, NUTRITIONAL AND METABOLIC DISEASES AND DISORDERS",2,Moderate,Minor,Medical,Medicare,Medicaid,,,,Y,24276.10,5434.20
New York City,Manhattan,7002054,001464,New York-Presbyterian Hospital - Columbia Presbyterian Center,0 to 17,113,M,Other Race,Unknown,1,Emergency,Home or Self Care,2022,END003,Diabetes mellitus with complication,,,420,DIABETES,10,"ENDOCRINE, NUTRITIONAL AND METABOLIC DISEASES AND DISORDERS",2,Moderate,Minor,Medical,Medicaid,,,,,Y,26914.89,5093.15
New York City,Manhattan,7002054,001464,New York-Presbyterian Hospital - Columbia Presbyterian Center,0 to 17,104,F,Black/African American,Not Span/Hispanic,2,Emergency,Home or Self Care,2022,END003,Diabetes mellitus with complication,,,420,DIABETES,10,"ENDOCRINE, NUTRITIONAL AND METABOLIC DISEASES AND DISORDERS",2,Moderate,Minor,Medical,Private Health Insurance,,,,,Y,60718.67,20291.84
New York City,Manhattan,7002054,001464,New York-Presbyterian Hospital - Columbia Presbyterian Center,70 or Older,113,M,Other Race,Unknown,25,Emergency,Home w/ Home Health Services,2022,END003,Diabetes mellitus with complication,MAM005,MEASUREMENT DURING CARDIAC CATHETERIZATION,420,DIABETES,10,"ENDOCRINE, NUTRITIONAL AND METABOLIC DISEASES AND DISORDERS",4,Extreme,Extreme,Medical,Medicare,Private Health Insurance,,,,Y,494643.24,137206.77
New York City,Manhattan,7002054,001464,New York-Presbyterian Hospital - Columbia Presbyterian Center,18 to 29,104,F,Other Race,Spanish/Hispanic,1,Emergency,Left Against Medical Advice,2022,END003,Diabetes mellitus with complication,OTR004,ISOLATION PROCEDURES,420,DIABETES,10,"ENDOCRINE, NUTRITIONAL AND METABOLIC DISEASES AND DISORDERS",2,Moderate,Moderate,Medical,Medicaid,,,,,Y,21139.77,
New York City,Manhattan,7002001,001438,Bellevue Hospital Center,18 to 29,104,M,Other Race,Unknown,1,Emergency,Left Against Medical Advice,2022,END003,Diabetes mellitus with complication,ADM007,INTRAVENOUS INDUCTION OF LABOR,420,DIABETES,10,"ENDOCRINE, NUTRITIONAL AND METABOLIC DISEASES AND DISORDERS",2,Moderate,Minor,Medical,Medicaid,,,,,Y,13949.79,8022.30
New York City,Manhattan,7002001,001438,Bellevue Hospital Center,30 to 49,112,M,Other Race,Unknown,7,Emergency,Home or Self Care,2022,END003,Diabetes mellitus with complication,ADM007,INTRAVENOUS INDUCTION OF LABOR,420,DIABETES,10,"ENDOCRINE, NUTRITIONAL AND METABOLIC DISEASES AND DISORDERS",3,Major,Major,Medical,Medicaid,,,,,Y,57280.72,32941.23
New York City,Manhattan,7002001,001438,Bellevue Hospital Center,50 to 69,112,M,Black/African American,Not Span/Hispanic,6,Emergency,Home or Self Care,2022,END003,Diabetes mellitus with complication,ADM021,"ADMINISTRATION OF THERAPEUTIC SUBSTANCES, NEC",420,DIABETES,10,"ENDOCRINE, NUTRITIONAL AND METABOLIC DISEASES AND DISORDERS",2,Moderate,Moderate,Medical,Medicaid,,,,,Y,59952.65,34477.81
New York City,Manhattan,7002054,001464,New York-Presbyterian Hospital - Columbia Presbyterian Center,18 to 29,100,M,Other Race,Spanish/Hispanic,2,Emergency,Home or Self Care,2022,END003,Diabetes mellitus with complication,ADM017,ADMINISTRATION OF NUTRITIONAL AND ELECTROLYTIC SUBSTANCES,420,DIABETES,10,"ENDOCRINE, NUTRITIONAL AND METABOLIC DISEASES AND DISORDERS",3,Major,Moderate,Medical,Medicaid,,,,,Y,39629.69,7864.49
New York City,Manhattan,7002054,001464,New York-Presbyterian Hospital - Columbia Presbyterian Center,0 to 17,109,F,White,Not Span/Hispanic,4,Emergency,Home or Self Care,2022,END003,Diabetes mellitus with complication,,,420,DIABETES,10,"ENDOCRINE, NUTRITIONAL AND METABOLIC DISEASES AND DISORDERS",3,Major,Moderate,Medical,Private Health Insurance,,,,,Y,111815.43,44230.35
New York City,Manhattan,7002054,001464,New York-Presbyterian Hospital - Columbia Presbyterian Center,18 to 29,104,F,White,Spanish/Hispanic,3,Emergency,Home or Self Care,2022,END003,Diabetes mellitus with complication,,,420,DIABETES,10,"ENDOCRINE, NUTRITIONAL AND METABOLIC DISEASES AND DISORDERS",2,Moderate,Moderate,Medical,Medicaid,,,,,Y,81468.72,30624.58
New York City,Manhattan,7002053,001463,NYU Langone Hospitals,30 to 49,100,F,Black/African American,Not Span/Hispanic,2,Emergency,Home or Self Care,2022,END003,Diabetes mellitus with complication,ADM019,POTENTIAL COVID-19 THERAPIES,420,DIABETES,10,"ENDOCRINE, NUTRITIONAL AND METABOLIC DISEASES AND DISORDERS",3,Major,Major,Medical,Private Health Insurance,,,,,Y,79190.32,17020.08
New York City,Manhattan,7002054,001464,New York-Presbyterian Hospital - Columbia Presbyterian Center,70 or Older,100,F,Other Race,Spanish/Hispanic,3,Emergency,Home or Self Care,2022,END003,Diabetes mellitus with complication,,,420,DIABETES,10,"ENDOCRINE, NUTRITIONAL AND METABOLIC DISEASES AND DISORDERS",1,Minor,Major,Medical,Medicare,Medicaid,,,,Y,43060.54,9238.40
New York City,Manhattan,7002054,001464,New York-Presbyterian Hospital - Columbia Presbyterian Center,50 to 69,100,F,Other Race,Spanish/Hispanic,9,Emergency,Home w/ Home Health Services,2022,END003,Diabetes mellitus with complication,ADM017,ADMINISTRATION OF NUTRITIONAL AND ELECTROLYTIC SUBSTANCES,420,DIABETES,10,"ENDOCRINE, NUTRITIONAL AND METABOLIC DISEASES AND DISORDERS",2,Moderate,Moderate,Medical,Medicaid,,,,,Y,151110.99,31316.86
New York City,Manhattan,7002054,001464,New York-Presbyterian Hospital - Columbia Presbyterian Center,70 or Older,100,F,Other Race,Spanish/Hispanic,5,Emergency,Skilled Nursing Home,2022,END003,Diabetes mellitus with complication,ADM017,ADMINISTRATION OF NUTRITIONAL AND ELECTROLYTIC SUBSTANCES,420,DIABETES,10,"ENDOCRINE, NUTRITIONAL AND METABOLIC DISEASES AND DISORDERS",3,Major,Major,Medical,Medicare,,,,,Y,83868.52,18043.02
New York City,Manhattan,7002001,001438,Bellevue Hospital Center,50 to 69,114,M,Multi-racial,Not Span/Hispanic,1,Emergency,Left Against Medical Advice,2022,END003,Diabetes mellitus with complication,ESA001,HEMODIALYSIS,420,DIABETES,10,"ENDOCRINE, NUTRITIONAL AND METABOLIC DISEASES AND DISORDERS",3,Major,Major,Medical,Medicaid,,,,,Y,14593.62,8392.56
New York City,Manhattan,7002001,001438,Bellevue Hospital Center,50 to 69,112,M,Other Race,Spanish/Hispanic,9,Emergency,Home or Self Care,2022,END003,Diabetes mellitus with complication,IMG008,ULTRASONOGRAPHY,420,DIABETES,10,"ENDOCRINE, NUTRITIONAL AND METABOLIC DISEASES AND DISORDERS",3,Major,Major,Medical,Medicaid,,,,,Y,80266.46,46159.96
New York City,Manhattan,7002054,001464,New York-Presbyterian Hospital - Columbia Presbyterian Center,0 to 17,104,F,Other Race,Unknown,2,Emergency,Home or Self Care,2022,END003,Diabetes mellitus with complication,,,420,DIABETES,10,"ENDOCRINE, NUTRITIONAL AND METABOLIC DISEASES AND DISORDERS",2,Moderate,Minor,Medical,Medicaid,,,,,Y,84743.58,30722.60
New York City,Manhattan,7002054,001464,New York-Presbyterian Hospital - Columbia Presbyterian Center,50 to 69,100,F,Other Race,Unknown,4,Emergency,Home w/ Home Health Services,2022,END003,Diabetes mellitus with complication,,,420,DIABETES,10,"ENDOCRINE, NUTRITIONAL AND METABOLIC DISEASES AND DISORDERS",1,Minor,Minor,Medical,Medicare,Medicaid,,,,Y,62119.39,13012.79
New York City,Manhattan,7002054,001464,New York-Presbyterian Hospital - Columbia Presbyterian Center,50 to 69,100,M,Other Race,Spanish/Hispanic,2,Emergency,Home w/ Home Health Services,2022,END003,Diabetes mellitus with complication,,,420,DIABETES,10,"ENDOCRINE, NUTRITIONAL AND METABOLIC DISEASES AND DISORDERS",2,Moderate,Minor,Medical,Medicaid,,,,,Y,39384.23,7924.69
New York City,Manhattan,7002054,001464,New York-Presbyterian Hospital - Columbia Presbyterian Center,70 or Older,104,F,Other Race,Not Span/Hispanic,4,Emergency,Home or Self Care,2022,END003,Diabetes mellitus with complication,,,420,DIABETES,10,"ENDOCRINE, NUTRITIONAL AND METABOLIC DISEASES AND DISORDERS",3,Major,Extreme,Medical,Medicare,Medicaid,,,,Y,60874.63,13133.81
New York City,Manhattan,7002054,001464,New York-Presbyterian Hospital - Columbia Presbyterian Center,50 to 69,100,F,Black/African American,Spanish/Hispanic,10,Emergency,Home or Self Care,2022,END003,Diabetes mellitus with complication,ADM021,"ADMINISTRATION OF THERAPEUTIC SUBSTANCES, NEC",420,DIABETES,10,"ENDOCRINE, NUTRITIONAL AND METABOLIC DISEASES AND DISORDERS",4,Extreme,Major,Medical,Medicare,Medicaid,,,,Y,152152.14,31608.90
New York City,Manhattan,7002001,001438,Bellevue Hospital Center,50 to 69,112,M,Black/African American,Unknown,2,Emergency,Home or Self Care,2022,END003,Diabetes mellitus with complication,ADM007,INTRAVENOUS INDUCTION OF LABOR,420,DIABETES,10,"ENDOCRINE, NUTRITIONAL AND METABOLIC DISEASES AND DISORDERS",1,Minor,Moderate,Medical,Medicare,,,,,Y,19058.82,10960.42
New York City,Manhattan,7002001,001438,Bellevue Hospital Center,0 to 17,112,M,Other Race,Not Span/Hispanic,1,Emergency,Facility w/ Custodial/Supportive Care,2022,END003,Diabetes mellitus with complication,ADM007,INTRAVENOUS INDUCTION OF LABOR,420,DIABETES,10,"ENDOCRINE, NUTRITIONAL AND METABOLIC DISEASES AND DISORDERS",1,Minor,Minor,Medical,Medicaid,,,,,Y,10956.99,6301.19
New York City,Manhattan,7002001,001438,Bellevue Hospital Center,70 or Older,114,F,Black/African American,Unknown,7,Urgent,Home or Self Care,2022,END003,Diabetes mellitus with complication,ADM007,INTRAVENOUS INDUCTION OF LABOR,420,DIABETES,10,"ENDOCRINE, NUTRITIONAL AND METABOLIC DISEASES AND DISORDERS",1,Minor,Moderate,Medical,Private Health Insurance,,,,,N,61168.54,35177.05
Finger Lakes,Monroe,2701005,000413,Strong Memorial Hospital,50 to 69,146,M,White,Not Span/Hispanic,12,Emergency,Left Against Medical Advice,2022,END003,Diabetes mellitus with complication,,,420,DIABETES,10,"ENDOCRINE, NUTRITIONAL AND METABOLIC DISEASES AND DISORDERS",4,Extreme,Major,Medical,Medicare,,,,,Y,49760.21,24153.81
Finger Lakes,Monroe,2701005,000413,Strong Memorial Hospital,30 to 49,146,M,Black/African American,Not Span/Hispanic,2,Emergency,Home w/ Home Health Services,2022,END003,Diabetes mellitus with complication,SKB008,SKIN EXCISION AND DEBRIDEMENT,420,DIABETES,10,"ENDOCRINE, NUTRITIONAL AND METABOLIC DISEASES AND DISORDERS",1,Minor,Moderate,Medical,Medicaid,,,,,Y,8815.24,3553.29
Finger Lakes,Monroe,2701005,000413,Strong Memorial Hospital,50 to 69,145,F,Other Race,Not Span/Hispanic,18,Urgent,Home w/ Home Health Services,2022,END003,Diabetes mellitus with complication,,,420,DIABETES,10,"ENDOCRINE, NUTRITIONAL AND METABOLIC DISEASES AND DISORDERS",3,Major,Major,Medical,Medicare,,,,,N,46840.69,26079.77
Finger Lakes,Monroe,2701005,000413,Strong Memorial Hospital,50 to 69,146,M,Other Race,Not Span/Hispanic,3,Emergency,Home or Self Care,2022,END003,Diabetes mellitus with complication,,,420,DIABETES,10,"ENDOCRINE, NUTRITIONAL AND METABOLIC DISEASES AND DISORDERS",2,Moderate,Moderate,Medical,Medicaid,,,,,Y,15829.77,5799.55