Hospital Service Area,Hospital County,Operating Certificate Number,Permanent Facility Id,Facility Name,Age Group,Zip Code - 3 digits,Gender,Race,Ethnicity,Length of Stay,Type of Admission,Patient Disposition,Discharge Year,CCS Diagnosis Code,CCS Diagnosis Description,CCS Procedure Code,CCS Procedure Description,APR DRG Code,APR DRG Description,APR MDC Code,APR MDC Description,APR Severity of Illness Code,APR Severity of Illness Description,APR Risk of Mortality,APR Medical Surgical Description,Payment Typology 1,Payment Typology 2,Payment Typology 3,Birth Weight,Abortion Edit Indicator,Emergency Department Indicator,Total Charges,Total Costs
New York City,Manhattan,7002054,001464,New York-Presbyterian Hospital - Columbia Presbyterian Center,30 to 49,100,F,Black/African American,Not Span/Hispanic,2,Emergency,Home or Self Care,2022,SYM016,Other general signs and symptoms,,,421,"MALNUTRITION, FAILURE TO THRIVE AND OTHER NUTRITIONAL DISORDERS",10,"ENDOCRINE, NUTRITIONAL AND METABOLIC DISEASES AND DISORDERS",2,Moderate,Moderate,Medical,Medicaid,,,,,Y,30733.64,6537.08
New York City,Manhattan,7002054,001464,New York-Presbyterian Hospital - Columbia Presbyterian Center,0 to 17,104,M,Black/African American,Not Span/Hispanic,4,Emergency,Home or Self Care,2022,SYM016,Other general signs and symptoms,,,421,"MALNUTRITION, FAILURE TO THRIVE AND OTHER NUTRITIONAL DISORDERS",10,"ENDOCRINE, NUTRITIONAL AND METABOLIC DISEASES AND DISORDERS",2,Moderate,Moderate,Medical,Medicaid,,,,,Y,52840.92,15669.46
New York City,Manhattan,7002054,001464,New York-Presbyterian Hospital - Columbia Presbyterian Center,70 or Older,104,F,Black/African American,Not Span/Hispanic,8,Emergency,Skilled Nursing Home,2022,END007,Nutritional deficiencies,OTR004,ISOLATION PROCEDURES,421,"MALNUTRITION, FAILURE TO THRIVE AND OTHER NUTRITIONAL DISORDERS",10,"ENDOCRINE, NUTRITIONAL AND METABOLIC DISEASES AND DISORDERS",4,Extreme,Extreme,Medical,Medicare,,,,,Y,141479.84,31178.61
New York City,Manhattan,7002001,001438,Bellevue Hospital Center,30 to 49,100,M,Black/African American,Not Span/Hispanic,7,Emergency,Expired,2022,SYM016,Other general signs and symptoms,IMG006,COMPUTERIZED TOMOGRAPHY (CT) WITH CONTRAST,421,"MALNUTRITION, FAILURE TO THRIVE AND OTHER NUTRITIONAL DISORDERS",10,"ENDOCRINE, NUTRITIONAL AND METABOLIC DISEASES AND DISORDERS",4,Extreme,Extreme,Medical,Medicaid,,,,,Y,64730.34,37225.38
New York City,Manhattan,7002054,001464,New York-Presbyterian Hospital - Columbia Presbyterian Center,0 to 17,104,F,Other Race,Spanish/Hispanic,3,Emergency,Home or Self Care,2022,PNL012,Neonatal digestive and feeding disorders,ADM021,"ADMINISTRATION OF THERAPEUTIC SUBSTANCES, NEC",421,"MALNUTRITION, FAILURE TO THRIVE AND OTHER NUTRITIONAL DISORDERS",10,"ENDOCRINE, NUTRITIONAL AND METABOLIC DISEASES AND DISORDERS",1,Minor,Minor,Medical,Medicaid,,,03000,,Y,52294.32,15601.16
New York City,Manhattan,7002054,001464,New York-Presbyterian Hospital - Columbia Presbyterian Center,30 to 49,111,M,White,Not Span/Hispanic,3,Emergency,Home or Self Care,2022,END009,Obesity,,,421,"MALNUTRITION, FAILURE TO THRIVE AND OTHER NUTRITIONAL DISORDERS",10,"ENDOCRINE, NUTRITIONAL AND METABOLIC DISEASES AND DISORDERS",2,Moderate,Minor,Medical,Medicaid,,,,,Y,53625.66,11001.89
New York City,Manhattan,7002001,001438,Bellevue Hospital Center,50 to 69,113,F,Other Race,Not Span/Hispanic,6,Emergency,Home or Self Care,2022,SYM016,Other general signs and symptoms,ADM014,REGIONAL ANESTHESIA,421,"MALNUTRITION, FAILURE TO THRIVE AND OTHER NUTRITIONAL DISORDERS",10,"ENDOCRINE, NUTRITIONAL AND METABOLIC DISEASES AND DISORDERS",2,Moderate,Major,Medical,Medicaid,,,,,Y,44315.25,25484.99
New York City,Manhattan,7002054,001464,New York-Presbyterian Hospital - Columbia Presbyterian Center,70 or Older,100,F,White,Not Span/Hispanic,8,Emergency,Home w/ Home Health Services,2022,SYM016,Other general signs and symptoms,,,421,"MALNUTRITION, FAILURE TO THRIVE AND OTHER NUTRITIONAL DISORDERS",10,"ENDOCRINE, NUTRITIONAL AND METABOLIC DISEASES AND DISORDERS",3,Major,Major,Medical,Medicare,Medicaid,,,,Y,176351.07,37636.66
New York City,Manhattan,7002054,001464,New York-Presbyterian Hospital - Columbia Presbyterian Center,0 to 17,112,F,White,Not Span/Hispanic,1,Elective,Home or Self Care,2022,END008,Malnutrition,GIS017,GASTROSTOMY,421,"MALNUTRITION, FAILURE TO THRIVE AND OTHER NUTRITIONAL DISORDERS",10,"ENDOCRINE, NUTRITIONAL AND METABOLIC DISEASES AND DISORDERS",3,Major,Moderate,Medical,Medicaid,,,,,N,43038.68,12707.03
New York City,Manhattan,7002054,001464,New York-Presbyterian Hospital - Columbia Presbyterian Center,0 to 17,104,F,Black/African American,Not Span/Hispanic,2,Emergency,Short-term Hospital,2022,SYM016,Other general signs and symptoms,ADM017,ADMINISTRATION OF NUTRITIONAL AND ELECTROLYTIC SUBSTANCES,421,"MALNUTRITION, FAILURE TO THRIVE AND OTHER NUTRITIONAL DISORDERS",10,"ENDOCRINE, NUTRITIONAL AND METABOLIC DISEASES AND DISORDERS",2,Moderate,Moderate,Medical,Medicaid,,,,,Y,42957.95,8773.35
New York City,Manhattan,7002054,001464,New York-Presbyterian Hospital - Columbia Presbyterian Center,70 or Older,100,F,Other Race,Spanish/Hispanic,7,Emergency,Home w/ Home Health Services,2022,END009,Obesity,ADM021,"ADMINISTRATION OF THERAPEUTIC SUBSTANCES, NEC",421,"MALNUTRITION, FAILURE TO THRIVE AND OTHER NUTRITIONAL DISORDERS",10,"ENDOCRINE, NUTRITIONAL AND METABOLIC DISEASES AND DISORDERS",4,Extreme,Extreme,Medical,Medicare,Medicaid,,,,Y,94553.44,20223.29
New York City,Manhattan,7002053,001463,NYU Langone Hospitals,0 to 17,112,F,Other Race,Not Span/Hispanic,5,Emergency,Home or Self Care,2022,END008,Malnutrition,GIS017,GASTROSTOMY,421,"MALNUTRITION, FAILURE TO THRIVE AND OTHER NUTRITIONAL DISORDERS",10,"ENDOCRINE, NUTRITIONAL AND METABOLIC DISEASES AND DISORDERS",4,Extreme,Moderate,Medical,Private Health Insurance,,,,,N,54187.77,16533.67
New York City,Manhattan,7002053,001463,NYU Langone Hospitals,0 to 17,112,F,White,Not Span/Hispanic,6,Emergency,Home or Self Care,2022,SYM016,Other general signs and symptoms,OTR004,ISOLATION PROCEDURES,421,"MALNUTRITION, FAILURE TO THRIVE AND OTHER NUTRITIONAL DISORDERS",10,"ENDOCRINE, NUTRITIONAL AND METABOLIC DISEASES AND DISORDERS",2,Moderate,Moderate,Medical,Blue Cross/Blue Shield,,,,,Y,69661.59,20501.40
New York City,Manhattan,7002054,001464,New York-Presbyterian Hospital - Columbia Presbyterian Center,30 to 49,108,F,White,Not Span/Hispanic,4,Urgent,Home or Self Care,2022,SYM016,Other general signs and symptoms,,,421,"MALNUTRITION, FAILURE TO THRIVE AND OTHER NUTRITIONAL DISORDERS",10,"ENDOCRINE, NUTRITIONAL AND METABOLIC DISEASES AND DISORDERS",3,Major,Moderate,Medical,Private Health Insurance,,,,,N,64507.91,13755.34
New York City,Manhattan,7002054,001464,New York-Presbyterian Hospital - Columbia Presbyterian Center,70 or Older,100,F,Black/African American,Spanish/Hispanic,3,Emergency,Home w/ Home Health Services,2022,SYM016,Other general signs and symptoms,ADM021,"ADMINISTRATION OF THERAPEUTIC SUBSTANCES, NEC",421,"MALNUTRITION, FAILURE TO THRIVE AND OTHER NUTRITIONAL DISORDERS",10,"ENDOCRINE, NUTRITIONAL AND METABOLIC DISEASES AND DISORDERS",2,Moderate,Moderate,Medical,Medicare,,,,,Y,42112.19,9161.21
New York City,Manhattan,7002054,001464,New York-Presbyterian Hospital - Columbia Presbyterian Center,70 or Older,104,M,White,Spanish/Hispanic,6,Emergency,Home w/ Home Health Services,2022,SYM016,Other general signs and symptoms,ADM021,"ADMINISTRATION OF THERAPEUTIC SUBSTANCES, NEC",421,"MALNUTRITION, FAILURE TO THRIVE AND OTHER NUTRITIONAL DISORDERS",10,"ENDOCRINE, NUTRITIONAL AND METABOLIC DISEASES AND DISORDERS",3,Major,Major,Medical,Medicare,Medicaid,,,,Y,83977.39,19277.71
New York City,Manhattan,7002053,001463,NYU Langone Hospitals,50 to 69,100,F,Other Race,Not Span/Hispanic,16,Emergency,Hospice - Medical Facility,2022,SYM016,Other general signs and symptoms,MAM011,ELECTROENCEPHALOGRAM (EEG),421,"MALNUTRITION, FAILURE TO THRIVE AND OTHER NUTRITIONAL DISORDERS",10,"ENDOCRINE, NUTRITIONAL AND METABOLIC DISEASES AND DISORDERS",4,Extreme,Extreme,Medical,Medicare,Medicaid,,,,Y,239702.14,81138.11
New York City,Manhattan,7002053,001463,NYU Langone Hospitals,0 to 17,113,M,Other Race,Spanish/Hispanic,10,Urgent,Home or Self Care,2022,SYM016,Other general signs and symptoms,ADM019,POTENTIAL COVID-19 THERAPIES,421,"MALNUTRITION, FAILURE TO THRIVE AND OTHER NUTRITIONAL DISORDERS",10,"ENDOCRINE, NUTRITIONAL AND METABOLIC DISEASES AND DISORDERS",4,Extreme,Major,Medical,Medicaid,,,,,N,136796.57,33341.12
New York City,Manhattan,7002001,001438,Bellevue Hospital Center,50 to 69,100,M,Black/African American,Unknown,7,Emergency,Home or Self Care,2022,SYM016,Other general signs and symptoms,ADM021,"ADMINISTRATION OF THERAPEUTIC SUBSTANCES, NEC",421,"MALNUTRITION, FAILURE TO THRIVE AND OTHER NUTRITIONAL DISORDERS",10,"ENDOCRINE, NUTRITIONAL AND METABOLIC DISEASES AND DISORDERS",2,Moderate,Major,Medical,Medicaid,,,,,Y,55076.47,31673.60
New York City,Manhattan,7002001,001438,Bellevue Hospital Center,0 to 17,113,F,Other Race,Spanish/Hispanic,19,Emergency,Home or Self Care,2022,END008,Malnutrition,ADM021,"ADMINISTRATION OF THERAPEUTIC SUBSTANCES, NEC",421,"MALNUTRITION, FAILURE TO THRIVE AND OTHER NUTRITIONAL DISORDERS",10,"ENDOCRINE, NUTRITIONAL AND METABOLIC DISEASES AND DISORDERS",3,Major,Major,Medical,Medicaid,,,,,Y,131634.55,75700.92
Finger Lakes,Monroe,2701005,000413,Strong Memorial Hospital,0 to 17,144,M,White,Not Span/Hispanic,3,Emergency,Home or Self Care,2022,SYM016,Other general signs and symptoms,,,421,"MALNUTRITION, FAILURE TO THRIVE AND OTHER NUTRITIONAL DISORDERS",10,"ENDOCRINE, NUTRITIONAL AND METABOLIC DISEASES AND DISORDERS",2,Moderate,Moderate,Medical,Medicaid,,,,,Y,9213.03,4473.71
Finger Lakes,Monroe,2701005,000413,Strong Memorial Hospital,50 to 69,145,M,White,Not Span/Hispanic,5,Emergency,Home or Self Care,2022,END007,Nutritional deficiencies,,,421,"MALNUTRITION, FAILURE TO THRIVE AND OTHER NUTRITIONAL DISORDERS",10,"ENDOCRINE, NUTRITIONAL AND METABOLIC DISEASES AND DISORDERS",2,Moderate,Moderate,Medical,Medicaid,,,,,Y,19126.48,7945.98
Finger Lakes,Monroe,2701005,000413,Strong Memorial Hospital,70 or Older,146,M,White,Not Span/Hispanic,4,Emergency,Home or Self Care,2022,SYM016,Other general signs and symptoms,,,421,"MALNUTRITION, FAILURE TO THRIVE AND OTHER NUTRITIONAL DISORDERS",10,"ENDOCRINE, NUTRITIONAL AND METABOLIC DISEASES AND DISORDERS",2,Moderate,Moderate,Medical,Federal/State/Local/VA,,,,,Y,12549.37,6267.62
Finger Lakes,Monroe,2701005,000413,Strong Memorial Hospital,0 to 17,146,M,White,Not Span/Hispanic,4,Elective,Home w/ Home Health Services,2022,SYM016,Other general signs and symptoms,GIS017,GASTROSTOMY,421,"MALNUTRITION, FAILURE TO THRIVE AND OTHER NUTRITIONAL DISORDERS",10,"ENDOCRINE, NUTRITIONAL AND METABOLIC DISEASES AND DISORDERS",3,Major,Minor,Medical,Medicaid,,,,,N,20443.21,10815.44
Finger Lakes,Monroe,2701005,000413,Strong Memorial Hospital,0 to 17,147,F,White,Not Span/Hispanic,5,Emergency,Home or Self Care,2022,SYM016,Other general signs and symptoms,,,421,"MALNUTRITION, FAILURE TO THRIVE AND OTHER NUTRITIONAL DISORDERS",10,"ENDOCRINE, NUTRITIONAL AND METABOLIC DISEASES AND DISORDERS",2,Moderate,Moderate,Medical,Private Health Insurance,,,,,Y,15820.62,7853.25
Finger Lakes,Monroe,2701005,000413,Strong Memorial Hospital,70 or Older,146,M,White,Not Span/Hispanic,9,Emergency,Home w/ Home Health Services,2022,SYM016,Other general signs and symptoms,,,421,"MALNUTRITION, FAILURE TO THRIVE AND OTHER NUTRITIONAL DISORDERS",10,"ENDOCRINE, NUTRITIONAL AND METABOLIC DISEASES AND DISORDERS",3,Major,Major,Medical,Federal/State/Local/VA,,,,,Y,30875.94,14148.05
Finger Lakes,Monroe,2701005,000413,Strong Memorial Hospital,70 or Older,140,M,White,Not Span/Hispanic,16,Emergency,Home w/ Home Health Services,2022,SYM016,Other general signs and symptoms,,,421,"MALNUTRITION, FAILURE TO THRIVE AND OTHER NUTRITIONAL DISORDERS",10,"ENDOCRINE, NUTRITIONAL AND METABOLIC DISEASES AND DISORDERS",2,Moderate,Moderate,Medical,Medicare,,,,,Y,45163.65,23184.01
Finger Lakes,Monroe,2701005,000413,Strong Memorial Hospital,50 to 69,144,F,Black/African American,Not Span/Hispanic,7,Emergency,Home w/ Home Health Services,2022,SYM016,Other general signs and symptoms,,,421,"MALNUTRITION, FAILURE TO THRIVE AND OTHER NUTRITIONAL DISORDERS",10,"ENDOCRINE, NUTRITIONAL AND METABOLIC DISEASES AND DISORDERS",2,Moderate,Moderate,Medical,Medicaid,,,,,Y,21170.66,10804.72
Finger Lakes,Monroe,2701005,000413,Strong Memorial Hospital,30 to 49,145,M,White,Not Span/Hispanic,3,Emergency,Home or Self Care,2022,END007,Nutritional deficiencies,,,421,"MALNUTRITION, FAILURE TO THRIVE AND OTHER NUTRITIONAL DISORDERS",10,"ENDOCRINE, NUTRITIONAL AND METABOLIC DISEASES AND DISORDERS",1,Minor,Minor,Medical,Private Health Insurance,,,,,Y,12155.94,5150.43
Finger Lakes,Monroe,2701005,000413,Strong Memorial Hospital,50 to 69,145,M,White,Not Span/Hispanic,23,Emergency,Home w/ Home Health Services,2022,END007,Nutritional deficiencies,,,421,"MALNUTRITION, FAILURE TO THRIVE AND OTHER NUTRITIONAL DISORDERS",10,"ENDOCRINE, NUTRITIONAL AND METABOLIC DISEASES AND DISORDERS",4,Extreme,Extreme,Medical,Medicare,Medicaid,,,,Y,60950.89,30921.45
Finger Lakes,Monroe,2701005,000413,Strong Memorial Hospital,0 to 17,145,M,White,Not Span/Hispanic,7,Emergency,Home w/ Home Health Services,2022,SYM016,Other general signs and symptoms,GIS017,GASTROSTOMY,421,"MALNUTRITION, FAILURE TO THRIVE AND OTHER NUTRITIONAL DISORDERS",10,"ENDOCRINE, NUTRITIONAL AND METABOLIC DISEASES AND DISORDERS",3,Major,Major,Medical,Medicaid,,,,,Y,30982.94,16163.53
New York City,Manhattan,7002001,001438,Bellevue Hospital Center,0 to 17,112,F,Black/African American,Unknown,21,Emergency,Home or Self Care,2022,END008,Malnutrition,MAM011,ELECTROENCEPHALOGRAM (EEG),421,"MALNUTRITION, FAILURE TO THRIVE AND OTHER NUTRITIONAL DISORDERS",10,"ENDOCRINE, NUTRITIONAL AND METABOLIC DISEASES AND DISORDERS",3,Major,Major,Medical,Medicaid,,,,,Y,139593.86,80278.20
New York City,Manhattan,7002053,001463,NYU Langone Hospitals,50 to 69,113,M,White,Unknown,3,Emergency,Skilled Nursing Home,2022,END008,Malnutrition,ADM010,VACCINATIONS,421,"MALNUTRITION, FAILURE TO THRIVE AND OTHER NUTRITIONAL DISORDERS",10,"ENDOCRINE, NUTRITIONAL AND METABOLIC DISEASES AND DISORDERS",3,Major,Moderate,Medical,Medicare,Medicare,,,,Y,64400.35,19079.91
New York City,Manhattan,7002053,001463,NYU Langone Hospitals,0 to 17,112,F,Other Race,Not Span/Hispanic,26,Emergency,Home or Self Care,2022,END008,Malnutrition,MHT005,"MENTAL HEALTH PROCEDURES, NEC",421,"MALNUTRITION, FAILURE TO THRIVE AND OTHER NUTRITIONAL DISORDERS",10,"ENDOCRINE, NUTRITIONAL AND METABOLIC DISEASES AND DISORDERS",3,Major,Moderate,Medical,Medicaid,,,,,Y,232344.12,79460.42
New York City,Manhattan,7002001,001438,Bellevue Hospital Center,30 to 49,114,F,Black/African American,Spanish/Hispanic,3,Emergency,Home or Self Care,2022,SYM016,Other general signs and symptoms,GIS025,OTHER GI SYSTEM DEVICE PROCEDURES,421,"MALNUTRITION, FAILURE TO THRIVE AND OTHER NUTRITIONAL DISORDERS",10,"ENDOCRINE, NUTRITIONAL AND METABOLIC DISEASES AND DISORDERS",3,Major,Major,Medical,Medicaid,,,,,Y,29853.30,17168.16
New York City,Manhattan,7002001,001438,Bellevue Hospital Center,0 to 17,100,M,Other Race,Spanish/Hispanic,3,Emergency,Home or Self Care,2022,SYM016,Other general signs and symptoms,IMG005,MAGNETIC RESONANCE IMAGING (MRI),421,"MALNUTRITION, FAILURE TO THRIVE AND OTHER NUTRITIONAL DISORDERS",10,"ENDOCRINE, NUTRITIONAL AND METABOLIC DISEASES AND DISORDERS",1,Minor,Minor,Medical,Medicaid,,,,,Y,24649.49,14175.53
New York City,Manhattan,7002001,001438,Bellevue Hospital Center,50 to 69,104,M,Black/African American,Not Span/Hispanic,2,Emergency,Home or Self Care,2022,END007,Nutritional deficiencies,IMG007,COMPUTERIZED TOMOGRAPHY (CT) WITHOUT CONTRAST,421,"MALNUTRITION, FAILURE TO THRIVE AND OTHER NUTRITIONAL DISORDERS",10,"ENDOCRINE, NUTRITIONAL AND METABOLIC DISEASES AND DISORDERS",3,Major,Major,Medical,Medicare,,,,,Y,19220.44,11053.37
New York City,Manhattan,7002001,001438,Bellevue Hospital Center,70 or Older,104,M,Other Race,Spanish/Hispanic,20,Emergency,Home w/ Home Health Services,2022,SYM016,Other general signs and symptoms,GIS005,EXPLORATION OF PERITONEAL CAVITY,421,"MALNUTRITION, FAILURE TO THRIVE AND OTHER NUTRITIONAL DISORDERS",10,"ENDOCRINE, NUTRITIONAL AND METABOLIC DISEASES AND DISORDERS",3,Major,Moderate,Medical,Medicare,,,,,Y,170326.35,97951.96
New York City,Manhattan,7002053,001463,NYU Langone Hospitals,70 or Older,100,M,White,Not Span/Hispanic,4,Emergency,Skilled Nursing Home,2022,END008,Malnutrition,,,421,"MALNUTRITION, FAILURE TO THRIVE AND OTHER NUTRITIONAL DISORDERS",10,"ENDOCRINE, NUTRITIONAL AND METABOLIC DISEASES AND DISORDERS",3,Major,Extreme,Medical,Medicare,Medicare,,,,Y,77908.60,22884.14
New York City,Manhattan,7002053,001463,NYU Langone Hospitals,70 or Older,100,F,White,Not Span/Hispanic,6,Emergency,Skilled Nursing Home,2022,SYM016,Other general signs and symptoms,OTR004,ISOLATION PROCEDURES,421,"MALNUTRITION, FAILURE TO THRIVE AND OTHER NUTRITIONAL DISORDERS",10,"ENDOCRINE, NUTRITIONAL AND METABOLIC DISEASES AND DISORDERS",3,Major,Major,Medical,Medicare,Medicaid,,,,Y,83353.92,30552.87
New York City,Manhattan,7002053,001463,NYU Langone Hospitals,0 to 17,108,M,Black/African American,Not Span/Hispanic,2,Elective,Home or Self Care,2022,SYM016,Other general signs and symptoms,GIS017,GASTROSTOMY,421,"MALNUTRITION, FAILURE TO THRIVE AND OTHER NUTRITIONAL DISORDERS",10,"ENDOCRINE, NUTRITIONAL AND METABOLIC DISEASES AND DISORDERS",3,Major,Moderate,Medical,Medicaid,,,,,N,72356.51,20827.65
New York City,Manhattan,7002053,001463,NYU Langone Hospitals,0 to 17,109,M,White,Not Span/Hispanic,2,Elective,Home w/ Home Health Services,2022,SYM016,Other general signs and symptoms,GIS017,GASTROSTOMY,421,"MALNUTRITION, FAILURE TO THRIVE AND OTHER NUTRITIONAL DISORDERS",10,"ENDOCRINE, NUTRITIONAL AND METABOLIC DISEASES AND DISORDERS",3,Major,Minor,Medical,Medicaid,,,,,N,46248.29,9793.71
New York City,Manhattan,7002053,001463,NYU Langone Hospitals,30 to 49,112,F,White,Not Span/Hispanic,1,Elective,Home or Self Care,2022,END009,Obesity,,,421,"MALNUTRITION, FAILURE TO THRIVE AND OTHER NUTRITIONAL DISORDERS",10,"ENDOCRINE, NUTRITIONAL AND METABOLIC DISEASES AND DISORDERS",1,Minor,Minor,Medical,Blue Cross/Blue Shield,,,,,N,8757.65,4598.88
New York City,Manhattan,7002001,001438,Bellevue Hospital Center,18 to 29,100,F,White,Unknown,1,Emergency,Home or Self Care,2022,END008,Malnutrition,MAM007,ELECTROCARDIOGRAM (ECG),421,"MALNUTRITION, FAILURE TO THRIVE AND OTHER NUTRITIONAL DISORDERS",10,"ENDOCRINE, NUTRITIONAL AND METABOLIC DISEASES AND DISORDERS",2,Moderate,Minor,Medical,Medicaid,,,,,Y,11870.29,6826.41
New York City,Manhattan,7002001,001438,Bellevue Hospital Center,70 or Older,100,F,Other Race,Spanish/Hispanic,8,Emergency,Inpatient Rehabilitation Facility,2022,SYM016,Other general signs and symptoms,IMG005,MAGNETIC RESONANCE IMAGING (MRI),421,"MALNUTRITION, FAILURE TO THRIVE AND OTHER NUTRITIONAL DISORDERS",10,"ENDOCRINE, NUTRITIONAL AND METABOLIC DISEASES AND DISORDERS",2,Moderate,Minor,Medical,Medicare,,,,,Y,60855.45,34997.00
New York City,Manhattan,7002054,001464,New York-Presbyterian Hospital - Columbia Presbyterian Center,0 to 17,104,F,Black/African American,Spanish/Hispanic,1,Emergency,Home or Self Care,2022,PNL012,Neonatal digestive and feeding disorders,ADM021,"ADMINISTRATION OF THERAPEUTIC SUBSTANCES, NEC",421,"MALNUTRITION, FAILURE TO THRIVE AND OTHER NUTRITIONAL DISORDERS",10,"ENDOCRINE, NUTRITIONAL AND METABOLIC DISEASES AND DISORDERS",2,Moderate,Minor,Medical,Medicaid,,,03400,,Y,25479.31,
New York City,Manhattan,7002054,001464,New York-Presbyterian Hospital - Columbia Presbyterian Center,30 to 49,100,F,Black/African American,Not Span/Hispanic,4,Emergency,Home or Self Care,2022,END008,Malnutrition,,,421,"MALNUTRITION, FAILURE TO THRIVE AND OTHER NUTRITIONAL DISORDERS",10,"ENDOCRINE, NUTRITIONAL AND METABOLIC DISEASES AND DISORDERS",3,Major,Moderate,Medical,Medicaid,,,,,Y,60621.74,12896.99
New York City,Manhattan,7002054,001464,New York-Presbyterian Hospital - Columbia Presbyterian Center,0 to 17,109,M,Multi-racial,Not Span/Hispanic,3,Elective,Home or Self Care,2022,SYM016,Other general signs and symptoms,GIS017,GASTROSTOMY,421,"MALNUTRITION, FAILURE TO THRIVE AND OTHER NUTRITIONAL DISORDERS",10,"ENDOCRINE, NUTRITIONAL AND METABOLIC DISEASES AND DISORDERS",3,Major,Minor,Medical,Private Health Insurance,Medicaid,,,,N,96792.07,44256.64
New York City,Manhattan,7002054,001464,New York-Presbyterian Hospital - Columbia Presbyterian Center,0 to 17,104,M,Other Race,Spanish/Hispanic,1,Elective,Home or Self Care,2022,SYM016,Other general signs and symptoms,GIS017,GASTROSTOMY,421,"MALNUTRITION, FAILURE TO THRIVE AND OTHER NUTRITIONAL DISORDERS",10,"ENDOCRINE, NUTRITIONAL AND METABOLIC DISEASES AND DISORDERS",3,Major,Minor,Medical,Medicaid,,,03800,,N,33156.25,11436.28
New York City,Manhattan,7002054,001464,New York-Presbyterian Hospital - Columbia Presbyterian Center,0 to 17,OOS,M,White,Not Span/Hispanic,2,Elective,Home or Self Care,2022,SYM016,Other general signs and symptoms,GIS017,GASTROSTOMY,421,"MALNUTRITION, FAILURE TO THRIVE AND OTHER NUTRITIONAL DISORDERS",10,"ENDOCRINE, NUTRITIONAL AND METABOLIC DISEASES AND DISORDERS",3,Major,Moderate,Medical,Private Health Insurance,,,,,N,57948.25,23866.97
New York City,Manhattan,7002054,001464,New York-Presbyterian Hospital - Columbia Presbyterian Center,70 or Older,100,F,Black/African American,Not Span/Hispanic,4,Emergency,Home or Self Care,2022,SYM016,Other general signs and symptoms,GIS001,ESOPHAGOGASTRODUODENOSCOPY (EGD) WITH BIOPSY,421,"MALNUTRITION, FAILURE TO THRIVE AND OTHER NUTRITIONAL DISORDERS",10,"ENDOCRINE, NUTRITIONAL AND METABOLIC DISEASES AND DISORDERS",1,Minor,Minor,Medical,Medicare,,,,,Y,86350.77,20845.52
New York City,Manhattan,7002054,001464,New York-Presbyterian Hospital - Columbia Presbyterian Center,0 to 17,107,M,Other Race,Spanish/Hispanic,2,Elective,Home or Self Care,2022,END008,Malnutrition,GIS017,GASTROSTOMY,421,"MALNUTRITION, FAILURE TO THRIVE AND OTHER NUTRITIONAL DISORDERS",10,"ENDOCRINE, NUTRITIONAL AND METABOLIC DISEASES AND DISORDERS",3,Major,Moderate,Medical,Private Health Insurance,Medicaid,,,,N,44910.67,15570.11
New York City,Manhattan,7002053,001463,NYU Langone Hospitals,70 or Older,100,M,White,Not Span/Hispanic,5,Emergency,Skilled Nursing Home,2022,SYM016,Other general signs and symptoms,,,421,"MALNUTRITION, FAILURE TO THRIVE AND OTHER NUTRITIONAL DISORDERS",10,"ENDOCRINE, NUTRITIONAL AND METABOLIC DISEASES AND DISORDERS",3,Major,Extreme,Medical,Medicare,Blue Cross/Blue Shield,,,,Y,63227.25,24547.33
New York City,Manhattan,7002053,001463,NYU Langone Hospitals,0 to 17,119,F,White,Not Span/Hispanic,2,Elective,Home w/ Home Health Services,2022,SYM016,Other general signs and symptoms,GIS017,GASTROSTOMY,421,"MALNUTRITION, FAILURE TO THRIVE AND OTHER NUTRITIONAL DISORDERS",10,"ENDOCRINE, NUTRITIONAL AND METABOLIC DISEASES AND DISORDERS",3,Major,Moderate,Medical,Private Health Insurance,,,,,N,61888.95,19588.00
New York City,Manhattan,7002053,001463,NYU Langone Hospitals,0 to 17,104,F,Other Race,Not Span/Hispanic,50,Emergency,Home w/ Home Health Services,2022,END008,Malnutrition,GIS017,GASTROSTOMY,421,"MALNUTRITION, FAILURE TO THRIVE AND OTHER NUTRITIONAL DISORDERS",10,"ENDOCRINE, NUTRITIONAL AND METABOLIC DISEASES AND DISORDERS",4,Extreme,Major,Medical,Medicaid,,,,,Y,569107.68,177357.69
New York City,Manhattan,7002053,001463,NYU Langone Hospitals,70 or Older,114,M,White,Not Span/Hispanic,19,Emergency,Skilled Nursing Home,2022,END008,Malnutrition,GIS017,GASTROSTOMY,421,"MALNUTRITION, FAILURE TO THRIVE AND OTHER NUTRITIONAL DISORDERS",10,"ENDOCRINE, NUTRITIONAL AND METABOLIC DISEASES AND DISORDERS",3,Major,Extreme,Medical,Medicare,Medicare,Medicaid,,,Y,336234.78,105285.88