Hospital Service Area,Hospital County,Operating Certificate Number,Permanent Facility Id,Facility Name,Age Group,Zip Code - 3 digits,Gender,Race,Ethnicity,Length of Stay,Type of Admission,Patient Disposition,Discharge Year,CCS Diagnosis Code,CCS Diagnosis Description,CCS Procedure Code,CCS Procedure Description,APR DRG Code,APR DRG Description,APR MDC Code,APR MDC Description,APR Severity of Illness Code,APR Severity of Illness Description,APR Risk of Mortality,APR Medical Surgical Description,Payment Typology 1,Payment Typology 2,Payment Typology 3,Birth Weight,Abortion Edit Indicator,Emergency Department Indicator,Total Charges,Total Costs
New York City,Manhattan,7002054,001464,New York-Presbyterian Hospital - Columbia Presbyterian Center,0 to 17,104,F,Other Race,Not Span/Hispanic,3,Emergency,Home or Self Care,2022,END011,Fluid and electrolyte disorders,,,422,HYPOVOLEMIA AND RELATED ELECTROLYTE DISORDERS,10,"ENDOCRINE, NUTRITIONAL AND METABOLIC DISEASES AND DISORDERS",2,Moderate,Minor,Medical,Medicaid,,,,,Y,44951.62,9634.61
New York City,Manhattan,7002054,001464,New York-Presbyterian Hospital - Columbia Presbyterian Center,18 to 29,103,M,Other Race,Spanish/Hispanic,2,Elective,Home or Self Care,2022,END011,Fluid and electrolyte disorders,MAM005,MEASUREMENT DURING CARDIAC CATHETERIZATION,422,HYPOVOLEMIA AND RELATED ELECTROLYTE DISORDERS,10,"ENDOCRINE, NUTRITIONAL AND METABOLIC DISEASES AND DISORDERS",1,Minor,Minor,Medical,Medicaid,,,,,N,74340.28,
New York City,Manhattan,7002054,001464,New York-Presbyterian Hospital - Columbia Presbyterian Center,0 to 17,109,F,Other Race,Unknown,1,Emergency,Home or Self Care,2022,END011,Fluid and electrolyte disorders,ADM021,"ADMINISTRATION OF THERAPEUTIC SUBSTANCES, NEC",422,HYPOVOLEMIA AND RELATED ELECTROLYTE DISORDERS,10,"ENDOCRINE, NUTRITIONAL AND METABOLIC DISEASES AND DISORDERS",1,Minor,Minor,Medical,Private Health Insurance,,,,,Y,19557.90,4014.12
New York City,Manhattan,7002054,001464,New York-Presbyterian Hospital - Columbia Presbyterian Center,0 to 17,100,M,Black/African American,Not Span/Hispanic,1,Emergency,Home or Self Care,2022,END011,Fluid and electrolyte disorders,ADM017,ADMINISTRATION OF NUTRITIONAL AND ELECTROLYTIC SUBSTANCES,422,HYPOVOLEMIA AND RELATED ELECTROLYTE DISORDERS,10,"ENDOCRINE, NUTRITIONAL AND METABOLIC DISEASES AND DISORDERS",1,Minor,Minor,Medical,Medicaid,,,,,Y,20402.98,5766.48
New York City,Manhattan,7002001,001438,Bellevue Hospital Center,18 to 29,112,F,Other Race,Spanish/Hispanic,1,Emergency,Home or Self Care,2022,END011,Fluid and electrolyte disorders,ADM015,ADMINISTRATION OF ANTIBIOTICS,422,HYPOVOLEMIA AND RELATED ELECTROLYTE DISORDERS,10,"ENDOCRINE, NUTRITIONAL AND METABOLIC DISEASES AND DISORDERS",3,Major,Major,Medical,Medicaid,,,,,Y,9012.18,5182.76
New York City,Manhattan,7002001,001438,Bellevue Hospital Center,70 or Older,112,M,Other Race,Spanish/Hispanic,13,Urgent,Skilled Nursing Home,2022,END011,Fluid and electrolyte disorders,MAM006,PACEMAKER AND DEFIBRILLATOR INTERROGATION,422,HYPOVOLEMIA AND RELATED ELECTROLYTE DISORDERS,10,"ENDOCRINE, NUTRITIONAL AND METABOLIC DISEASES AND DISORDERS",3,Major,Major,Medical,Medicare,Private Health Insurance,,,,N,83364.42,47941.54
New York City,Manhattan,7002054,001464,New York-Presbyterian Hospital - Columbia Presbyterian Center,0 to 17,100,F,White,Spanish/Hispanic,1,Emergency,Home or Self Care,2022,END011,Fluid and electrolyte disorders,ADM017,ADMINISTRATION OF NUTRITIONAL AND ELECTROLYTIC SUBSTANCES,422,HYPOVOLEMIA AND RELATED ELECTROLYTE DISORDERS,10,"ENDOCRINE, NUTRITIONAL AND METABOLIC DISEASES AND DISORDERS",3,Major,Moderate,Medical,Medicaid,,,,,Y,23554.45,5079.19
New York City,Manhattan,7002054,001464,New York-Presbyterian Hospital - Columbia Presbyterian Center,0 to 17,OOS,F,Other Race,Unknown,5,Elective,Home or Self Care,2022,END011,Fluid and electrolyte disorders,ADM017,ADMINISTRATION OF NUTRITIONAL AND ELECTROLYTIC SUBSTANCES,422,HYPOVOLEMIA AND RELATED ELECTROLYTE DISORDERS,10,"ENDOCRINE, NUTRITIONAL AND METABOLIC DISEASES AND DISORDERS",3,Major,Major,Medical,Private Health Insurance,,,,,N,91828.88,22451.70
New York City,Manhattan,7002053,001463,NYU Langone Hospitals,70 or Older,OOS,F,White,Not Span/Hispanic,4,Emergency,Hospice - Medical Facility,2022,END011,Fluid and electrolyte disorders,,,422,HYPOVOLEMIA AND RELATED ELECTROLYTE DISORDERS,10,"ENDOCRINE, NUTRITIONAL AND METABOLIC DISEASES AND DISORDERS",3,Major,Major,Medical,Medicare,Medicare,Medicaid,,,Y,62561.59,20245.39
New York City,Manhattan,7002054,001464,New York-Presbyterian Hospital - Columbia Presbyterian Center,50 to 69,103,M,White,Not Span/Hispanic,2,Emergency,Home or Self Care,2022,END011,Fluid and electrolyte disorders,,,422,HYPOVOLEMIA AND RELATED ELECTROLYTE DISORDERS,10,"ENDOCRINE, NUTRITIONAL AND METABOLIC DISEASES AND DISORDERS",2,Moderate,Moderate,Medical,Medicare,,,,,Y,36401.12,7982.57
New York City,Manhattan,7002054,001464,New York-Presbyterian Hospital - Columbia Presbyterian Center,0 to 17,109,F,Other Race,Unknown,1,Emergency,Home or Self Care,2022,END011,Fluid and electrolyte disorders,ENT001,LARYNGOSCOPY (DIAGNOSTIC),422,HYPOVOLEMIA AND RELATED ELECTROLYTE DISORDERS,10,"ENDOCRINE, NUTRITIONAL AND METABOLIC DISEASES AND DISORDERS",2,Moderate,Minor,Medical,Medicaid,,,,,Y,26074.09,5244.79
Finger Lakes,Monroe,2701005,000413,Strong Memorial Hospital,50 to 69,146,M,White,Not Span/Hispanic,6,Urgent,Home or Self Care,2022,END011,Fluid and electrolyte disorders,GIS027,"UPPER GI THERAPEUTIC PROCEDURES, NEC (ENDOSCOPIC)",422,HYPOVOLEMIA AND RELATED ELECTROLYTE DISORDERS,10,"ENDOCRINE, NUTRITIONAL AND METABOLIC DISEASES AND DISORDERS",2,Moderate,Moderate,Medical,Medicaid,,,,,N,23452.50,11087.76
Finger Lakes,Monroe,2701005,000413,Strong Memorial Hospital,0 to 17,148,F,White,Not Span/Hispanic,2,Emergency,Home or Self Care,2022,END011,Fluid and electrolyte disorders,,,422,HYPOVOLEMIA AND RELATED ELECTROLYTE DISORDERS,10,"ENDOCRINE, NUTRITIONAL AND METABOLIC DISEASES AND DISORDERS",2,Moderate,Minor,Medical,Medicaid,,,02900,,Y,16411.79,7331.29
Finger Lakes,Monroe,2701005,000413,Strong Memorial Hospital,0 to 17,142,F,Black/African American,Not Span/Hispanic,2,Emergency,Home or Self Care,2022,END011,Fluid and electrolyte disorders,,,422,HYPOVOLEMIA AND RELATED ELECTROLYTE DISORDERS,10,"ENDOCRINE, NUTRITIONAL AND METABOLIC DISEASES AND DISORDERS",2,Moderate,Moderate,Medical,Medicaid,,,,,Y,6655.10,3084.76
Finger Lakes,Monroe,2701005,000413,Strong Memorial Hospital,70 or Older,145,F,White,Not Span/Hispanic,4,Emergency,Skilled Nursing Home,2022,END011,Fluid and electrolyte disorders,ADM017,ADMINISTRATION OF NUTRITIONAL AND ELECTROLYTIC SUBSTANCES,422,HYPOVOLEMIA AND RELATED ELECTROLYTE DISORDERS,10,"ENDOCRINE, NUTRITIONAL AND METABOLIC DISEASES AND DISORDERS",2,Moderate,Moderate,Medical,Medicare,Medicaid,,,,Y,23260.74,8882.10
Finger Lakes,Monroe,2701005,000413,Strong Memorial Hospital,0 to 17,144,M,Other Race,Not Span/Hispanic,1,Emergency,Home or Self Care,2022,END011,Fluid and electrolyte disorders,,,422,HYPOVOLEMIA AND RELATED ELECTROLYTE DISORDERS,10,"ENDOCRINE, NUTRITIONAL AND METABOLIC DISEASES AND DISORDERS",3,Major,Moderate,Medical,Medicaid,,,,,Y,5159.26,2016.48
New York City,Manhattan,7002053,001463,NYU Langone Hospitals,0 to 17,104,F,Black/African American,Not Span/Hispanic,5,Emergency,Home or Self Care,2022,END011,Fluid and electrolyte disorders,,,422,HYPOVOLEMIA AND RELATED ELECTROLYTE DISORDERS,10,"ENDOCRINE, NUTRITIONAL AND METABOLIC DISEASES AND DISORDERS",3,Major,Moderate,Medical,Medicaid,,,,,Y,59076.18,16970.45
New York City,Manhattan,7002053,001463,NYU Langone Hospitals,0 to 17,112,F,Other Race,Not Span/Hispanic,7,Emergency,Home or Self Care,2022,END011,Fluid and electrolyte disorders,CNS013,SPINAL EPIDURAL CATHETER PLACEMENT,422,HYPOVOLEMIA AND RELATED ELECTROLYTE DISORDERS,10,"ENDOCRINE, NUTRITIONAL AND METABOLIC DISEASES AND DISORDERS",3,Major,Moderate,Medical,Medicaid,,,,,Y,120638.08,28382.79
New York City,Manhattan,7002053,001463,NYU Langone Hospitals,0 to 17,108,M,Black/African American,Not Span/Hispanic,2,Emergency,Home w/ Home Health Services,2022,END011,Fluid and electrolyte disorders,OTR004,ISOLATION PROCEDURES,422,HYPOVOLEMIA AND RELATED ELECTROLYTE DISORDERS,10,"ENDOCRINE, NUTRITIONAL AND METABOLIC DISEASES AND DISORDERS",4,Extreme,Extreme,Medical,Medicaid,,,,,Y,37230.06,10519.36
New York City,Manhattan,7002001,001438,Bellevue Hospital Center,70 or Older,112,M,White,Unknown,2,Emergency,Home or Self Care,2022,END011,Fluid and electrolyte disorders,ADM021,"ADMINISTRATION OF THERAPEUTIC SUBSTANCES, NEC",422,HYPOVOLEMIA AND RELATED ELECTROLYTE DISORDERS,10,"ENDOCRINE, NUTRITIONAL AND METABOLIC DISEASES AND DISORDERS",2,Moderate,Moderate,Medical,Medicare,Medicaid,,,,Y,19714.72,11337.62
New York City,Manhattan,7002001,001438,Bellevue Hospital Center,30 to 49,112,M,Other Race,Unknown,5,Emergency,Home or Self Care,2022,END011,Fluid and electrolyte disorders,ADM015,ADMINISTRATION OF ANTIBIOTICS,422,HYPOVOLEMIA AND RELATED ELECTROLYTE DISORDERS,10,"ENDOCRINE, NUTRITIONAL AND METABOLIC DISEASES AND DISORDERS",3,Major,Major,Medical,Medicaid,,,,,Y,47154.70,27117.91
Finger Lakes,Monroe,2701005,000413,Strong Memorial Hospital,50 to 69,147,M,White,Not Span/Hispanic,4,Emergency,Home or Self Care,2022,END011,Fluid and electrolyte disorders,,,422,HYPOVOLEMIA AND RELATED ELECTROLYTE DISORDERS,10,"ENDOCRINE, NUTRITIONAL AND METABOLIC DISEASES AND DISORDERS",3,Major,Major,Medical,Federal/State/Local/VA,,,,,Y,12494.11,6282.34
Finger Lakes,Monroe,2701005,000413,Strong Memorial Hospital,70 or Older,144,F,Black/African American,Not Span/Hispanic,2,Emergency,Home or Self Care,2022,END011,Fluid and electrolyte disorders,,,422,HYPOVOLEMIA AND RELATED ELECTROLYTE DISORDERS,10,"ENDOCRINE, NUTRITIONAL AND METABOLIC DISEASES AND DISORDERS",2,Moderate,Moderate,Medical,Medicare,,,,,Y,11491.02,4757.82
Finger Lakes,Monroe,2701005,000413,Strong Memorial Hospital,50 to 69,146,F,White,Not Span/Hispanic,2,Emergency,Home or Self Care,2022,END011,Fluid and electrolyte disorders,,,422,HYPOVOLEMIA AND RELATED ELECTROLYTE DISORDERS,10,"ENDOCRINE, NUTRITIONAL AND METABOLIC DISEASES AND DISORDERS",2,Moderate,Moderate,Medical,Medicaid,,,,,Y,9772.79,3974.43
New York City,Manhattan,7002053,001463,NYU Langone Hospitals,0 to 17,100,M,Other Race,Spanish/Hispanic,1,Emergency,Home or Self Care,2022,END011,Fluid and electrolyte disorders,OTR004,ISOLATION PROCEDURES,422,HYPOVOLEMIA AND RELATED ELECTROLYTE DISORDERS,10,"ENDOCRINE, NUTRITIONAL AND METABOLIC DISEASES AND DISORDERS",3,Major,Moderate,Medical,Medicaid,,,,,Y,47677.52,5580.59
New York City,Manhattan,7002001,001438,Bellevue Hospital Center,70 or Older,113,M,Other Race,Unknown,15,Urgent,Psychiatric Hospital or Unit of Hosp,2022,END011,Fluid and electrolyte disorders,ADM021,"ADMINISTRATION OF THERAPEUTIC SUBSTANCES, NEC",422,HYPOVOLEMIA AND RELATED ELECTROLYTE DISORDERS,10,"ENDOCRINE, NUTRITIONAL AND METABOLIC DISEASES AND DISORDERS",2,Moderate,Major,Medical,Medicare,Medicaid,,,,N,101120.36,58152.70
New York City,Manhattan,7002054,001464,New York-Presbyterian Hospital - Columbia Presbyterian Center,70 or Older,OOS,M,Other Race,Not Span/Hispanic,4,Emergency,Home or Self Care,2022,END011,Fluid and electrolyte disorders,ADM007,INTRAVENOUS INDUCTION OF LABOR,422,HYPOVOLEMIA AND RELATED ELECTROLYTE DISORDERS,10,"ENDOCRINE, NUTRITIONAL AND METABOLIC DISEASES AND DISORDERS",3,Major,Major,Medical,Self-Pay,,,,,Y,147019.08,44796.11
New York City,Manhattan,7002054,001464,New York-Presbyterian Hospital - Columbia Presbyterian Center,0 to 17,104,F,White,Spanish/Hispanic,1,Emergency,Home or Self Care,2022,END011,Fluid and electrolyte disorders,ADM017,ADMINISTRATION OF NUTRITIONAL AND ELECTROLYTIC SUBSTANCES,422,HYPOVOLEMIA AND RELATED ELECTROLYTE DISORDERS,10,"ENDOCRINE, NUTRITIONAL AND METABOLIC DISEASES AND DISORDERS",2,Moderate,Moderate,Medical,Private Health Insurance,,,,,Y,21666.15,4482.03
New York City,Manhattan,7002054,001464,New York-Presbyterian Hospital - Columbia Presbyterian Center,0 to 17,117,F,White,Not Span/Hispanic,3,Emergency,Home or Self Care,2022,END011,Fluid and electrolyte disorders,,,422,HYPOVOLEMIA AND RELATED ELECTROLYTE DISORDERS,10,"ENDOCRINE, NUTRITIONAL AND METABOLIC DISEASES AND DISORDERS",3,Major,Minor,Medical,Private Health Insurance,,,,,Y,46094.86,11431.75
New York City,Manhattan,7002054,001464,New York-Presbyterian Hospital - Columbia Presbyterian Center,0 to 17,104,F,White,Spanish/Hispanic,3,Emergency,Home or Self Care,2022,END011,Fluid and electrolyte disorders,,,422,HYPOVOLEMIA AND RELATED ELECTROLYTE DISORDERS,10,"ENDOCRINE, NUTRITIONAL AND METABOLIC DISEASES AND DISORDERS",2,Moderate,Minor,Medical,Medicaid,,,,,Y,45215.04,9600.46
New York City,Manhattan,7002054,001464,New York-Presbyterian Hospital - Columbia Presbyterian Center,18 to 29,100,F,Other Race,Spanish/Hispanic,3,Emergency,Home or Self Care,2022,END011,Fluid and electrolyte disorders,,,422,HYPOVOLEMIA AND RELATED ELECTROLYTE DISORDERS,10,"ENDOCRINE, NUTRITIONAL AND METABOLIC DISEASES AND DISORDERS",2,Moderate,Moderate,Medical,Medicaid,,,,,Y,44210.96,9245.14
New York City,Manhattan,7002053,001463,NYU Langone Hospitals,0 to 17,112,M,White,Not Span/Hispanic,4,Emergency,Home or Self Care,2022,END011,Fluid and electrolyte disorders,,,422,HYPOVOLEMIA AND RELATED ELECTROLYTE DISORDERS,10,"ENDOCRINE, NUTRITIONAL AND METABOLIC DISEASES AND DISORDERS",2,Moderate,Moderate,Medical,Medicaid,,,,,Y,43131.05,13249.04
New York City,Manhattan,7002053,001463,NYU Langone Hospitals,70 or Older,100,M,Other Race,Not Span/Hispanic,7,Emergency,Skilled Nursing Home,2022,END011,Fluid and electrolyte disorders,,,422,HYPOVOLEMIA AND RELATED ELECTROLYTE DISORDERS,10,"ENDOCRINE, NUTRITIONAL AND METABOLIC DISEASES AND DISORDERS",3,Major,Major,Medical,Medicare,Blue Cross/Blue Shield,,,,Y,129865.43,37115.96
New York City,Manhattan,7002053,001463,NYU Langone Hospitals,50 to 69,114,F,Black/African American,Not Span/Hispanic,1,Emergency,Home w/ Home Health Services,2022,END011,Fluid and electrolyte disorders,GIS006,PARACENTESIS,422,HYPOVOLEMIA AND RELATED ELECTROLYTE DISORDERS,10,"ENDOCRINE, NUTRITIONAL AND METABOLIC DISEASES AND DISORDERS",3,Major,Major,Medical,Medicare,,,,,Y,71989.54,18257.85
New York City,Manhattan,7002001,001438,Bellevue Hospital Center,70 or Older,111,F,Other Race,Not Span/Hispanic,1,Emergency,Home or Self Care,2022,END011,Fluid and electrolyte disorders,ADM021,"ADMINISTRATION OF THERAPEUTIC SUBSTANCES, NEC",422,HYPOVOLEMIA AND RELATED ELECTROLYTE DISORDERS,10,"ENDOCRINE, NUTRITIONAL AND METABOLIC DISEASES AND DISORDERS",2,Moderate,Moderate,Medical,Medicaid,,,,,Y,11213.22,6448.54
New York City,Manhattan,7002001,001438,Bellevue Hospital Center,0 to 17,104,F,Black/African American,Unknown,7,Emergency,Home or Self Care,2022,END011,Fluid and electrolyte disorders,ADM021,"ADMINISTRATION OF THERAPEUTIC SUBSTANCES, NEC",422,HYPOVOLEMIA AND RELATED ELECTROLYTE DISORDERS,10,"ENDOCRINE, NUTRITIONAL AND METABOLIC DISEASES AND DISORDERS",1,Minor,Minor,Medical,Self-Pay,,,,,Y,53286.94,30644.47
Finger Lakes,Monroe,2701005,000413,Strong Memorial Hospital,0 to 17,144,F,Other Race,Spanish/Hispanic,2,Emergency,Home or Self Care,2022,END011,Fluid and electrolyte disorders,,,422,HYPOVOLEMIA AND RELATED ELECTROLYTE DISORDERS,10,"ENDOCRINE, NUTRITIONAL AND METABOLIC DISEASES AND DISORDERS",3,Major,Moderate,Medical,Medicaid,,,,,Y,9681.72,3931.70
Finger Lakes,Monroe,2701005,000413,Strong Memorial Hospital,70 or Older,146,F,White,Not Span/Hispanic,1,Emergency,Home or Self Care,2022,END011,Fluid and electrolyte disorders,,,422,HYPOVOLEMIA AND RELATED ELECTROLYTE DISORDERS,10,"ENDOCRINE, NUTRITIONAL AND METABOLIC DISEASES AND DISORDERS",2,Moderate,Moderate,Medical,Medicare,Private Health Insurance,,,,Y,8525.87,2861.54
Finger Lakes,Monroe,2701005,000413,Strong Memorial Hospital,50 to 69,144,M,White,Not Span/Hispanic,9,Emergency,Home w/ Home Health Services,2022,END011,Fluid and electrolyte disorders,GIS017,GASTROSTOMY,422,HYPOVOLEMIA AND RELATED ELECTROLYTE DISORDERS,10,"ENDOCRINE, NUTRITIONAL AND METABOLIC DISEASES AND DISORDERS",3,Major,Major,Medical,Medicare,,,,,Y,37330.99,17092.82
Finger Lakes,Monroe,2701005,000413,Strong Memorial Hospital,0 to 17,146,M,Black/African American,Not Span/Hispanic,2,Emergency,Home or Self Care,2022,END011,Fluid and electrolyte disorders,ADM017,ADMINISTRATION OF NUTRITIONAL AND ELECTROLYTIC SUBSTANCES,422,HYPOVOLEMIA AND RELATED ELECTROLYTE DISORDERS,10,"ENDOCRINE, NUTRITIONAL AND METABOLIC DISEASES AND DISORDERS",3,Major,Moderate,Medical,Medicaid,,,,,Y,9756.44,4295.44
Finger Lakes,Monroe,2701005,000413,Strong Memorial Hospital,70 or Older,145,F,White,Not Span/Hispanic,4,Emergency,Home or Self Care,2022,END011,Fluid and electrolyte disorders,,,422,HYPOVOLEMIA AND RELATED ELECTROLYTE DISORDERS,10,"ENDOCRINE, NUTRITIONAL AND METABOLIC DISEASES AND DISORDERS",4,Extreme,Major,Medical,Medicare,,,,,Y,14523.26,6596.56
Finger Lakes,Monroe,2701005,000413,Strong Memorial Hospital,0 to 17,145,M,White,Not Span/Hispanic,2,Emergency,Home or Self Care,2022,PNL013,Other specified and unspecified perinatal conditions,,,422,HYPOVOLEMIA AND RELATED ELECTROLYTE DISORDERS,10,"ENDOCRINE, NUTRITIONAL AND METABOLIC DISEASES AND DISORDERS",1,Minor,Minor,Medical,Medicaid,,,03700,,Y,7771.36,3431.37
New York City,Manhattan,7002001,001438,Bellevue Hospital Center,0 to 17,100,M,White,Unknown,1,Emergency,Home or Self Care,2022,END011,Fluid and electrolyte disorders,ADM017,ADMINISTRATION OF NUTRITIONAL AND ELECTROLYTIC SUBSTANCES,422,HYPOVOLEMIA AND RELATED ELECTROLYTE DISORDERS,10,"ENDOCRINE, NUTRITIONAL AND METABOLIC DISEASES AND DISORDERS",2,Moderate,Moderate,Medical,Private Health Insurance,,,,,Y,11130.95,6401.23
New York City,Manhattan,7002001,001438,Bellevue Hospital Center,70 or Older,100,M,Other Race,Not Span/Hispanic,9,Emergency,Home or Self Care,2022,END011,Fluid and electrolyte disorders,URN006,BLADDER CATHETERIZATION AND DRAINAGE,422,HYPOVOLEMIA AND RELATED ELECTROLYTE DISORDERS,10,"ENDOCRINE, NUTRITIONAL AND METABOLIC DISEASES AND DISORDERS",2,Moderate,Moderate,Medical,Medicare,Medicaid,,,,Y,84349.01,48507.77
New York City,Manhattan,7002053,001463,NYU Langone Hospitals,70 or Older,111,F,Other Race,Unknown,6,Emergency,Home w/ Home Health Services,2022,END011,Fluid and electrolyte disorders,OTR004,ISOLATION PROCEDURES,422,HYPOVOLEMIA AND RELATED ELECTROLYTE DISORDERS,10,"ENDOCRINE, NUTRITIONAL AND METABOLIC DISEASES AND DISORDERS",3,Major,Extreme,Medical,Medicaid,,,,,Y,76532.32,30532.35
New York City,Manhattan,7002054,001464,New York-Presbyterian Hospital - Columbia Presbyterian Center,0 to 17,104,M,Other Race,Unknown,2,Emergency,Home or Self Care,2022,END011,Fluid and electrolyte disorders,,,422,HYPOVOLEMIA AND RELATED ELECTROLYTE DISORDERS,10,"ENDOCRINE, NUTRITIONAL AND METABOLIC DISEASES AND DISORDERS",1,Minor,Minor,Medical,Private Health Insurance,,,,,Y,36666.17,7632.28
New York City,Manhattan,7002054,001464,New York-Presbyterian Hospital - Columbia Presbyterian Center,0 to 17,104,F,Other Race,Spanish/Hispanic,2,Emergency,Home or Self Care,2022,END011,Fluid and electrolyte disorders,ADM021,"ADMINISTRATION OF THERAPEUTIC SUBSTANCES, NEC",422,HYPOVOLEMIA AND RELATED ELECTROLYTE DISORDERS,10,"ENDOCRINE, NUTRITIONAL AND METABOLIC DISEASES AND DISORDERS",1,Minor,Minor,Medical,Medicaid,,,,,Y,30299.86,7936.52
New York City,Manhattan,7002054,001464,New York-Presbyterian Hospital - Columbia Presbyterian Center,0 to 17,100,M,Black/African American,Not Span/Hispanic,65,Emergency,Cancer Center or Children's Hospital,2022,END011,Fluid and electrolyte disorders,MAM013,MONITORING OF PERIPHERAL NERVES,422,HYPOVOLEMIA AND RELATED ELECTROLYTE DISORDERS,10,"ENDOCRINE, NUTRITIONAL AND METABOLIC DISEASES AND DISORDERS",4,Extreme,Major,Medical,Medicaid,,,,,Y,1068613.29,360957.22
New York City,Manhattan,7002054,001464,New York-Presbyterian Hospital - Columbia Presbyterian Center,70 or Older,100,F,White,Spanish/Hispanic,2,Emergency,Home or Self Care,2022,END011,Fluid and electrolyte disorders,ADM021,"ADMINISTRATION OF THERAPEUTIC SUBSTANCES, NEC",422,HYPOVOLEMIA AND RELATED ELECTROLYTE DISORDERS,10,"ENDOCRINE, NUTRITIONAL AND METABOLIC DISEASES AND DISORDERS",2,Moderate,Major,Medical,Medicare,,,,,Y,34863.91,7629.32
New York City,Manhattan,7002054,001464,New York-Presbyterian Hospital - Columbia Presbyterian Center,0 to 17,109,M,Multi-racial,Not Span/Hispanic,2,Emergency,Home or Self Care,2022,END011,Fluid and electrolyte disorders,,,422,HYPOVOLEMIA AND RELATED ELECTROLYTE DISORDERS,10,"ENDOCRINE, NUTRITIONAL AND METABOLIC DISEASES AND DISORDERS",2,Moderate,Minor,Medical,Private Health Insurance,Medicaid,,,,Y,36225.65,
New York City,Manhattan,7002054,001464,New York-Presbyterian Hospital - Columbia Presbyterian Center,70 or Older,100,F,Other Race,Unknown,4,Emergency,Skilled Nursing Home,2022,END011,Fluid and electrolyte disorders,,,422,HYPOVOLEMIA AND RELATED ELECTROLYTE DISORDERS,10,"ENDOCRINE, NUTRITIONAL AND METABOLIC DISEASES AND DISORDERS",1,Minor,Moderate,Medical,Medicare,,,,,Y,67098.17,14032.19
Long Island,Nassau,2951001,000541,North Shore University Hospital,70 or Older,112,M,White,Not Span/Hispanic,3,Emergency,Home w/ Home Health Services,2022,END011,Fluid and electrolyte disorders,,,422,HYPOVOLEMIA AND RELATED ELECTROLYTE DISORDERS,10,"ENDOCRINE, NUTRITIONAL AND METABOLIC DISEASES AND DISORDERS",2,Moderate,Moderate,Medical,Medicare,Medicaid,,,,Y,46687.09,7225.12
Long Island,Nassau,2951001,000541,North Shore University Hospital,70 or Older,115,M,White,Not Span/Hispanic,4,Emergency,Home or Self Care,2022,END011,Fluid and electrolyte disorders,,,422,HYPOVOLEMIA AND RELATED ELECTROLYTE DISORDERS,10,"ENDOCRINE, NUTRITIONAL AND METABOLIC DISEASES AND DISORDERS",2,Moderate,Moderate,Medical,Medicare,,,,,Y,65978.85,9664.64
Long Island,Nassau,2951001,000541,North Shore University Hospital,50 to 69,114,M,Black/African American,Not Span/Hispanic,1,Emergency,Home or Self Care,2022,END011,Fluid and electrolyte disorders,MAM006,PACEMAKER AND DEFIBRILLATOR INTERROGATION,422,HYPOVOLEMIA AND RELATED ELECTROLYTE DISORDERS,10,"ENDOCRINE, NUTRITIONAL AND METABOLIC DISEASES AND DISORDERS",3,Major,Major,Medical,Medicaid,Medicaid,,,,Y,19084.58,3200.74
Long Island,Nassau,2951001,000541,North Shore University Hospital,70 or Older,113,F,White,Not Span/Hispanic,3,Emergency,Home w/ Home Health Services,2022,END011,Fluid and electrolyte disorders,,,422,HYPOVOLEMIA AND RELATED ELECTROLYTE DISORDERS,10,"ENDOCRINE, NUTRITIONAL AND METABOLIC DISEASES AND DISORDERS",2,Moderate,Major,Medical,Medicare,Private Health Insurance,,,,Y,48755.69,7347.63
Long Island,Nassau,2951001,000541,North Shore University Hospital,70 or Older,113,F,White,Not Span/Hispanic,2,Emergency,Home or Self Care,2022,END011,Fluid and electrolyte disorders,,,422,HYPOVOLEMIA AND RELATED ELECTROLYTE DISORDERS,10,"ENDOCRINE, NUTRITIONAL AND METABOLIC DISEASES AND DISORDERS",2,Moderate,Moderate,Medical,Medicare,Blue Cross/Blue Shield,,,,Y,39915.78,6049.81
Long Island,Nassau,2951001,000541,North Shore University Hospital,50 to 69,114,F,Other Race,Not Span/Hispanic,2,Emergency,Home or Self Care,2022,END011,Fluid and electrolyte disorders,,,422,HYPOVOLEMIA AND RELATED ELECTROLYTE DISORDERS,10,"ENDOCRINE, NUTRITIONAL AND METABOLIC DISEASES AND DISORDERS",1,Minor,Moderate,Medical,Private Health Insurance,Medicare,,,,Y,33003.07,5177.12
Long Island,Nassau,2951001,000541,North Shore University Hospital,70 or Older,110,F,White,Not Span/Hispanic,3,Emergency,Home w/ Home Health Services,2022,END011,Fluid and electrolyte disorders,,,422,HYPOVOLEMIA AND RELATED ELECTROLYTE DISORDERS,10,"ENDOCRINE, NUTRITIONAL AND METABOLIC DISEASES AND DISORDERS",2,Moderate,Moderate,Medical,Medicare,Medicare,,,,Y,48631.47,7592.46