Hospital Service Area,Hospital County,Operating Certificate Number,Permanent Facility Id,Facility Name,Age Group,Zip Code - 3 digits,Gender,Race,Ethnicity,Length of Stay,Type of Admission,Patient Disposition,Discharge Year,CCS Diagnosis Code,CCS Diagnosis Description,CCS Procedure Code,CCS Procedure Description,APR DRG Code,APR DRG Description,APR MDC Code,APR MDC Description,APR Severity of Illness Code,APR Severity of Illness Description,APR Risk of Mortality,APR Medical Surgical Description,Payment Typology 1,Payment Typology 2,Payment Typology 3,Birth Weight,Abortion Edit Indicator,Emergency Department Indicator,Total Charges,Total Costs
New York City,Manhattan,7002054,001464,New York-Presbyterian Hospital - Columbia Presbyterian Center,50 to 69,100,M,Other Race,Spanish/Hispanic,1,Emergency,Home or Self Care,2022,END011,Fluid and electrolyte disorders,ESA001,HEMODIALYSIS,425,OTHER NON-HYPOVOLEMIC ELECTROLYTE DISORDERS,10,"ENDOCRINE, NUTRITIONAL AND METABOLIC DISEASES AND DISORDERS",2,Moderate,Major,Medical,Medicare,Medicaid,,,,Y,26397.76,
New York City,Manhattan,7002001,001438,Bellevue Hospital Center,50 to 69,100,F,Black/African American,Unknown,6,Emergency,Home or Self Care,2022,END011,Fluid and electrolyte disorders,ESA001,HEMODIALYSIS,425,OTHER NON-HYPOVOLEMIC ELECTROLYTE DISORDERS,10,"ENDOCRINE, NUTRITIONAL AND METABOLIC DISEASES AND DISORDERS",2,Moderate,Moderate,Medical,Medicare,Medicaid,,,,Y,41859.52,24072.74
New York City,Manhattan,7002001,001438,Bellevue Hospital Center,70 or Older,112,M,Black/African American,Not Span/Hispanic,9,Urgent,Home w/ Home Health Services,2022,END011,Fluid and electrolyte disorders,ESA001,HEMODIALYSIS,425,OTHER NON-HYPOVOLEMIC ELECTROLYTE DISORDERS,10,"ENDOCRINE, NUTRITIONAL AND METABOLIC DISEASES AND DISORDERS",3,Major,Moderate,Medical,Medicare,Medicaid,,,,N,77645.56,44652.72
New York City,Manhattan,7002054,001464,New York-Presbyterian Hospital - Columbia Presbyterian Center,70 or Older,100,M,Other Race,Spanish/Hispanic,3,Emergency,Facility w/ Custodial/Supportive Care,2022,END011,Fluid and electrolyte disorders,ADM021,"ADMINISTRATION OF THERAPEUTIC SUBSTANCES, NEC",425,OTHER NON-HYPOVOLEMIC ELECTROLYTE DISORDERS,10,"ENDOCRINE, NUTRITIONAL AND METABOLIC DISEASES AND DISORDERS",2,Moderate,Moderate,Medical,Medicare,,,,,Y,54999.58,11546.10
New York City,Manhattan,7002054,001464,New York-Presbyterian Hospital - Columbia Presbyterian Center,30 to 49,104,M,Other Race,Spanish/Hispanic,6,Emergency,Home or Self Care,2022,END011,Fluid and electrolyte disorders,ESA001,HEMODIALYSIS,425,OTHER NON-HYPOVOLEMIC ELECTROLYTE DISORDERS,10,"ENDOCRINE, NUTRITIONAL AND METABOLIC DISEASES AND DISORDERS",3,Major,Major,Medical,Medicaid,,,,,Y,139453.70,58060.04
New York City,Manhattan,7002054,001464,New York-Presbyterian Hospital - Columbia Presbyterian Center,50 to 69,112,M,Other Race,Spanish/Hispanic,7,Emergency,Expired,2022,END011,Fluid and electrolyte disorders,ESA001,HEMODIALYSIS,425,OTHER NON-HYPOVOLEMIC ELECTROLYTE DISORDERS,10,"ENDOCRINE, NUTRITIONAL AND METABOLIC DISEASES AND DISORDERS",4,Extreme,Extreme,Medical,Medicaid,,,,,Y,357165.29,131783.29
New York City,Manhattan,7002054,001464,New York-Presbyterian Hospital - Columbia Presbyterian Center,50 to 69,100,M,Other Race,Not Span/Hispanic,4,Emergency,Home or Self Care,2022,END011,Fluid and electrolyte disorders,ESA001,HEMODIALYSIS,425,OTHER NON-HYPOVOLEMIC ELECTROLYTE DISORDERS,10,"ENDOCRINE, NUTRITIONAL AND METABOLIC DISEASES AND DISORDERS",3,Major,Extreme,Medical,Medicaid,,,,,Y,67972.41,15188.86
New York City,Manhattan,7002054,001464,New York-Presbyterian Hospital - Columbia Presbyterian Center,30 to 49,104,F,Other Race,Unknown,3,Emergency,Home or Self Care,2022,END011,Fluid and electrolyte disorders,ESA001,HEMODIALYSIS,425,OTHER NON-HYPOVOLEMIC ELECTROLYTE DISORDERS,10,"ENDOCRINE, NUTRITIONAL AND METABOLIC DISEASES AND DISORDERS",3,Major,Minor,Medical,Medicare,,,,,Y,64932.04,15140.23
New York City,Manhattan,7002001,001438,Bellevue Hospital Center,30 to 49,112,M,Black/African American,Unknown,3,Urgent,Home w/ Home Health Services,2022,END011,Fluid and electrolyte disorders,ADM021,"ADMINISTRATION OF THERAPEUTIC SUBSTANCES, NEC",425,OTHER NON-HYPOVOLEMIC ELECTROLYTE DISORDERS,10,"ENDOCRINE, NUTRITIONAL AND METABOLIC DISEASES AND DISORDERS",3,Major,Major,Medical,Medicare,,,,,N,22923.10,
New York City,Manhattan,7002054,001464,New York-Presbyterian Hospital - Columbia Presbyterian Center,50 to 69,100,M,Other Race,Not Span/Hispanic,7,Emergency,Home or Self Care,2022,END011,Fluid and electrolyte disorders,ESA001,HEMODIALYSIS,425,OTHER NON-HYPOVOLEMIC ELECTROLYTE DISORDERS,10,"ENDOCRINE, NUTRITIONAL AND METABOLIC DISEASES AND DISORDERS",3,Major,Major,Medical,Medicaid,,,,,Y,106538.52,23859.77
New York City,Manhattan,7002001,001438,Bellevue Hospital Center,70 or Older,113,M,White,Unknown,1,Emergency,Home or Self Care,2022,END011,Fluid and electrolyte disorders,ADM021,"ADMINISTRATION OF THERAPEUTIC SUBSTANCES, NEC",425,OTHER NON-HYPOVOLEMIC ELECTROLYTE DISORDERS,10,"ENDOCRINE, NUTRITIONAL AND METABOLIC DISEASES AND DISORDERS",2,Moderate,Moderate,Medical,Private Health Insurance,,,,,Y,15101.32,8684.53
New York City,Manhattan,7002054,001464,New York-Presbyterian Hospital - Columbia Presbyterian Center,50 to 69,OOS,F,Other Race,Spanish/Hispanic,3,Emergency,Home or Self Care,2022,END011,Fluid and electrolyte disorders,GIS006,PARACENTESIS,425,OTHER NON-HYPOVOLEMIC ELECTROLYTE DISORDERS,10,"ENDOCRINE, NUTRITIONAL AND METABOLIC DISEASES AND DISORDERS",3,Major,Major,Medical,Medicare,Private Health Insurance,,,,Y,92931.09,28126.58
New York City,Manhattan,7002001,001438,Bellevue Hospital Center,30 to 49,113,M,Other Race,Spanish/Hispanic,3,Emergency,Home or Self Care,2022,END011,Fluid and electrolyte disorders,ESA001,HEMODIALYSIS,425,OTHER NON-HYPOVOLEMIC ELECTROLYTE DISORDERS,10,"ENDOCRINE, NUTRITIONAL AND METABOLIC DISEASES AND DISORDERS",3,Major,Moderate,Medical,Medicaid,,,,,Y,24243.31,13941.94
New York City,Manhattan,7002054,001464,New York-Presbyterian Hospital - Columbia Presbyterian Center,50 to 69,108,M,Black/African American,Not Span/Hispanic,2,Emergency,Home or Self Care,2022,END011,Fluid and electrolyte disorders,ESA001,HEMODIALYSIS,425,OTHER NON-HYPOVOLEMIC ELECTROLYTE DISORDERS,10,"ENDOCRINE, NUTRITIONAL AND METABOLIC DISEASES AND DISORDERS",3,Major,Major,Medical,Medicaid,,,,,Y,45483.36,10568.76
New York City,Manhattan,7002054,001464,New York-Presbyterian Hospital - Columbia Presbyterian Center,30 to 49,104,M,Other Race,Spanish/Hispanic,5,Emergency,Home or Self Care,2022,END011,Fluid and electrolyte disorders,ADM001,TRANSFUSION OF BLOOD AND BLOOD PRODUCTS,425,OTHER NON-HYPOVOLEMIC ELECTROLYTE DISORDERS,10,"ENDOCRINE, NUTRITIONAL AND METABOLIC DISEASES AND DISORDERS",4,Extreme,Extreme,Medical,Medicare,Medicaid,,,,Y,146864.71,47203.05
New York City,Manhattan,7002001,001438,Bellevue Hospital Center,50 to 69,114,M,Black/African American,Not Span/Hispanic,4,Urgent,Home or Self Care,2022,END011,Fluid and electrolyte disorders,ESA001,HEMODIALYSIS,425,OTHER NON-HYPOVOLEMIC ELECTROLYTE DISORDERS,10,"ENDOCRINE, NUTRITIONAL AND METABOLIC DISEASES AND DISORDERS",2,Moderate,Moderate,Medical,Medicare,Medicaid,,,,N,43793.25,25184.80
New York City,Manhattan,7002001,001438,Bellevue Hospital Center,50 to 69,100,F,Other Race,Spanish/Hispanic,43,Emergency,Skilled Nursing Home,2022,END011,Fluid and electrolyte disorders,ESA001,HEMODIALYSIS,425,OTHER NON-HYPOVOLEMIC ELECTROLYTE DISORDERS,10,"ENDOCRINE, NUTRITIONAL AND METABOLIC DISEASES AND DISORDERS",3,Major,Major,Medical,Medicaid,,,,,Y,367167.97,211152.42
New York City,Manhattan,7002054,001464,New York-Presbyterian Hospital - Columbia Presbyterian Center,0 to 17,100,M,Other Race,Not Span/Hispanic,14,Emergency,Home or Self Care,2022,END016,Other specified and unspecified nutritional and metabolic disorders,,,425,OTHER NON-HYPOVOLEMIC ELECTROLYTE DISORDERS,10,"ENDOCRINE, NUTRITIONAL AND METABOLIC DISEASES AND DISORDERS",3,Major,Moderate,Medical,Medicaid,,,,,Y,221254.38,74819.49
New York City,Manhattan,7002053,001463,NYU Langone Hospitals,70 or Older,100,F,Other Race,Spanish/Hispanic,3,Emergency,Home w/ Home Health Services,2022,END011,Fluid and electrolyte disorders,,,425,OTHER NON-HYPOVOLEMIC ELECTROLYTE DISORDERS,10,"ENDOCRINE, NUTRITIONAL AND METABOLIC DISEASES AND DISORDERS",2,Moderate,Moderate,Medical,Medicare,,,,,Y,42688.85,15567.76
New York City,Manhattan,7002053,001463,NYU Langone Hospitals,50 to 69,105,M,White,Not Span/Hispanic,3,Emergency,Home or Self Care,2022,END011,Fluid and electrolyte disorders,GIS004,GI SYSTEM ENDOSCOPY WITHOUT BIOPSY (DIAGNOSTIC),425,OTHER NON-HYPOVOLEMIC ELECTROLYTE DISORDERS,10,"ENDOCRINE, NUTRITIONAL AND METABOLIC DISEASES AND DISORDERS",3,Major,Moderate,Medical,Private Health Insurance,,,,,Y,131294.38,25795.07
New York City,Manhattan,7002054,001464,New York-Presbyterian Hospital - Columbia Presbyterian Center,50 to 69,127,M,White,Not Span/Hispanic,9,Emergency,Home or Self Care,2022,END011,Fluid and electrolyte disorders,ADM021,"ADMINISTRATION OF THERAPEUTIC SUBSTANCES, NEC",425,OTHER NON-HYPOVOLEMIC ELECTROLYTE DISORDERS,10,"ENDOCRINE, NUTRITIONAL AND METABOLIC DISEASES AND DISORDERS",3,Major,Moderate,Medical,Medicare,Private Health Insurance,,,,N,181692.89,44387.94
New York City,Manhattan,7002054,001464,New York-Presbyterian Hospital - Columbia Presbyterian Center,0 to 17,104,M,Black/African American,Not Span/Hispanic,3,Emergency,Home or Self Care,2022,END016,Other specified and unspecified nutritional and metabolic disorders,MAM011,ELECTROENCEPHALOGRAM (EEG),425,OTHER NON-HYPOVOLEMIC ELECTROLYTE DISORDERS,10,"ENDOCRINE, NUTRITIONAL AND METABOLIC DISEASES AND DISORDERS",1,Minor,Minor,Medical,Medicaid,,,,,Y,69489.76,18175.97
New York City,Manhattan,7002001,001438,Bellevue Hospital Center,30 to 49,112,M,White,Spanish/Hispanic,1,Emergency,Home or Self Care,2022,END011,Fluid and electrolyte disorders,ESA001,HEMODIALYSIS,425,OTHER NON-HYPOVOLEMIC ELECTROLYTE DISORDERS,10,"ENDOCRINE, NUTRITIONAL AND METABOLIC DISEASES AND DISORDERS",3,Major,Major,Medical,Medicaid,,,,,Y,11435.01,6576.09
New York City,Manhattan,7002001,001438,Bellevue Hospital Center,70 or Older,100,M,Other Race,Spanish/Hispanic,6,Emergency,Home or Self Care,2022,END011,Fluid and electrolyte disorders,GIS005,EXPLORATION OF PERITONEAL CAVITY,425,OTHER NON-HYPOVOLEMIC ELECTROLYTE DISORDERS,10,"ENDOCRINE, NUTRITIONAL AND METABOLIC DISEASES AND DISORDERS",3,Major,Major,Medical,Medicare,Medicaid,,,,Y,48830.06,28081.39
New York City,Manhattan,7002001,001438,Bellevue Hospital Center,50 to 69,100,M,Black/African American,Not Span/Hispanic,4,Emergency,Home or Self Care,2022,END011,Fluid and electrolyte disorders,,,425,OTHER NON-HYPOVOLEMIC ELECTROLYTE DISORDERS,10,"ENDOCRINE, NUTRITIONAL AND METABOLIC DISEASES AND DISORDERS",2,Moderate,Moderate,Medical,Medicaid,,,,,Y,33685.08,19371.75
Finger Lakes,Monroe,2701005,000413,Strong Memorial Hospital,70 or Older,144,F,White,Not Span/Hispanic,6,Urgent,Home w/ Home Health Services,2022,END011,Fluid and electrolyte disorders,ESA001,HEMODIALYSIS,425,OTHER NON-HYPOVOLEMIC ELECTROLYTE DISORDERS,10,"ENDOCRINE, NUTRITIONAL AND METABOLIC DISEASES AND DISORDERS",3,Major,Extreme,Medical,Medicare,,,,,N,34340.51,10898.97
Finger Lakes,Monroe,2701005,000413,Strong Memorial Hospital,50 to 69,146,M,Black/African American,Spanish/Hispanic,10,Emergency,Home w/ Home Health Services,2022,END011,Fluid and electrolyte disorders,ADM005,ADMINISTRATION OF THROMBOLYTICS AND PLATELET INHIBITORS,425,OTHER NON-HYPOVOLEMIC ELECTROLYTE DISORDERS,10,"ENDOCRINE, NUTRITIONAL AND METABOLIC DISEASES AND DISORDERS",4,Extreme,Extreme,Medical,Federal/State/Local/VA,,,,,Y,29413.57,15352.95
New York City,Manhattan,7002053,001463,NYU Langone Hospitals,50 to 69,100,M,White,Not Span/Hispanic,1,Emergency,Left Against Medical Advice,2022,END011,Fluid and electrolyte disorders,ESA001,HEMODIALYSIS,425,OTHER NON-HYPOVOLEMIC ELECTROLYTE DISORDERS,10,"ENDOCRINE, NUTRITIONAL AND METABOLIC DISEASES AND DISORDERS",3,Major,Major,Medical,Medicaid,,,,,Y,23117.94,8900.58
New York City,Manhattan,7002053,001463,NYU Langone Hospitals,50 to 69,112,F,Black/African American,Not Span/Hispanic,3,Emergency,Home w/ Home Health Services,2022,END011,Fluid and electrolyte disorders,OTR004,ISOLATION PROCEDURES,425,OTHER NON-HYPOVOLEMIC ELECTROLYTE DISORDERS,10,"ENDOCRINE, NUTRITIONAL AND METABOLIC DISEASES AND DISORDERS",3,Major,Major,Medical,Medicare,Blue Cross/Blue Shield,,,,Y,85372.70,17880.94
New York City,Manhattan,7002001,001438,Bellevue Hospital Center,50 to 69,112,M,Black/African American,Unknown,2,Emergency,Home or Self Care,2022,END011,Fluid and electrolyte disorders,ADM021,"ADMINISTRATION OF THERAPEUTIC SUBSTANCES, NEC",425,OTHER NON-HYPOVOLEMIC ELECTROLYTE DISORDERS,10,"ENDOCRINE, NUTRITIONAL AND METABOLIC DISEASES AND DISORDERS",1,Minor,Minor,Medical,Medicaid,,,,,Y,17141.04,9857.54
New York City,Manhattan,7002001,001438,Bellevue Hospital Center,50 to 69,100,M,White,Unknown,5,Emergency,Psychiatric Hospital or Unit of Hosp,2022,END011,Fluid and electrolyte disorders,SUD002,PHARMACOTHERAPY FOR SUBSTANCE USE,425,OTHER NON-HYPOVOLEMIC ELECTROLYTE DISORDERS,10,"ENDOCRINE, NUTRITIONAL AND METABOLIC DISEASES AND DISORDERS",2,Moderate,Moderate,Medical,Medicaid,,,,,Y,45686.44,26273.54
New York City,Manhattan,7002053,001463,NYU Langone Hospitals,50 to 69,,F,Black/African American,Unknown,4,Emergency,Home or Self Care,2022,END011,Fluid and electrolyte disorders,ESA001,HEMODIALYSIS,425,OTHER NON-HYPOVOLEMIC ELECTROLYTE DISORDERS,10,"ENDOCRINE, NUTRITIONAL AND METABOLIC DISEASES AND DISORDERS",3,Major,Major,Medical,Medicaid,,,,,Y,79630.72,27982.66
New York City,Manhattan,7002054,001464,New York-Presbyterian Hospital - Columbia Presbyterian Center,50 to 69,104,M,Other Race,Spanish/Hispanic,11,Emergency,Home or Self Care,2022,END011,Fluid and electrolyte disorders,ESA001,HEMODIALYSIS,425,OTHER NON-HYPOVOLEMIC ELECTROLYTE DISORDERS,10,"ENDOCRINE, NUTRITIONAL AND METABOLIC DISEASES AND DISORDERS",2,Moderate,Moderate,Medical,Medicaid,,,,,Y,162808.22,38173.22
New York City,Manhattan,7002054,001464,New York-Presbyterian Hospital - Columbia Presbyterian Center,30 to 49,100,M,Other Race,Unknown,2,Emergency,Home or Self Care,2022,END011,Fluid and electrolyte disorders,ADM007,INTRAVENOUS INDUCTION OF LABOR,425,OTHER NON-HYPOVOLEMIC ELECTROLYTE DISORDERS,10,"ENDOCRINE, NUTRITIONAL AND METABOLIC DISEASES AND DISORDERS",2,Moderate,Moderate,Medical,Medicaid,,,,,Y,31894.78,6818.34
New York City,Manhattan,7002054,001464,New York-Presbyterian Hospital - Columbia Presbyterian Center,0 to 17,109,F,White,Not Span/Hispanic,2,Emergency,Home or Self Care,2022,PNL003,Neonatal acidemia and hypoxia,ESA004,NON-INVASIVE VENTILATION,425,OTHER NON-HYPOVOLEMIC ELECTROLYTE DISORDERS,10,"ENDOCRINE, NUTRITIONAL AND METABOLIC DISEASES AND DISORDERS",3,Major,Moderate,Medical,Medicaid,,,03000,,Y,39265.83,8437.74
New York City,Manhattan,7002054,001464,New York-Presbyterian Hospital - Columbia Presbyterian Center,50 to 69,104,M,Black/African American,Not Span/Hispanic,5,Emergency,Home or Self Care,2022,END011,Fluid and electrolyte disorders,ESA004,NON-INVASIVE VENTILATION,425,OTHER NON-HYPOVOLEMIC ELECTROLYTE DISORDERS,10,"ENDOCRINE, NUTRITIONAL AND METABOLIC DISEASES AND DISORDERS",3,Major,Moderate,Medical,Medicare,Medicaid,,,,Y,105217.77,22592.01
New York City,Manhattan,7002054,001464,New York-Presbyterian Hospital - Columbia Presbyterian Center,70 or Older,100,M,Black/African American,Not Span/Hispanic,2,Emergency,Home or Self Care,2022,END011,Fluid and electrolyte disorders,ESA001,HEMODIALYSIS,425,OTHER NON-HYPOVOLEMIC ELECTROLYTE DISORDERS,10,"ENDOCRINE, NUTRITIONAL AND METABOLIC DISEASES AND DISORDERS",3,Major,Major,Medical,Medicare,Medicaid,,,,Y,86095.30,33165.71
New York City,Manhattan,7002054,001464,New York-Presbyterian Hospital - Columbia Presbyterian Center,70 or Older,100,F,Black/African American,Not Span/Hispanic,4,Emergency,Home w/ Home Health Services,2022,END011,Fluid and electrolyte disorders,ADM021,"ADMINISTRATION OF THERAPEUTIC SUBSTANCES, NEC",425,OTHER NON-HYPOVOLEMIC ELECTROLYTE DISORDERS,10,"ENDOCRINE, NUTRITIONAL AND METABOLIC DISEASES AND DISORDERS",2,Moderate,Major,Medical,Medicare,Medicaid,,,,Y,59383.52,12983.52
New York City,Manhattan,7002054,001464,New York-Presbyterian Hospital - Columbia Presbyterian Center,70 or Older,104,M,Other Race,Spanish/Hispanic,8,Emergency,Medicaid Cert Nursing Facility,2022,END011,Fluid and electrolyte disorders,,,425,OTHER NON-HYPOVOLEMIC ELECTROLYTE DISORDERS,10,"ENDOCRINE, NUTRITIONAL AND METABOLIC DISEASES AND DISORDERS",3,Major,Major,Medical,Medicare,Medicaid,,,,Y,133653.97,27987.49
New York City,Manhattan,7002054,001464,New York-Presbyterian Hospital - Columbia Presbyterian Center,50 to 69,114,M,Other Race,Spanish/Hispanic,3,Emergency,Home w/ Home Health Services,2022,END011,Fluid and electrolyte disorders,ADM015,ADMINISTRATION OF ANTIBIOTICS,425,OTHER NON-HYPOVOLEMIC ELECTROLYTE DISORDERS,10,"ENDOCRINE, NUTRITIONAL AND METABOLIC DISEASES AND DISORDERS",3,Major,Extreme,Medical,Medicare,Medicaid,,,,Y,64756.68,14593.55
New York City,Manhattan,7002054,001464,New York-Presbyterian Hospital - Columbia Presbyterian Center,70 or Older,104,F,Other Race,Spanish/Hispanic,1,Emergency,Home or Self Care,2022,END011,Fluid and electrolyte disorders,,,425,OTHER NON-HYPOVOLEMIC ELECTROLYTE DISORDERS,10,"ENDOCRINE, NUTRITIONAL AND METABOLIC DISEASES AND DISORDERS",2,Moderate,Moderate,Medical,Medicare,Medicaid,,,,Y,17826.57,3891.81
New York City,Manhattan,7002054,001464,New York-Presbyterian Hospital - Columbia Presbyterian Center,70 or Older,100,F,Other Race,Spanish/Hispanic,2,Emergency,Home or Self Care,2022,END016,Other specified and unspecified nutritional and metabolic disorders,ADM021,"ADMINISTRATION OF THERAPEUTIC SUBSTANCES, NEC",425,OTHER NON-HYPOVOLEMIC ELECTROLYTE DISORDERS,10,"ENDOCRINE, NUTRITIONAL AND METABOLIC DISEASES AND DISORDERS",2,Moderate,Moderate,Medical,Medicare,Medicaid,,,,Y,30319.60,6375.27
New York City,Manhattan,7002054,001464,New York-Presbyterian Hospital - Columbia Presbyterian Center,70 or Older,112,F,Other Race,Not Span/Hispanic,3,Emergency,Home or Self Care,2022,END016,Other specified and unspecified nutritional and metabolic disorders,CAR025,PLACEMENT OF TUNNELED OR IMPLANTABLE PORTION OF A VASCULAR ACCESS DEVICE,425,OTHER NON-HYPOVOLEMIC ELECTROLYTE DISORDERS,10,"ENDOCRINE, NUTRITIONAL AND METABOLIC DISEASES AND DISORDERS",1,Minor,Moderate,Medical,Medicare,,,,,Y,95692.19,26088.91
New York City,Manhattan,7002053,001463,NYU Langone Hospitals,50 to 69,100,F,White,Not Span/Hispanic,3,Emergency,Home or Self Care,2022,END011,Fluid and electrolyte disorders,GIS006,PARACENTESIS,425,OTHER NON-HYPOVOLEMIC ELECTROLYTE DISORDERS,10,"ENDOCRINE, NUTRITIONAL AND METABOLIC DISEASES AND DISORDERS",3,Major,Moderate,Medical,Private Health Insurance,,,,,Y,52126.77,15661.85
New York City,Manhattan,7002001,001438,Bellevue Hospital Center,50 to 69,100,M,Black/African American,Unknown,4,Emergency,Left Against Medical Advice,2022,END011,Fluid and electrolyte disorders,ESA001,HEMODIALYSIS,425,OTHER NON-HYPOVOLEMIC ELECTROLYTE DISORDERS,10,"ENDOCRINE, NUTRITIONAL AND METABOLIC DISEASES AND DISORDERS",2,Moderate,Minor,Medical,Medicare,,,,,Y,41997.48,24152.08
New York City,Manhattan,7002053,001463,NYU Langone Hospitals,70 or Older,100,F,White,Not Span/Hispanic,2,Emergency,Home w/ Home Health Services,2022,END011,Fluid and electrolyte disorders,,,425,OTHER NON-HYPOVOLEMIC ELECTROLYTE DISORDERS,10,"ENDOCRINE, NUTRITIONAL AND METABOLIC DISEASES AND DISORDERS",2,Moderate,Moderate,Medical,Medicare,Blue Cross/Blue Shield,,,,Y,51547.72,16720.40
Finger Lakes,Monroe,2701005,000413,Strong Memorial Hospital,70 or Older,146,F,White,Not Span/Hispanic,2,Emergency,Home or Self Care,2022,END016,Other specified and unspecified nutritional and metabolic disorders,,,425,OTHER NON-HYPOVOLEMIC ELECTROLYTE DISORDERS,10,"ENDOCRINE, NUTRITIONAL AND METABOLIC DISEASES AND DISORDERS",2,Moderate,Moderate,Medical,Medicare,,,,,Y,15005.22,6509.68
Finger Lakes,Monroe,2701005,000413,Strong Memorial Hospital,70 or Older,145,M,White,Not Span/Hispanic,4,Emergency,Home w/ Home Health Services,2022,END016,Other specified and unspecified nutritional and metabolic disorders,,,425,OTHER NON-HYPOVOLEMIC ELECTROLYTE DISORDERS,10,"ENDOCRINE, NUTRITIONAL AND METABOLIC DISEASES AND DISORDERS",3,Major,Major,Medical,Medicare,,,,,Y,13827.12,6390.67
Finger Lakes,Monroe,2701005,000413,Strong Memorial Hospital,50 to 69,146,M,White,Not Span/Hispanic,41,Emergency,Home w/ Home Health Services,2022,END011,Fluid and electrolyte disorders,GIS006,PARACENTESIS,425,OTHER NON-HYPOVOLEMIC ELECTROLYTE DISORDERS,10,"ENDOCRINE, NUTRITIONAL AND METABOLIC DISEASES AND DISORDERS",3,Major,Major,Medical,Medicare,Medicaid,,,,Y,190742.96,66938.51
Finger Lakes,Monroe,2701005,000413,Strong Memorial Hospital,50 to 69,148,M,White,Not Span/Hispanic,24,Emergency,Home w/ Home Health Services,2022,END011,Fluid and electrolyte disorders,CAR025,PLACEMENT OF TUNNELED OR IMPLANTABLE PORTION OF A VASCULAR ACCESS DEVICE,425,OTHER NON-HYPOVOLEMIC ELECTROLYTE DISORDERS,10,"ENDOCRINE, NUTRITIONAL AND METABOLIC DISEASES AND DISORDERS",4,Extreme,Extreme,Medical,Medicare,,,,,Y,133890.09,48782.45
New York City,Manhattan,7002054,001464,New York-Presbyterian Hospital - Columbia Presbyterian Center,50 to 69,OOS,M,Other Race,Not Span/Hispanic,5,Emergency,Home or Self Care,2022,END011,Fluid and electrolyte disorders,ESA001,HEMODIALYSIS,425,OTHER NON-HYPOVOLEMIC ELECTROLYTE DISORDERS,10,"ENDOCRINE, NUTRITIONAL AND METABOLIC DISEASES AND DISORDERS",2,Moderate,Major,Medical,Private Health Insurance,,,,,Y,95279.86,22251.11
Finger Lakes,Monroe,2701005,000413,Strong Memorial Hospital,70 or Older,146,F,Black/African American,Not Span/Hispanic,2,Emergency,Home or Self Care,2022,END011,Fluid and electrolyte disorders,ESA001,HEMODIALYSIS,425,OTHER NON-HYPOVOLEMIC ELECTROLYTE DISORDERS,10,"ENDOCRINE, NUTRITIONAL AND METABOLIC DISEASES AND DISORDERS",3,Major,Moderate,Medical,Medicare,Blue Cross/Blue Shield,Medicaid,,,Y,14177.04,4908.73
Finger Lakes,Monroe,2701005,000413,Strong Memorial Hospital,30 to 49,146,M,Multi-racial,Spanish/Hispanic,2,Emergency,Home or Self Care,2022,END011,Fluid and electrolyte disorders,ESA001,HEMODIALYSIS,425,OTHER NON-HYPOVOLEMIC ELECTROLYTE DISORDERS,10,"ENDOCRINE, NUTRITIONAL AND METABOLIC DISEASES AND DISORDERS",3,Major,Major,Medical,Medicaid,,,,,Y,29577.78,10026.84
New York City,Manhattan,7002001,001438,Bellevue Hospital Center,0 to 17,112,M,White,Unknown,1,Emergency,Home or Self Care,2022,END016,Other specified and unspecified nutritional and metabolic disorders,ADM017,ADMINISTRATION OF NUTRITIONAL AND ELECTROLYTIC SUBSTANCES,425,OTHER NON-HYPOVOLEMIC ELECTROLYTE DISORDERS,10,"ENDOCRINE, NUTRITIONAL AND METABOLIC DISEASES AND DISORDERS",3,Major,Minor,Medical,Medicaid,,,,,Y,12124.17,6972.42
New York City,Manhattan,7002001,001438,Bellevue Hospital Center,30 to 49,113,M,Other Race,Spanish/Hispanic,1,Emergency,Home or Self Care,2022,END011,Fluid and electrolyte disorders,ESA001,HEMODIALYSIS,425,OTHER NON-HYPOVOLEMIC ELECTROLYTE DISORDERS,10,"ENDOCRINE, NUTRITIONAL AND METABOLIC DISEASES AND DISORDERS",3,Major,Extreme,Medical,Medicaid,,,,,Y,16644.31,9571.88
New York City,Manhattan,7002053,001463,NYU Langone Hospitals,70 or Older,113,F,Other Race,Not Span/Hispanic,3,Emergency,Skilled Nursing Home,2022,END016,Other specified and unspecified nutritional and metabolic disorders,,,425,OTHER NON-HYPOVOLEMIC ELECTROLYTE DISORDERS,10,"ENDOCRINE, NUTRITIONAL AND METABOLIC DISEASES AND DISORDERS",4,Extreme,Extreme,Medical,Medicare,Medicare,,,,Y,49015.49,16075.01