Hospital Service Area,Hospital County,Operating Certificate Number,Permanent Facility Id,Facility Name,Age Group,Zip Code - 3 digits,Gender,Race,Ethnicity,Length of Stay,Type of Admission,Patient Disposition,Discharge Year,CCS Diagnosis Code,CCS Diagnosis Description,CCS Procedure Code,CCS Procedure Description,APR DRG Code,APR DRG Description,APR MDC Code,APR MDC Description,APR Severity of Illness Code,APR Severity of Illness Description,APR Risk of Mortality,APR Medical Surgical Description,Payment Typology 1,Payment Typology 2,Payment Typology 3,Birth Weight,Abortion Edit Indicator,Emergency Department Indicator,Total Charges,Total Costs
New York City,Manhattan,7002054,001464,New York-Presbyterian Hospital - Columbia Presbyterian Center,50 to 69,103,M,White,Not Span/Hispanic,8,Emergency,Home or Self Care,2022,INJ034,"Complication of genitourinary device, implant or graft, initial encounter",GIS009,COLECTOMY,441,MAJOR BLADDER PROCEDURES,11,DISEASES AND DISORDERS OF THE KIDNEY AND URINARY TRACT,3,Major,Minor,Surgical,Private Health Insurance,,,,,Y,157572.37,39661.04
New York City,Manhattan,7002054,001464,New York-Presbyterian Hospital - Columbia Presbyterian Center,70 or Older,109,F,White,Not Span/Hispanic,4,Elective,Home or Self Care,2022,NEO043,Urinary system cancers - bladder,URN009,CYSTECTOMY (INCLUDING FULGURATION) AND URETHRECTOMY,441,MAJOR BLADDER PROCEDURES,11,DISEASES AND DISORDERS OF THE KIDNEY AND URINARY TRACT,3,Major,Moderate,Surgical,Medicare,Private Health Insurance,,,,N,119657.11,33706.06
New York City,Manhattan,7002054,001464,New York-Presbyterian Hospital - Columbia Presbyterian Center,50 to 69,100,F,Black/African American,Not Span/Hispanic,28,Emergency,Skilled Nursing Home,2022,NEO043,Urinary system cancers - bladder,URN009,CYSTECTOMY (INCLUDING FULGURATION) AND URETHRECTOMY,441,MAJOR BLADDER PROCEDURES,11,DISEASES AND DISORDERS OF THE KIDNEY AND URINARY TRACT,3,Major,Moderate,Surgical,Private Health Insurance,,,,,Y,473200.69,113899.36
New York City,Manhattan,7002053,001463,NYU Langone Hospitals,70 or Older,112,M,Multi-racial,Not Span/Hispanic,11,Elective,Home w/ Home Health Services,2022,NEO043,Urinary system cancers - bladder,URN009,CYSTECTOMY (INCLUDING FULGURATION) AND URETHRECTOMY,441,MAJOR BLADDER PROCEDURES,11,DISEASES AND DISORDERS OF THE KIDNEY AND URINARY TRACT,3,Major,Moderate,Surgical,Medicare,,,,,N,287927.11,72112.84
New York City,Manhattan,7002053,001463,NYU Langone Hospitals,70 or Older,OOS,M,White,Not Span/Hispanic,5,Elective,Home w/ Home Health Services,2022,NEO043,Urinary system cancers - bladder,URN009,CYSTECTOMY (INCLUDING FULGURATION) AND URETHRECTOMY,441,MAJOR BLADDER PROCEDURES,11,DISEASES AND DISORDERS OF THE KIDNEY AND URINARY TRACT,3,Major,Major,Surgical,Medicare,Medicare,,,,N,185500.30,39515.17
Finger Lakes,Monroe,2701005,000413,Strong Memorial Hospital,50 to 69,146,M,Black/African American,Not Span/Hispanic,6,Elective,Home w/ Home Health Services,2022,NEO043,Urinary system cancers - bladder,URN009,CYSTECTOMY (INCLUDING FULGURATION) AND URETHRECTOMY,441,MAJOR BLADDER PROCEDURES,11,DISEASES AND DISORDERS OF THE KIDNEY AND URINARY TRACT,2,Moderate,Moderate,Surgical,Blue Cross/Blue Shield,Medicare,,,,N,113714.65,51874.33
Finger Lakes,Monroe,2701005,000413,Strong Memorial Hospital,50 to 69,144,F,White,Not Span/Hispanic,5,Elective,Home w/ Home Health Services,2022,NEO043,Urinary system cancers - bladder,URN009,CYSTECTOMY (INCLUDING FULGURATION) AND URETHRECTOMY,441,MAJOR BLADDER PROCEDURES,11,DISEASES AND DISORDERS OF THE KIDNEY AND URINARY TRACT,2,Moderate,Minor,Surgical,Private Health Insurance,,,,,N,84861.68,39431.34
Finger Lakes,Monroe,2701005,000413,Strong Memorial Hospital,50 to 69,130,M,White,Not Span/Hispanic,10,Elective,Home or Self Care,2022,NEO043,Urinary system cancers - bladder,URN009,CYSTECTOMY (INCLUDING FULGURATION) AND URETHRECTOMY,441,MAJOR BLADDER PROCEDURES,11,DISEASES AND DISORDERS OF THE KIDNEY AND URINARY TRACT,4,Extreme,Extreme,Surgical,Medicare,Private Health Insurance,,,,N,71251.37,34001.52
New York City,Manhattan,7002053,001463,NYU Langone Hospitals,70 or Older,112,M,White,Not Span/Hispanic,10,Elective,Home or Self Care,2022,NEO043,Urinary system cancers - bladder,URN009,CYSTECTOMY (INCLUDING FULGURATION) AND URETHRECTOMY,441,MAJOR BLADDER PROCEDURES,11,DISEASES AND DISORDERS OF THE KIDNEY AND URINARY TRACT,3,Major,Major,Surgical,Medicare,,,,,N,292977.92,66441.38
New York City,Manhattan,7002053,001463,NYU Langone Hospitals,50 to 69,115,M,White,Not Span/Hispanic,10,Elective,Home w/ Home Health Services,2022,NEO043,Urinary system cancers - bladder,URN009,CYSTECTOMY (INCLUDING FULGURATION) AND URETHRECTOMY,441,MAJOR BLADDER PROCEDURES,11,DISEASES AND DISORDERS OF THE KIDNEY AND URINARY TRACT,4,Extreme,Extreme,Surgical,Medicare,Blue Cross/Blue Shield,,,,N,260919.80,69408.70
New York City,Manhattan,7002054,001464,New York-Presbyterian Hospital - Columbia Presbyterian Center,50 to 69,109,M,Other Race,Unknown,5,Elective,Home or Self Care,2022,NEO043,Urinary system cancers - bladder,URN009,CYSTECTOMY (INCLUDING FULGURATION) AND URETHRECTOMY,441,MAJOR BLADDER PROCEDURES,11,DISEASES AND DISORDERS OF THE KIDNEY AND URINARY TRACT,2,Moderate,Minor,Surgical,Private Health Insurance,,,,,N,138607.29,37427.72
New York City,Manhattan,7002053,001463,NYU Langone Hospitals,50 to 69,,M,White,Unknown,5,Elective,Home or Self Care,2022,NEO043,Urinary system cancers - bladder,URN009,CYSTECTOMY (INCLUDING FULGURATION) AND URETHRECTOMY,441,MAJOR BLADDER PROCEDURES,11,DISEASES AND DISORDERS OF THE KIDNEY AND URINARY TRACT,3,Major,Moderate,Surgical,Medicare,,,,,N,171373.21,37771.24
New York City,Manhattan,7002053,001463,NYU Langone Hospitals,50 to 69,118,M,Other Race,Not Span/Hispanic,6,Elective,Home or Self Care,2022,NEO043,Urinary system cancers - bladder,URN010,URINARY DIVERSION WITH ANASTOMOSIS OR OSTOMY,441,MAJOR BLADDER PROCEDURES,11,DISEASES AND DISORDERS OF THE KIDNEY AND URINARY TRACT,3,Major,Minor,Surgical,Medicare,,,,,N,197400.04,43457.19
New York City,Manhattan,7002053,001463,NYU Langone Hospitals,50 to 69,101,M,Other Race,Not Span/Hispanic,7,Elective,Home w/ Home Health Services,2022,NEO043,Urinary system cancers - bladder,URN009,CYSTECTOMY (INCLUDING FULGURATION) AND URETHRECTOMY,441,MAJOR BLADDER PROCEDURES,11,DISEASES AND DISORDERS OF THE KIDNEY AND URINARY TRACT,3,Major,Minor,Surgical,Private Health Insurance,,,,,N,245665.56,51041.32
New York City,Manhattan,7002053,001463,NYU Langone Hospitals,70 or Older,112,M,White,Not Span/Hispanic,5,Elective,Home w/ Home Health Services,2022,NEO043,Urinary system cancers - bladder,URN009,CYSTECTOMY (INCLUDING FULGURATION) AND URETHRECTOMY,441,MAJOR BLADDER PROCEDURES,11,DISEASES AND DISORDERS OF THE KIDNEY AND URINARY TRACT,3,Major,Moderate,Surgical,Medicare,Medicare,,,,N,305016.93,56216.99
Finger Lakes,Monroe,2701005,000413,Strong Memorial Hospital,70 or Older,144,F,White,Not Span/Hispanic,5,Elective,Home w/ Home Health Services,2022,GEN004,Urinary tract infections,URN009,CYSTECTOMY (INCLUDING FULGURATION) AND URETHRECTOMY,441,MAJOR BLADDER PROCEDURES,11,DISEASES AND DISORDERS OF THE KIDNEY AND URINARY TRACT,2,Moderate,Minor,Surgical,Medicare,,,,,N,58351.65,28547.48
Finger Lakes,Monroe,2701005,000413,Strong Memorial Hospital,70 or Older,144,M,White,Not Span/Hispanic,5,Elective,Home w/ Home Health Services,2022,NEO043,Urinary system cancers - bladder,URN009,CYSTECTOMY (INCLUDING FULGURATION) AND URETHRECTOMY,441,MAJOR BLADDER PROCEDURES,11,DISEASES AND DISORDERS OF THE KIDNEY AND URINARY TRACT,2,Moderate,Minor,Surgical,Medicare,,,,,N,87049.07,41869.39
Finger Lakes,Monroe,2701005,000413,Strong Memorial Hospital,70 or Older,144,F,White,Not Span/Hispanic,5,Elective,Home w/ Home Health Services,2022,GEN007,Other specified and unspecified diseases of bladder and urethra,GIS009,COLECTOMY,441,MAJOR BLADDER PROCEDURES,11,DISEASES AND DISORDERS OF THE KIDNEY AND URINARY TRACT,3,Major,Major,Surgical,Medicare,,,,,N,56441.81,27835.53
Finger Lakes,Monroe,2701005,000413,Strong Memorial Hospital,70 or Older,145,M,White,Not Span/Hispanic,4,Elective,Home w/ Home Health Services,2022,NEO043,Urinary system cancers - bladder,URN009,CYSTECTOMY (INCLUDING FULGURATION) AND URETHRECTOMY,441,MAJOR BLADDER PROCEDURES,11,DISEASES AND DISORDERS OF THE KIDNEY AND URINARY TRACT,2,Moderate,Moderate,Surgical,Medicare,,,,,N,76456.71,36615.47
New York City,Manhattan,7002053,001463,NYU Langone Hospitals,50 to 69,104,M,Multi-racial,Not Span/Hispanic,6,Elective,Home w/ Home Health Services,2022,NEO043,Urinary system cancers - bladder,URN009,CYSTECTOMY (INCLUDING FULGURATION) AND URETHRECTOMY,441,MAJOR BLADDER PROCEDURES,11,DISEASES AND DISORDERS OF THE KIDNEY AND URINARY TRACT,3,Major,Moderate,Surgical,Medicaid,,,,,N,178059.65,42725.43
Finger Lakes,Monroe,2701005,000413,Strong Memorial Hospital,50 to 69,145,M,White,Not Span/Hispanic,5,Elective,Home w/ Home Health Services,2022,NEO043,Urinary system cancers - bladder,MST028,"SUBCUTANEOUS TISSUE AND FASCIA PROCEDURES, NEC",441,MAJOR BLADDER PROCEDURES,11,DISEASES AND DISORDERS OF THE KIDNEY AND URINARY TRACT,2,Moderate,Minor,Surgical,Blue Cross/Blue Shield,Medicaid,,,,N,83829.61,38850.77
Finger Lakes,Monroe,2701005,000413,Strong Memorial Hospital,70 or Older,148,M,White,Unknown,10,Elective,Home w/ Home Health Services,2022,NEO043,Urinary system cancers - bladder,URN009,CYSTECTOMY (INCLUDING FULGURATION) AND URETHRECTOMY,441,MAJOR BLADDER PROCEDURES,11,DISEASES AND DISORDERS OF THE KIDNEY AND URINARY TRACT,3,Major,Minor,Surgical,Federal/State/Local/VA,,,,,N,76254.88,36219.63
New York City,Manhattan,7002053,001463,NYU Langone Hospitals,50 to 69,100,M,White,Not Span/Hispanic,5,Elective,Home w/ Home Health Services,2022,NEO043,Urinary system cancers - bladder,URN009,CYSTECTOMY (INCLUDING FULGURATION) AND URETHRECTOMY,441,MAJOR BLADDER PROCEDURES,11,DISEASES AND DISORDERS OF THE KIDNEY AND URINARY TRACT,3,Major,Moderate,Surgical,Medicare,Medicare,,,,N,176388.90,37874.99
New York City,Manhattan,7002054,001464,New York-Presbyterian Hospital - Columbia Presbyterian Center,50 to 69,104,M,Black/African American,Not Span/Hispanic,8,Emergency,Skilled Nursing Home,2022,GEN007,Other specified and unspecified diseases of bladder and urethra,URN007,URINARY TRACT REPAIR,441,MAJOR BLADDER PROCEDURES,11,DISEASES AND DISORDERS OF THE KIDNEY AND URINARY TRACT,3,Major,Moderate,Surgical,Private Health Insurance,Private Health Insurance,,,,Y,208304.05,81911.36
New York City,Manhattan,7002053,001463,NYU Langone Hospitals,70 or Older,OOS,F,White,Not Span/Hispanic,5,Elective,Home w/ Home Health Services,2022,NEO043,Urinary system cancers - bladder,URN010,URINARY DIVERSION WITH ANASTOMOSIS OR OSTOMY,441,MAJOR BLADDER PROCEDURES,11,DISEASES AND DISORDERS OF THE KIDNEY AND URINARY TRACT,3,Major,Moderate,Surgical,Medicare,Blue Cross/Blue Shield,,,,N,255306.14,49710.72
Finger Lakes,Monroe,2701005,000413,Strong Memorial Hospital,70 or Older,145,M,White,Not Span/Hispanic,9,Elective,Home w/ Home Health Services,2022,NEO043,Urinary system cancers - bladder,MRS003,PROSTATECTOMY,441,MAJOR BLADDER PROCEDURES,11,DISEASES AND DISORDERS OF THE KIDNEY AND URINARY TRACT,3,Major,Moderate,Surgical,Medicare,,,,,N,92835.29,44201.15
Finger Lakes,Monroe,2701005,000413,Strong Memorial Hospital,50 to 69,144,M,White,Not Span/Hispanic,7,Elective,Home or Self Care,2022,NEO043,Urinary system cancers - bladder,URN009,CYSTECTOMY (INCLUDING FULGURATION) AND URETHRECTOMY,441,MAJOR BLADDER PROCEDURES,11,DISEASES AND DISORDERS OF THE KIDNEY AND URINARY TRACT,3,Major,Moderate,Surgical,Medicaid,,,,,N,120173.95,53918.56
Finger Lakes,Monroe,2701005,000413,Strong Memorial Hospital,50 to 69,145,F,White,Spanish/Hispanic,7,Elective,Home w/ Home Health Services,2022,NEO043,Urinary system cancers - bladder,URN012,"URINARY SYSTEM PROCEDURES, NEC",441,MAJOR BLADDER PROCEDURES,11,DISEASES AND DISORDERS OF THE KIDNEY AND URINARY TRACT,3,Major,Minor,Surgical,Medicare,Private Health Insurance,,,,N,99747.50,49041.06
Finger Lakes,Monroe,2701005,000413,Strong Memorial Hospital,50 to 69,131,M,White,Not Span/Hispanic,4,Emergency,Home or Self Care,2022,INJ010,"Internal organ injury, initial encounter",URN007,URINARY TRACT REPAIR,441,MAJOR BLADDER PROCEDURES,11,DISEASES AND DISORDERS OF THE KIDNEY AND URINARY TRACT,3,Major,Major,Surgical,Miscellaneous/Other,Medicaid,,,,Y,36140.88,16065.45
Finger Lakes,Monroe,2701005,000413,Strong Memorial Hospital,70 or Older,144,M,White,Not Span/Hispanic,6,Elective,Home w/ Home Health Services,2022,GEN007,Other specified and unspecified diseases of bladder and urethra,URN009,CYSTECTOMY (INCLUDING FULGURATION) AND URETHRECTOMY,441,MAJOR BLADDER PROCEDURES,11,DISEASES AND DISORDERS OF THE KIDNEY AND URINARY TRACT,2,Moderate,Minor,Surgical,Medicare,Blue Cross/Blue Shield,,,,N,61855.93,30470.99
Finger Lakes,Monroe,2701005,000413,Strong Memorial Hospital,0 to 17,148,M,White,Not Span/Hispanic,2,Elective,Home or Self Care,2022,GEN011,Vesicoureteral reflux,URN001,CYSTOSCOPY AND URETEROSCOPY (INCLUDING BIOPSY),441,MAJOR BLADDER PROCEDURES,11,DISEASES AND DISORDERS OF THE KIDNEY AND URINARY TRACT,2,Moderate,Minor,Surgical,Blue Cross/Blue Shield,,,,,N,27992.58,14304.49
Finger Lakes,Monroe,2701005,000413,Strong Memorial Hospital,70 or Older,OOS,M,White,Not Span/Hispanic,4,Elective,Home w/ Home Health Services,2022,NEO043,Urinary system cancers - bladder,MRS003,PROSTATECTOMY,441,MAJOR BLADDER PROCEDURES,11,DISEASES AND DISORDERS OF THE KIDNEY AND URINARY TRACT,3,Major,Major,Surgical,Medicare,,,,,N,79728.96,38360.78
Finger Lakes,Monroe,2701005,000413,Strong Memorial Hospital,50 to 69,144,M,White,Not Span/Hispanic,6,Elective,Home w/ Home Health Services,2022,NEO043,Urinary system cancers - bladder,URN009,CYSTECTOMY (INCLUDING FULGURATION) AND URETHRECTOMY,441,MAJOR BLADDER PROCEDURES,11,DISEASES AND DISORDERS OF THE KIDNEY AND URINARY TRACT,3,Major,Moderate,Surgical,Medicare,Blue Cross/Blue Shield,,,,N,75785.52,35239.62
Finger Lakes,Monroe,2701005,000413,Strong Memorial Hospital,70 or Older,146,M,White,Not Span/Hispanic,6,Elective,Home w/ Home Health Services,2022,NEO043,Urinary system cancers - bladder,URN009,CYSTECTOMY (INCLUDING FULGURATION) AND URETHRECTOMY,441,MAJOR BLADDER PROCEDURES,11,DISEASES AND DISORDERS OF THE KIDNEY AND URINARY TRACT,3,Major,Moderate,Surgical,Medicare,,,,,N,100592.12,46475.12
Finger Lakes,Monroe,2701005,000413,Strong Memorial Hospital,70 or Older,149,F,White,Not Span/Hispanic,5,Elective,Home w/ Home Health Services,2022,NEO043,Urinary system cancers - bladder,URN009,CYSTECTOMY (INCLUDING FULGURATION) AND URETHRECTOMY,441,MAJOR BLADDER PROCEDURES,11,DISEASES AND DISORDERS OF THE KIDNEY AND URINARY TRACT,3,Major,Minor,Surgical,Medicare,,,,,N,75707.73,35140.61
New York City,Manhattan,7002054,001464,New York-Presbyterian Hospital - Columbia Presbyterian Center,70 or Older,OOS,F,Other Race,Unknown,3,Elective,Home or Self Care,2022,GEN007,Other specified and unspecified diseases of bladder and urethra,URN001,CYSTOSCOPY AND URETEROSCOPY (INCLUDING BIOPSY),441,MAJOR BLADDER PROCEDURES,11,DISEASES AND DISORDERS OF THE KIDNEY AND URINARY TRACT,3,Major,Moderate,Surgical,Medicare,Private Health Insurance,,,,N,110941.83,28681.90
New York City,Manhattan,7002054,001464,New York-Presbyterian Hospital - Columbia Presbyterian Center,70 or Older,100,M,White,Not Span/Hispanic,6,Elective,Skilled Nursing Home,2022,NEO043,Urinary system cancers - bladder,URN009,CYSTECTOMY (INCLUDING FULGURATION) AND URETHRECTOMY,441,MAJOR BLADDER PROCEDURES,11,DISEASES AND DISORDERS OF THE KIDNEY AND URINARY TRACT,3,Major,Moderate,Surgical,Medicare,Medicaid,,,,N,149777.62,40249.20
Finger Lakes,Monroe,2701005,000413,Strong Memorial Hospital,50 to 69,144,M,White,Spanish/Hispanic,4,Elective,Home w/ Home Health Services,2022,NEO043,Urinary system cancers - bladder,URN009,CYSTECTOMY (INCLUDING FULGURATION) AND URETHRECTOMY,441,MAJOR BLADDER PROCEDURES,11,DISEASES AND DISORDERS OF THE KIDNEY AND URINARY TRACT,3,Major,Moderate,Surgical,Medicare,Medicaid,,,,N,77415.33,36481.21
New York City,Manhattan,7002054,001464,New York-Presbyterian Hospital - Columbia Presbyterian Center,50 to 69,100,M,Black/African American,Not Span/Hispanic,6,Elective,Skilled Nursing Home,2022,NEO043,Urinary system cancers - bladder,MRS003,PROSTATECTOMY,441,MAJOR BLADDER PROCEDURES,11,DISEASES AND DISORDERS OF THE KIDNEY AND URINARY TRACT,3,Major,Moderate,Surgical,Medicaid,,,,,N,214098.23,58485.39
New York City,Manhattan,7002053,001463,NYU Langone Hospitals,70 or Older,113,F,Other Race,Not Span/Hispanic,5,Elective,Skilled Nursing Home,2022,NEO043,Urinary system cancers - bladder,URN009,CYSTECTOMY (INCLUDING FULGURATION) AND URETHRECTOMY,441,MAJOR BLADDER PROCEDURES,11,DISEASES AND DISORDERS OF THE KIDNEY AND URINARY TRACT,3,Major,Major,Surgical,Medicare,Blue Cross/Blue Shield,,,,N,261750.44,50625.96
New York City,Manhattan,7002053,001463,NYU Langone Hospitals,70 or Older,,M,White,Not Span/Hispanic,7,Elective,Home or Self Care,2022,NEO043,Urinary system cancers - bladder,URN009,CYSTECTOMY (INCLUDING FULGURATION) AND URETHRECTOMY,441,MAJOR BLADDER PROCEDURES,11,DISEASES AND DISORDERS OF THE KIDNEY AND URINARY TRACT,3,Major,Moderate,Surgical,Private Health Insurance,,,,,N,184841.05,46518.83
New York City,Manhattan,7002053,001463,NYU Langone Hospitals,50 to 69,100,M,White,Not Span/Hispanic,8,Emergency,Home w/ Home Health Services,2022,NEO043,Urinary system cancers - bladder,URN009,CYSTECTOMY (INCLUDING FULGURATION) AND URETHRECTOMY,441,MAJOR BLADDER PROCEDURES,11,DISEASES AND DISORDERS OF THE KIDNEY AND URINARY TRACT,3,Major,Minor,Surgical,Private Health Insurance,,,,,Y,221691.69,53422.18
New York City,Manhattan,7002053,001463,NYU Langone Hospitals,70 or Older,115,M,Other Race,Not Span/Hispanic,22,Elective,Home w/ Home Health Services,2022,GEN007,Other specified and unspecified diseases of bladder and urethra,URN009,CYSTECTOMY (INCLUDING FULGURATION) AND URETHRECTOMY,441,MAJOR BLADDER PROCEDURES,11,DISEASES AND DISORDERS OF THE KIDNEY AND URINARY TRACT,4,Extreme,Major,Surgical,Medicare,Private Health Insurance,,,,N,697177.76,150530.72
New York City,Manhattan,7002053,001463,NYU Langone Hospitals,70 or Older,100,F,White,Not Span/Hispanic,8,Elective,Home w/ Home Health Services,2022,NEO043,Urinary system cancers - bladder,LYM003,LYMPH NODE DISSECTION,441,MAJOR BLADDER PROCEDURES,11,DISEASES AND DISORDERS OF THE KIDNEY AND URINARY TRACT,3,Major,Moderate,Surgical,Medicare,Medicaid,,,,N,340988.29,70812.38
New York City,Manhattan,7002053,001463,NYU Langone Hospitals,30 to 49,OOS,M,White,Not Span/Hispanic,3,Elective,Home or Self Care,2022,INJ034,"Complication of genitourinary device, implant or graft, initial encounter",URN007,URINARY TRACT REPAIR,441,MAJOR BLADDER PROCEDURES,11,DISEASES AND DISORDERS OF THE KIDNEY AND URINARY TRACT,2,Moderate,Minor,Surgical,Private Health Insurance,,,,,N,94632.97,21897.95
New York City,Manhattan,7002053,001463,NYU Langone Hospitals,70 or Older,112,M,White,Not Span/Hispanic,7,Elective,Home w/ Home Health Services,2022,NEO043,Urinary system cancers - bladder,URN009,CYSTECTOMY (INCLUDING FULGURATION) AND URETHRECTOMY,441,MAJOR BLADDER PROCEDURES,11,DISEASES AND DISORDERS OF THE KIDNEY AND URINARY TRACT,3,Major,Major,Surgical,Private Health Insurance,,,,,N,339435.78,66736.96
New York City,Manhattan,7002053,001463,NYU Langone Hospitals,50 to 69,100,M,Other Race,Not Span/Hispanic,6,Elective,Home w/ Home Health Services,2022,NEO043,Urinary system cancers - bladder,URN009,CYSTECTOMY (INCLUDING FULGURATION) AND URETHRECTOMY,441,MAJOR BLADDER PROCEDURES,11,DISEASES AND DISORDERS OF THE KIDNEY AND URINARY TRACT,2,Moderate,Minor,Surgical,Medicare,,,,,N,165656.09,41042.90
New York City,Manhattan,7002053,001463,NYU Langone Hospitals,70 or Older,113,M,Other Race,Not Span/Hispanic,5,Elective,Home w/ Home Health Services,2022,NEO043,Urinary system cancers - bladder,URN009,CYSTECTOMY (INCLUDING FULGURATION) AND URETHRECTOMY,441,MAJOR BLADDER PROCEDURES,11,DISEASES AND DISORDERS OF THE KIDNEY AND URINARY TRACT,3,Major,Moderate,Surgical,Private Health Insurance,Medicare,,,,N,305307.40,55864.03
New York City,Manhattan,7002053,001463,NYU Langone Hospitals,70 or Older,112,F,White,Not Span/Hispanic,16,Elective,Inpatient Rehabilitation Facility,2022,NEO043,Urinary system cancers - bladder,URN009,CYSTECTOMY (INCLUDING FULGURATION) AND URETHRECTOMY,441,MAJOR BLADDER PROCEDURES,11,DISEASES AND DISORDERS OF THE KIDNEY AND URINARY TRACT,4,Extreme,Extreme,Surgical,Medicare,Blue Cross/Blue Shield,,,,N,494624.59,119643.30
New York City,Manhattan,7002053,001463,NYU Langone Hospitals,30 to 49,111,F,Other Race,Spanish/Hispanic,6,Elective,Home w/ Home Health Services,2022,NEO043,Urinary system cancers - bladder,URN009,CYSTECTOMY (INCLUDING FULGURATION) AND URETHRECTOMY,441,MAJOR BLADDER PROCEDURES,11,DISEASES AND DISORDERS OF THE KIDNEY AND URINARY TRACT,3,Major,Major,Surgical,Medicare,Medicaid,,,,N,245186.41,54560.60
New York City,Manhattan,7002053,001463,NYU Langone Hospitals,30 to 49,100,M,Other Race,Spanish/Hispanic,1,Elective,Home or Self Care,2022,GEN007,Other specified and unspecified diseases of bladder and urethra,URN009,CYSTECTOMY (INCLUDING FULGURATION) AND URETHRECTOMY,441,MAJOR BLADDER PROCEDURES,11,DISEASES AND DISORDERS OF THE KIDNEY AND URINARY TRACT,2,Moderate,Moderate,Surgical,Private Health Insurance,,,,,N,135483.15,21751.04
New York City,Manhattan,7002053,001463,NYU Langone Hospitals,50 to 69,112,M,White,Not Span/Hispanic,5,Elective,Home w/ Home Health Services,2022,GEN007,Other specified and unspecified diseases of bladder and urethra,GIS009,COLECTOMY,441,MAJOR BLADDER PROCEDURES,11,DISEASES AND DISORDERS OF THE KIDNEY AND URINARY TRACT,2,Moderate,Moderate,Surgical,Medicare,Medicare,,,,N,259882.47,49994.81
New York City,Manhattan,7002053,001463,NYU Langone Hospitals,70 or Older,OOS,F,White,Not Span/Hispanic,19,Elective,Skilled Nursing Home,2022,GEN026,Postprocedural or postoperative genitourinary system complication,URN007,URINARY TRACT REPAIR,441,MAJOR BLADDER PROCEDURES,11,DISEASES AND DISORDERS OF THE KIDNEY AND URINARY TRACT,3,Major,Moderate,Surgical,Medicare,Medicare,,,,N,606333.12,135667.39
Finger Lakes,Monroe,2701005,000413,Strong Memorial Hospital,30 to 49,145,M,Other Race,Not Span/Hispanic,7,Elective,Home w/ Home Health Services,2022,NEO043,Urinary system cancers - bladder,URN009,CYSTECTOMY (INCLUDING FULGURATION) AND URETHRECTOMY,441,MAJOR BLADDER PROCEDURES,11,DISEASES AND DISORDERS OF THE KIDNEY AND URINARY TRACT,3,Major,Minor,Surgical,Private Health Insurance,,,,,N,97286.40,45183.31
New York City,Manhattan,7002054,001464,New York-Presbyterian Hospital - Columbia Presbyterian Center,70 or Older,OOS,M,Other Race,Unknown,10,Elective,Home w/ Home Health Services,2022,NEO043,Urinary system cancers - bladder,URN009,CYSTECTOMY (INCLUDING FULGURATION) AND URETHRECTOMY,441,MAJOR BLADDER PROCEDURES,11,DISEASES AND DISORDERS OF THE KIDNEY AND URINARY TRACT,3,Major,Minor,Surgical,Medicare,Private Health Insurance,,,,N,243430.35,74295.90
New York City,Manhattan,7002053,001463,NYU Langone Hospitals,70 or Older,113,M,Other Race,Not Span/Hispanic,13,Emergency,Home w/ Home Health Services,2022,NEO043,Urinary system cancers - bladder,GIS009,COLECTOMY,441,MAJOR BLADDER PROCEDURES,11,DISEASES AND DISORDERS OF THE KIDNEY AND URINARY TRACT,3,Major,Major,Surgical,Medicaid,,,,,N,277592.06,76285.10
New York City,Manhattan,7002053,001463,NYU Langone Hospitals,70 or Older,100,M,Other Race,Spanish/Hispanic,6,Elective,Home w/ Home Health Services,2022,GEN007,Other specified and unspecified diseases of bladder and urethra,URN009,CYSTECTOMY (INCLUDING FULGURATION) AND URETHRECTOMY,441,MAJOR BLADDER PROCEDURES,11,DISEASES AND DISORDERS OF THE KIDNEY AND URINARY TRACT,4,Extreme,Major,Surgical,Medicare,Medicaid,,,,N,304357.05,56424.25