Hospital Service Area,Hospital County,Operating Certificate Number,Permanent Facility Id,Facility Name,Age Group,Zip Code - 3 digits,Gender,Race,Ethnicity,Length of Stay,Type of Admission,Patient Disposition,Discharge Year,CCS Diagnosis Code,CCS Diagnosis Description,CCS Procedure Code,CCS Procedure Description,APR DRG Code,APR DRG Description,APR MDC Code,APR MDC Description,APR Severity of Illness Code,APR Severity of Illness Description,APR Risk of Mortality,APR Medical Surgical Description,Payment Typology 1,Payment Typology 2,Payment Typology 3,Birth Weight,Abortion Edit Indicator,Emergency Department Indicator,Total Charges,Total Costs
New York City,Manhattan,7002054,001464,New York-Presbyterian Hospital - Columbia Presbyterian Center,70 or Older,103,M,White,Not Span/Hispanic,23,Urgent,Home w/ Home Health Services,2022,INJ036,"Complication of transplanted organs or tissue, initial encounter",IMG002,FLUOROSCOPIC ANGIOGRAPHY (EXCLUDING CORONARY),444,RENAL DIALYSIS ACCESS DEVICE PROCEDURES,11,DISEASES AND DISORDERS OF THE KIDNEY AND URINARY TRACT,3,Major,Major,Surgical,Medicare,Private Health Insurance,,,,N,442239.61,182783.26
New York City,Manhattan,7002054,001464,New York-Presbyterian Hospital - Columbia Presbyterian Center,50 to 69,104,F,Black/African American,Spanish/Hispanic,11,Emergency,Home or Self Care,2022,INJ037,"Complication of other surgical or medical care, injury, initial encounter",CAR025,PLACEMENT OF TUNNELED OR IMPLANTABLE PORTION OF A VASCULAR ACCESS DEVICE,444,RENAL DIALYSIS ACCESS DEVICE PROCEDURES,11,DISEASES AND DISORDERS OF THE KIDNEY AND URINARY TRACT,3,Major,Major,Surgical,Medicaid,,,,,Y,191662.52,46817.96
New York City,Manhattan,7002054,001464,New York-Presbyterian Hospital - Columbia Presbyterian Center,50 to 69,100,F,Other Race,Spanish/Hispanic,11,Emergency,Hospice - Home,2022,GEN002,Acute and unspecified renal failure,GIS006,PARACENTESIS,444,RENAL DIALYSIS ACCESS DEVICE PROCEDURES,11,DISEASES AND DISORDERS OF THE KIDNEY AND URINARY TRACT,3,Major,Major,Surgical,Medicare,Medicaid,,,,Y,217557.61,49000.71
Finger Lakes,Monroe,2701005,000413,Strong Memorial Hospital,30 to 49,146,F,Black/African American,Not Span/Hispanic,8,Emergency,Home or Self Care,2022,INJ037,"Complication of other surgical or medical care, injury, initial encounter",GIS024,OTHER PERITONEAL CAVITY PROCEDURES,444,RENAL DIALYSIS ACCESS DEVICE PROCEDURES,11,DISEASES AND DISORDERS OF THE KIDNEY AND URINARY TRACT,3,Major,Major,Surgical,Medicare,Medicaid,,,,Y,64894.65,24084.97
Finger Lakes,Monroe,2701005,000413,Strong Memorial Hospital,50 to 69,146,M,Other Race,Spanish/Hispanic,48,Emergency,Home w/ Home Health Services,2022,GEN002,Acute and unspecified renal failure,CAR015,PERIPHERAL ARTERIOVENOUS FISTULA AND SHUNT PROCEDURES,444,RENAL DIALYSIS ACCESS DEVICE PROCEDURES,11,DISEASES AND DISORDERS OF THE KIDNEY AND URINARY TRACT,4,Extreme,Extreme,Surgical,Medicare,Medicaid,,,,Y,226872.63,86325.11
New York City,Manhattan,7002053,001463,NYU Langone Hospitals,70 or Older,113,F,White,Spanish/Hispanic,1,Elective,Home or Self Care,2022,GEN003,Chronic kidney disease,CAR015,PERIPHERAL ARTERIOVENOUS FISTULA AND SHUNT PROCEDURES,444,RENAL DIALYSIS ACCESS DEVICE PROCEDURES,11,DISEASES AND DISORDERS OF THE KIDNEY AND URINARY TRACT,2,Moderate,Moderate,Surgical,Medicare,Medicaid,,,,N,106239.54,17206.28
New York City,Manhattan,7002053,001463,NYU Langone Hospitals,50 to 69,113,M,Other Race,Not Span/Hispanic,1,Elective,Home or Self Care,2022,GEN003,Chronic kidney disease,GIS024,OTHER PERITONEAL CAVITY PROCEDURES,444,RENAL DIALYSIS ACCESS DEVICE PROCEDURES,11,DISEASES AND DISORDERS OF THE KIDNEY AND URINARY TRACT,3,Major,Moderate,Surgical,Private Health Insurance,Medicare,,,,N,83934.07,19445.66
New York City,Manhattan,7002001,001438,Bellevue Hospital Center,50 to 69,OOS,M,White,Unknown,18,Emergency,Home or Self Care,2022,GEN003,Chronic kidney disease,CAR015,PERIPHERAL ARTERIOVENOUS FISTULA AND SHUNT PROCEDURES,444,RENAL DIALYSIS ACCESS DEVICE PROCEDURES,11,DISEASES AND DISORDERS OF THE KIDNEY AND URINARY TRACT,3,Major,Moderate,Surgical,Medicaid,,,,,Y,145064.16,83424.08
New York City,Manhattan,7002001,001438,Bellevue Hospital Center,50 to 69,100,M,Black/African American,Not Span/Hispanic,14,Emergency,Home or Self Care,2022,GEN003,Chronic kidney disease,CAR015,PERIPHERAL ARTERIOVENOUS FISTULA AND SHUNT PROCEDURES,444,RENAL DIALYSIS ACCESS DEVICE PROCEDURES,11,DISEASES AND DISORDERS OF THE KIDNEY AND URINARY TRACT,3,Major,Major,Surgical,Medicaid,,,,,Y,140676.99,80901.09
New York City,Manhattan,7002054,001464,New York-Presbyterian Hospital - Columbia Presbyterian Center,18 to 29,104,F,White,Spanish/Hispanic,49,Emergency,Home w/ Home Health Services,2022,GEN003,Chronic kidney disease,GIS024,OTHER PERITONEAL CAVITY PROCEDURES,444,RENAL DIALYSIS ACCESS DEVICE PROCEDURES,11,DISEASES AND DISORDERS OF THE KIDNEY AND URINARY TRACT,3,Major,Major,Surgical,Medicaid,,,,,Y,833707.36,229956.36
Long Island,Nassau,2951001,000541,North Shore University Hospital,18 to 29,112,M,Other Race,Not Span/Hispanic,18,Urgent,Home or Self Care,2022,GEN009,Hematuria,GIS024,OTHER PERITONEAL CAVITY PROCEDURES,444,RENAL DIALYSIS ACCESS DEVICE PROCEDURES,11,DISEASES AND DISORDERS OF THE KIDNEY AND URINARY TRACT,3,Major,Major,Surgical,Private Health Insurance,,,,,N,399548.98,94432.88
Long Island,Nassau,2951001,000541,North Shore University Hospital,50 to 69,114,F,Black/African American,Not Span/Hispanic,22,Emergency,Home w/ Home Health Services,2022,GEN002,Acute and unspecified renal failure,CAR015,PERIPHERAL ARTERIOVENOUS FISTULA AND SHUNT PROCEDURES,444,RENAL DIALYSIS ACCESS DEVICE PROCEDURES,11,DISEASES AND DISORDERS OF THE KIDNEY AND URINARY TRACT,3,Major,Moderate,Surgical,Medicaid,Medicaid,,,,Y,361619.39,77280.13
Hudson Valley,Dutchess,1302001,000181,Vassar Brothers Medical Center,50 to 69,125,M,White,Not Span/Hispanic,11,Emergency,Home or Self Care,2022,INJ037,"Complication of other surgical or medical care, injury, initial encounter",GIS024,OTHER PERITONEAL CAVITY PROCEDURES,444,RENAL DIALYSIS ACCESS DEVICE PROCEDURES,11,DISEASES AND DISORDERS OF THE KIDNEY AND URINARY TRACT,3,Major,Moderate,Surgical,Medicare,Federal/State/Local/VA,,,,Y,82028.78,29472.83
Hudson Valley,Dutchess,1302001,000181,Vassar Brothers Medical Center,50 to 69,124,F,Other Race,Not Span/Hispanic,60,Urgent,Home or Self Care,2022,GEN002,Acute and unspecified renal failure,CAR015,PERIPHERAL ARTERIOVENOUS FISTULA AND SHUNT PROCEDURES,444,RENAL DIALYSIS ACCESS DEVICE PROCEDURES,11,DISEASES AND DISORDERS OF THE KIDNEY AND URINARY TRACT,4,Extreme,Extreme,Surgical,Medicare,Medicaid,,,,N,539988.76,187668.91
New York City,Manhattan,7002001,001438,Bellevue Hospital Center,50 to 69,114,M,Black/African American,Unknown,17,Urgent,Home or Self Care,2022,GEN003,Chronic kidney disease,IMG008,ULTRASONOGRAPHY,444,RENAL DIALYSIS ACCESS DEVICE PROCEDURES,11,DISEASES AND DISORDERS OF THE KIDNEY AND URINARY TRACT,2,Moderate,Moderate,Surgical,Medicaid,,,,,N,149469.57,85957.56
Finger Lakes,Monroe,2701005,000413,Strong Memorial Hospital,70 or Older,145,M,White,Not Span/Hispanic,8,Emergency,Home or Self Care,2022,INJ037,"Complication of other surgical or medical care, injury, initial encounter",GIS022,GI SYSTEM LYSIS OF ADHESIONS,444,RENAL DIALYSIS ACCESS DEVICE PROCEDURES,11,DISEASES AND DISORDERS OF THE KIDNEY AND URINARY TRACT,3,Major,Major,Surgical,Blue Cross/Blue Shield,Medicare,,,,Y,68945.45,25593.04
Finger Lakes,Monroe,2701005,000413,Strong Memorial Hospital,70 or Older,145,M,White,Not Span/Hispanic,1,Urgent,Home or Self Care,2022,END003,Diabetes mellitus with complication,CAR015,PERIPHERAL ARTERIOVENOUS FISTULA AND SHUNT PROCEDURES,444,RENAL DIALYSIS ACCESS DEVICE PROCEDURES,11,DISEASES AND DISORDERS OF THE KIDNEY AND URINARY TRACT,2,Moderate,Minor,Surgical,Medicare,,,,,N,20250.51,9878.16
Finger Lakes,Monroe,2701005,000413,Strong Memorial Hospital,50 to 69,146,F,Black/African American,Not Span/Hispanic,38,Emergency,Home w/ Home Health Services,2022,GEN002,Acute and unspecified renal failure,CAR015,PERIPHERAL ARTERIOVENOUS FISTULA AND SHUNT PROCEDURES,444,RENAL DIALYSIS ACCESS DEVICE PROCEDURES,11,DISEASES AND DISORDERS OF THE KIDNEY AND URINARY TRACT,4,Extreme,Extreme,Surgical,Medicaid,,,,,Y,233618.45,73946.86
New York City,Manhattan,7002001,001438,Bellevue Hospital Center,30 to 49,113,F,Other Race,Spanish/Hispanic,5,Urgent,Inpatient Rehabilitation Facility,2022,GEN003,Chronic kidney disease,CAR015,PERIPHERAL ARTERIOVENOUS FISTULA AND SHUNT PROCEDURES,444,RENAL DIALYSIS ACCESS DEVICE PROCEDURES,11,DISEASES AND DISORDERS OF THE KIDNEY AND URINARY TRACT,2,Moderate,Moderate,Surgical,Medicaid,,,,,N,52622.95,30262.62
Long Island,Nassau,2951001,000541,North Shore University Hospital,18 to 29,116,M,White,Spanish/Hispanic,11,Emergency,Home or Self Care,2022,GEN003,Chronic kidney disease,ESA001,HEMODIALYSIS,444,RENAL DIALYSIS ACCESS DEVICE PROCEDURES,11,DISEASES AND DISORDERS OF THE KIDNEY AND URINARY TRACT,3,Major,Moderate,Surgical,Medicaid,,,,,Y,211258.58,52402.48
Long Island,Nassau,2951001,000541,North Shore University Hospital,70 or Older,118,M,White,Not Span/Hispanic,7,Emergency,Home or Self Care,2022,GEN003,Chronic kidney disease,GIS024,OTHER PERITONEAL CAVITY PROCEDURES,444,RENAL DIALYSIS ACCESS DEVICE PROCEDURES,11,DISEASES AND DISORDERS OF THE KIDNEY AND URINARY TRACT,3,Major,Moderate,Surgical,Medicare,Blue Cross/Blue Shield,,,,Y,128409.85,21397.86
Long Island,Nassau,2951001,000541,North Shore University Hospital,50 to 69,117,F,Black/African American,Not Span/Hispanic,21,Emergency,Home w/ Home Health Services,2022,INJ036,"Complication of transplanted organs or tissue, initial encounter",CAR015,PERIPHERAL ARTERIOVENOUS FISTULA AND SHUNT PROCEDURES,444,RENAL DIALYSIS ACCESS DEVICE PROCEDURES,11,DISEASES AND DISORDERS OF THE KIDNEY AND URINARY TRACT,4,Extreme,Extreme,Surgical,Blue Cross/Blue Shield,,,,,Y,379255.84,86554.01
Long Island,Nassau,2951001,000541,North Shore University Hospital,50 to 69,114,M,Other Race,Not Span/Hispanic,18,Emergency,Home w/ Home Health Services,2022,INJ033,"Complication of cardiovascular device, implant or graft, initial encounter",CAR015,PERIPHERAL ARTERIOVENOUS FISTULA AND SHUNT PROCEDURES,444,RENAL DIALYSIS ACCESS DEVICE PROCEDURES,11,DISEASES AND DISORDERS OF THE KIDNEY AND URINARY TRACT,4,Extreme,Major,Surgical,Medicare,Medicaid,,,,Y,341456.04,80195.20
Long Island,Nassau,2951001,000541,North Shore University Hospital,70 or Older,118,M,White,Not Span/Hispanic,21,Emergency,Home w/ Home Health Services,2022,INJ037,"Complication of other surgical or medical care, injury, initial encounter",CAR015,PERIPHERAL ARTERIOVENOUS FISTULA AND SHUNT PROCEDURES,444,RENAL DIALYSIS ACCESS DEVICE PROCEDURES,11,DISEASES AND DISORDERS OF THE KIDNEY AND URINARY TRACT,4,Extreme,Major,Surgical,Medicare,Blue Cross/Blue Shield,,,,Y,342523.31,82441.98
Long Island,Nassau,2951001,000541,North Shore University Hospital,70 or Older,114,F,Black/African American,Not Span/Hispanic,38,Emergency,Home w/ Home Health Services,2022,GEN002,Acute and unspecified renal failure,CAR015,PERIPHERAL ARTERIOVENOUS FISTULA AND SHUNT PROCEDURES,444,RENAL DIALYSIS ACCESS DEVICE PROCEDURES,11,DISEASES AND DISORDERS OF THE KIDNEY AND URINARY TRACT,3,Major,Major,Surgical,Medicare,Medicare,,,,Y,549026.95,117468.38
Long Island,Nassau,2951001,000541,North Shore University Hospital,50 to 69,119,M,White,Not Span/Hispanic,38,Emergency,Home w/ Home Health Services,2022,GEN003,Chronic kidney disease,CAR015,PERIPHERAL ARTERIOVENOUS FISTULA AND SHUNT PROCEDURES,444,RENAL DIALYSIS ACCESS DEVICE PROCEDURES,11,DISEASES AND DISORDERS OF THE KIDNEY AND URINARY TRACT,3,Major,Major,Surgical,Private Health Insurance,,,,,Y,585098.89,177677.88
Long Island,Nassau,2951001,000541,North Shore University Hospital,50 to 69,113,F,Black/African American,Not Span/Hispanic,14,Emergency,Skilled Nursing Home,2022,GEN002,Acute and unspecified renal failure,CAR015,PERIPHERAL ARTERIOVENOUS FISTULA AND SHUNT PROCEDURES,444,RENAL DIALYSIS ACCESS DEVICE PROCEDURES,11,DISEASES AND DISORDERS OF THE KIDNEY AND URINARY TRACT,3,Major,Major,Surgical,Medicaid,Medicaid,,,,Y,255202.17,61095.92
Long Island,Nassau,2951001,000541,North Shore University Hospital,50 to 69,114,F,Black/African American,Not Span/Hispanic,14,Emergency,Home or Self Care,2022,GEN003,Chronic kidney disease,CAR015,PERIPHERAL ARTERIOVENOUS FISTULA AND SHUNT PROCEDURES,444,RENAL DIALYSIS ACCESS DEVICE PROCEDURES,11,DISEASES AND DISORDERS OF THE KIDNEY AND URINARY TRACT,3,Major,Moderate,Surgical,Medicaid,Medicaid,,,,Y,241668.62,63330.64
Long Island,Nassau,2951001,000541,North Shore University Hospital,50 to 69,114,F,Black/African American,Not Span/Hispanic,15,Emergency,Home w/ Home Health Services,2022,INJ037,"Complication of other surgical or medical care, injury, initial encounter",GIS024,OTHER PERITONEAL CAVITY PROCEDURES,444,RENAL DIALYSIS ACCESS DEVICE PROCEDURES,11,DISEASES AND DISORDERS OF THE KIDNEY AND URINARY TRACT,4,Extreme,Extreme,Surgical,Medicare,Medicaid,,,,Y,257956.70,64781.12
Finger Lakes,Monroe,2701005,000413,Strong Memorial Hospital,70 or Older,146,M,Multi-racial,Not Span/Hispanic,11,Emergency,Home or Self Care,2022,GEN003,Chronic kidney disease,GIS024,OTHER PERITONEAL CAVITY PROCEDURES,444,RENAL DIALYSIS ACCESS DEVICE PROCEDURES,11,DISEASES AND DISORDERS OF THE KIDNEY AND URINARY TRACT,3,Major,Major,Surgical,Federal/State/Local/VA,,,,,Y,53341.45,24126.84
Hudson Valley,Dutchess,1302001,000181,Vassar Brothers Medical Center,50 to 69,126,M,Other Race,Not Span/Hispanic,17,Emergency,Home or Self Care,2022,INJ037,"Complication of other surgical or medical care, injury, initial encounter",GIS024,OTHER PERITONEAL CAVITY PROCEDURES,444,RENAL DIALYSIS ACCESS DEVICE PROCEDURES,11,DISEASES AND DISORDERS OF THE KIDNEY AND URINARY TRACT,4,Extreme,Major,Surgical,Private Health Insurance,,,,,Y,128346.09,41764.70
Hudson Valley,Dutchess,1302001,000181,Vassar Brothers Medical Center,50 to 69,126,M,White,Not Span/Hispanic,15,Emergency,Another Type Not Listed,2022,INJ036,"Complication of transplanted organs or tissue, initial encounter",GIS024,OTHER PERITONEAL CAVITY PROCEDURES,444,RENAL DIALYSIS ACCESS DEVICE PROCEDURES,11,DISEASES AND DISORDERS OF THE KIDNEY AND URINARY TRACT,4,Extreme,Extreme,Surgical,"Managed Care, Unspecified",,,,,Y,121088.45,36764.31
Hudson Valley,Dutchess,1302001,000181,Vassar Brothers Medical Center,50 to 69,124,M,White,Unknown,15,Urgent,Home or Self Care,2022,GEN003,Chronic kidney disease,CAR015,PERIPHERAL ARTERIOVENOUS FISTULA AND SHUNT PROCEDURES,444,RENAL DIALYSIS ACCESS DEVICE PROCEDURES,11,DISEASES AND DISORDERS OF THE KIDNEY AND URINARY TRACT,3,Major,Major,Surgical,Self-Pay,,,,,N,108226.99,38879.68
Hudson Valley,Dutchess,1302001,000181,Vassar Brothers Medical Center,70 or Older,125,F,White,Not Span/Hispanic,7,Emergency,Home or Self Care,2022,INJ037,"Complication of other surgical or medical care, injury, initial encounter",GIS024,OTHER PERITONEAL CAVITY PROCEDURES,444,RENAL DIALYSIS ACCESS DEVICE PROCEDURES,11,DISEASES AND DISORDERS OF THE KIDNEY AND URINARY TRACT,2,Moderate,Moderate,Surgical,Medicare,Miscellaneous/Other,,,,Y,46764.78,15971.06
Hudson Valley,Dutchess,1302001,000181,Vassar Brothers Medical Center,70 or Older,125,F,White,Not Span/Hispanic,12,Emergency,Home w/ Home Health Services,2022,GEN002,Acute and unspecified renal failure,CAR015,PERIPHERAL ARTERIOVENOUS FISTULA AND SHUNT PROCEDURES,444,RENAL DIALYSIS ACCESS DEVICE PROCEDURES,11,DISEASES AND DISORDERS OF THE KIDNEY AND URINARY TRACT,4,Extreme,Major,Surgical,Private Health Insurance,,,,,Y,101509.18,34989.49
Hudson Valley,Dutchess,1302001,000181,Vassar Brothers Medical Center,50 to 69,126,F,Other Race,Not Span/Hispanic,15,Emergency,Home or Self Care,2022,GEN003,Chronic kidney disease,CAR015,PERIPHERAL ARTERIOVENOUS FISTULA AND SHUNT PROCEDURES,444,RENAL DIALYSIS ACCESS DEVICE PROCEDURES,11,DISEASES AND DISORDERS OF THE KIDNEY AND URINARY TRACT,3,Major,Moderate,Surgical,Medicare,Medicaid,,,,Y,116283.94,41943.35
New York City,Manhattan,7002054,001464,New York-Presbyterian Hospital - Columbia Presbyterian Center,0 to 17,104,F,Other Race,Spanish/Hispanic,10,Elective,Home or Self Care,2022,GEN003,Chronic kidney disease,CAR024,VENOUS AND ARTERIAL CATHETER PLACEMENT,444,RENAL DIALYSIS ACCESS DEVICE PROCEDURES,11,DISEASES AND DISORDERS OF THE KIDNEY AND URINARY TRACT,3,Major,Major,Surgical,Medicaid,,,,,N,271062.82,125428.78
New York City,Manhattan,7002054,001464,New York-Presbyterian Hospital - Columbia Presbyterian Center,18 to 29,100,M,Black/African American,Not Span/Hispanic,11,Emergency,Home or Self Care,2022,GEN003,Chronic kidney disease,ESA001,HEMODIALYSIS,444,RENAL DIALYSIS ACCESS DEVICE PROCEDURES,11,DISEASES AND DISORDERS OF THE KIDNEY AND URINARY TRACT,3,Major,Major,Surgical,Medicaid,,,,,Y,202100.98,52088.07
New York City,Manhattan,7002001,001438,Bellevue Hospital Center,30 to 49,112,F,Black/African American,Not Span/Hispanic,59,Elective,Home or Self Care,2022,GEN003,Chronic kidney disease,CAR015,PERIPHERAL ARTERIOVENOUS FISTULA AND SHUNT PROCEDURES,444,RENAL DIALYSIS ACCESS DEVICE PROCEDURES,11,DISEASES AND DISORDERS OF THE KIDNEY AND URINARY TRACT,3,Major,Major,Surgical,Medicaid,,,,,N,507792.85,292023.54
Finger Lakes,Monroe,2701005,000413,Strong Memorial Hospital,30 to 49,145,M,White,Not Span/Hispanic,1,Urgent,Home or Self Care,2022,GEN003,Chronic kidney disease,GIS024,OTHER PERITONEAL CAVITY PROCEDURES,444,RENAL DIALYSIS ACCESS DEVICE PROCEDURES,11,DISEASES AND DISORDERS OF THE KIDNEY AND URINARY TRACT,1,Minor,Minor,Surgical,Federal/State/Local/VA,,,,,N,19936.01,9859.92
Finger Lakes,Monroe,2701005,000413,Strong Memorial Hospital,50 to 69,148,M,White,Not Span/Hispanic,21,Emergency,Skilled Nursing Home,2022,GEN002,Acute and unspecified renal failure,CAR015,PERIPHERAL ARTERIOVENOUS FISTULA AND SHUNT PROCEDURES,444,RENAL DIALYSIS ACCESS DEVICE PROCEDURES,11,DISEASES AND DISORDERS OF THE KIDNEY AND URINARY TRACT,4,Extreme,Extreme,Surgical,Medicare,,,,,Y,204798.47,76600.96
New York City,Manhattan,7002001,001438,Bellevue Hospital Center,30 to 49,113,M,Black/African American,Unknown,4,Elective,Court/Law Enforcement,2022,GEN003,Chronic kidney disease,CAR015,PERIPHERAL ARTERIOVENOUS FISTULA AND SHUNT PROCEDURES,444,RENAL DIALYSIS ACCESS DEVICE PROCEDURES,11,DISEASES AND DISORDERS OF THE KIDNEY AND URINARY TRACT,3,Major,Moderate,Surgical,Medicaid,,,,,N,60899.94,35022.58
Long Island,Nassau,2951001,000541,North Shore University Hospital,50 to 69,117,F,Other Race,Spanish/Hispanic,17,Emergency,Home or Self Care,2022,GEN003,Chronic kidney disease,CAR015,PERIPHERAL ARTERIOVENOUS FISTULA AND SHUNT PROCEDURES,444,RENAL DIALYSIS ACCESS DEVICE PROCEDURES,11,DISEASES AND DISORDERS OF THE KIDNEY AND URINARY TRACT,3,Major,Moderate,Surgical,Medicaid,Medicaid,,,,Y,310459.32,64975.29
Long Island,Nassau,2951001,000541,North Shore University Hospital,70 or Older,110,M,Other Race,Not Span/Hispanic,16,Emergency,Home or Self Care,2022,GEN003,Chronic kidney disease,CAR015,PERIPHERAL ARTERIOVENOUS FISTULA AND SHUNT PROCEDURES,444,RENAL DIALYSIS ACCESS DEVICE PROCEDURES,11,DISEASES AND DISORDERS OF THE KIDNEY AND URINARY TRACT,4,Extreme,Major,Surgical,Medicare,Medicare,Medicaid,,,Y,276915.17,62115.69
Long Island,Nassau,2951001,000541,North Shore University Hospital,70 or Older,115,M,White,Not Span/Hispanic,70,Emergency,Skilled Nursing Home,2022,GEN003,Chronic kidney disease,CAR015,PERIPHERAL ARTERIOVENOUS FISTULA AND SHUNT PROCEDURES,444,RENAL DIALYSIS ACCESS DEVICE PROCEDURES,11,DISEASES AND DISORDERS OF THE KIDNEY AND URINARY TRACT,4,Extreme,Extreme,Surgical,Medicare,Blue Cross/Blue Shield,Medicaid,,,Y,951331.54,252195.35
Long Island,Nassau,2951001,000541,North Shore University Hospital,30 to 49,114,F,Black/African American,Not Span/Hispanic,10,Emergency,Home or Self Care,2022,INJ033,"Complication of cardiovascular device, implant or graft, initial encounter",CNS002,LUMBAR PUNCTURE,444,RENAL DIALYSIS ACCESS DEVICE PROCEDURES,11,DISEASES AND DISORDERS OF THE KIDNEY AND URINARY TRACT,4,Extreme,Major,Surgical,Medicaid,Medicaid,,,,Y,246370.93,47159.90
Long Island,Nassau,2951001,000541,North Shore University Hospital,70 or Older,110,M,White,Not Span/Hispanic,5,Emergency,Home or Self Care,2022,GEN003,Chronic kidney disease,CAR015,PERIPHERAL ARTERIOVENOUS FISTULA AND SHUNT PROCEDURES,444,RENAL DIALYSIS ACCESS DEVICE PROCEDURES,11,DISEASES AND DISORDERS OF THE KIDNEY AND URINARY TRACT,2,Moderate,Moderate,Surgical,Medicare,Blue Cross/Blue Shield,,,,Y,116582.22,29634.16
Long Island,Nassau,2951001,000541,North Shore University Hospital,70 or Older,110,F,White,Not Span/Hispanic,41,Emergency,Skilled Nursing Home,2022,INJ036,"Complication of transplanted organs or tissue, initial encounter",CAR015,PERIPHERAL ARTERIOVENOUS FISTULA AND SHUNT PROCEDURES,444,RENAL DIALYSIS ACCESS DEVICE PROCEDURES,11,DISEASES AND DISORDERS OF THE KIDNEY AND URINARY TRACT,3,Major,Major,Surgical,Medicare,Medicare,,,,Y,616369.62,130418.17
Long Island,Nassau,2951001,000541,North Shore University Hospital,50 to 69,113,M,White,Not Span/Hispanic,17,Emergency,Home or Self Care,2022,INJ036,"Complication of transplanted organs or tissue, initial encounter",GIS024,OTHER PERITONEAL CAVITY PROCEDURES,444,RENAL DIALYSIS ACCESS DEVICE PROCEDURES,11,DISEASES AND DISORDERS OF THE KIDNEY AND URINARY TRACT,4,Extreme,Major,Surgical,Private Health Insurance,Medicare,,,,Y,247927.39,58144.34
Long Island,Nassau,2951001,000541,North Shore University Hospital,50 to 69,114,F,Black/African American,Not Span/Hispanic,7,Urgent,Home or Self Care,2022,GEN003,Chronic kidney disease,GIS024,OTHER PERITONEAL CAVITY PROCEDURES,444,RENAL DIALYSIS ACCESS DEVICE PROCEDURES,11,DISEASES AND DISORDERS OF THE KIDNEY AND URINARY TRACT,3,Major,Moderate,Surgical,Medicare,Medicare,Medicaid,,,N,96320.78,16502.79
Long Island,Nassau,2951001,000541,North Shore University Hospital,50 to 69,113,M,Black/African American,Not Span/Hispanic,21,Emergency,Facility w/ Custodial/Supportive Care,2022,GEN003,Chronic kidney disease,CAR015,PERIPHERAL ARTERIOVENOUS FISTULA AND SHUNT PROCEDURES,444,RENAL DIALYSIS ACCESS DEVICE PROCEDURES,11,DISEASES AND DISORDERS OF THE KIDNEY AND URINARY TRACT,3,Major,Major,Surgical,Medicare,Medicaid,,,,Y,304989.47,79744.16
Long Island,Nassau,2951001,000541,North Shore University Hospital,70 or Older,115,M,Black/African American,Not Span/Hispanic,25,Emergency,Home w/ Home Health Services,2022,GEN003,Chronic kidney disease,CAR015,PERIPHERAL ARTERIOVENOUS FISTULA AND SHUNT PROCEDURES,444,RENAL DIALYSIS ACCESS DEVICE PROCEDURES,11,DISEASES AND DISORDERS OF THE KIDNEY AND URINARY TRACT,3,Major,Major,Surgical,Medicare,Medicare,Blue Cross/Blue Shield,,,Y,350506.73,84884.16
Hudson Valley,Dutchess,1302001,000181,Vassar Brothers Medical Center,50 to 69,126,F,Other Race,Spanish/Hispanic,6,Emergency,Home or Self Care,2022,GEN003,Chronic kidney disease,GIS024,OTHER PERITONEAL CAVITY PROCEDURES,444,RENAL DIALYSIS ACCESS DEVICE PROCEDURES,11,DISEASES AND DISORDERS OF THE KIDNEY AND URINARY TRACT,3,Major,Major,Surgical,Medicare,Medicaid,,,,Y,56311.91,19216.02
Hudson Valley,Dutchess,1302001,000181,Vassar Brothers Medical Center,50 to 69,125,M,Other Race,Spanish/Hispanic,6,Emergency,Home or Self Care,2022,INJ037,"Complication of other surgical or medical care, injury, initial encounter",GIS024,OTHER PERITONEAL CAVITY PROCEDURES,444,RENAL DIALYSIS ACCESS DEVICE PROCEDURES,11,DISEASES AND DISORDERS OF THE KIDNEY AND URINARY TRACT,3,Major,Moderate,Surgical,Medicaid,,,,,Y,40550.89,15087.15