Hospital Service Area,Hospital County,Operating Certificate Number,Permanent Facility Id,Facility Name,Age Group,Zip Code - 3 digits,Gender,Race,Ethnicity,Length of Stay,Type of Admission,Patient Disposition,Discharge Year,CCS Diagnosis Code,CCS Diagnosis Description,CCS Procedure Code,CCS Procedure Description,APR DRG Code,APR DRG Description,APR MDC Code,APR MDC Description,APR Severity of Illness Code,APR Severity of Illness Description,APR Risk of Mortality,APR Medical Surgical Description,Payment Typology 1,Payment Typology 2,Payment Typology 3,Birth Weight,Abortion Edit Indicator,Emergency Department Indicator,Total Charges,Total Costs
New York City,Manhattan,7002054,001464,New York-Presbyterian Hospital - Columbia Presbyterian Center,70 or Older,100,M,Other Race,Spanish/Hispanic,8,Emergency,Home or Self Care,2022,CIR020,Cerebral infarction,ADM015,ADMINISTRATION OF ANTIBIOTICS,045,CVA AND PRECEREBRAL OCCLUSION WITH INFARCTION,01,DISEASES AND DISORDERS OF THE NERVOUS SYSTEM,2,Moderate,Minor,Medical,Medicare,,,,,Y,128865.29,28452.69
New York City,Manhattan,7002054,001464,New York-Presbyterian Hospital - Columbia Presbyterian Center,70 or Older,100,F,Other Race,Spanish/Hispanic,14,Emergency,Home w/ Home Health Services,2022,CIR020,Cerebral infarction,GIS017,GASTROSTOMY,045,CVA AND PRECEREBRAL OCCLUSION WITH INFARCTION,01,DISEASES AND DISORDERS OF THE NERVOUS SYSTEM,4,Extreme,Extreme,Medical,Medicare,,,,,Y,279744.38,107322.90
New York City,Manhattan,7002054,001464,New York-Presbyterian Hospital - Columbia Presbyterian Center,30 to 49,117,M,White,Unknown,1,Urgent,Expired,2022,CIR020,Cerebral infarction,ESA003,MECHANICAL VENTILATION,045,CVA AND PRECEREBRAL OCCLUSION WITH INFARCTION,01,DISEASES AND DISORDERS OF THE NERVOUS SYSTEM,4,Extreme,Extreme,Medical,Blue Cross/Blue Shield,,,,,N,59248.12,20474.05
New York City,Manhattan,7002001,001438,Bellevue Hospital Center,70 or Older,112,F,Black/African American,Unknown,3,Emergency,Short-term Hospital,2022,CIR020,Cerebral infarction,IMG007,COMPUTERIZED TOMOGRAPHY (CT) WITHOUT CONTRAST,045,CVA AND PRECEREBRAL OCCLUSION WITH INFARCTION,01,DISEASES AND DISORDERS OF THE NERVOUS SYSTEM,2,Moderate,Moderate,Medical,Medicare,,,,,Y,28988.38,16670.75
New York City,Manhattan,7002054,001464,New York-Presbyterian Hospital - Columbia Presbyterian Center,70 or Older,104,F,Other Race,Spanish/Hispanic,8,Emergency,Home w/ Home Health Services,2022,CIR020,Cerebral infarction,ADM021,"ADMINISTRATION OF THERAPEUTIC SUBSTANCES, NEC",045,CVA AND PRECEREBRAL OCCLUSION WITH INFARCTION,01,DISEASES AND DISORDERS OF THE NERVOUS SYSTEM,2,Moderate,Moderate,Medical,Medicare,Medicaid,,,,Y,128654.16,27816.85
New York City,Manhattan,7002001,001438,Bellevue Hospital Center,30 to 49,100,M,Other Race,Unknown,4,Elective,Home or Self Care,2022,CIR020,Cerebral infarction,ADM017,ADMINISTRATION OF NUTRITIONAL AND ELECTROLYTIC SUBSTANCES,045,CVA AND PRECEREBRAL OCCLUSION WITH INFARCTION,01,DISEASES AND DISORDERS OF THE NERVOUS SYSTEM,2,Moderate,Minor,Medical,Private Health Insurance,,,,,N,28010.21,16108.22
New York City,Manhattan,7002001,001438,Bellevue Hospital Center,50 to 69,114,M,Other Race,Unknown,6,Urgent,Inpatient Rehabilitation Facility,2022,CIR020,Cerebral infarction,IMG008,ULTRASONOGRAPHY,045,CVA AND PRECEREBRAL OCCLUSION WITH INFARCTION,01,DISEASES AND DISORDERS OF THE NERVOUS SYSTEM,2,Moderate,Minor,Medical,Medicaid,,,,,N,51719.10,29742.83
New York City,Manhattan,7002001,001438,Bellevue Hospital Center,70 or Older,100,F,White,Unknown,6,Emergency,Expired,2022,CIR020,Cerebral infarction,ADM021,"ADMINISTRATION OF THERAPEUTIC SUBSTANCES, NEC",045,CVA AND PRECEREBRAL OCCLUSION WITH INFARCTION,01,DISEASES AND DISORDERS OF THE NERVOUS SYSTEM,3,Major,Major,Medical,Medicare,Private Health Insurance,,,,Y,54624.81,31413.85
New York City,Manhattan,7002054,001464,New York-Presbyterian Hospital - Columbia Presbyterian Center,70 or Older,112,F,White,Not Span/Hispanic,6,Emergency,Facility w/ Custodial/Supportive Care,2022,CIR020,Cerebral infarction,OTR004,ISOLATION PROCEDURES,045,CVA AND PRECEREBRAL OCCLUSION WITH INFARCTION,01,DISEASES AND DISORDERS OF THE NERVOUS SYSTEM,3,Major,Major,Medical,Medicare,Private Health Insurance,Medicaid,,,Y,90812.58,19672.20
New York City,Manhattan,7002054,001464,New York-Presbyterian Hospital - Columbia Presbyterian Center,50 to 69,100,F,Black/African American,Unknown,4,Emergency,Home or Self Care,2022,CIR020,Cerebral infarction,,,045,CVA AND PRECEREBRAL OCCLUSION WITH INFARCTION,01,DISEASES AND DISORDERS OF THE NERVOUS SYSTEM,3,Major,Extreme,Medical,Medicare,Private Health Insurance,,,,Y,107690.98,44803.33
New York City,Manhattan,7002054,001464,New York-Presbyterian Hospital - Columbia Presbyterian Center,70 or Older,100,F,Other Race,Unknown,10,Emergency,Home w/ Home Health Services,2022,CIR020,Cerebral infarction,GIS017,GASTROSTOMY,045,CVA AND PRECEREBRAL OCCLUSION WITH INFARCTION,01,DISEASES AND DISORDERS OF THE NERVOUS SYSTEM,3,Major,Moderate,Medical,Medicare,,,,,Y,151022.41,33631.77
New York City,Manhattan,7002054,001464,New York-Presbyterian Hospital - Columbia Presbyterian Center,30 to 49,100,M,Black/African American,Not Span/Hispanic,1,Emergency,Home or Self Care,2022,CIR020,Cerebral infarction,ADM005,ADMINISTRATION OF THROMBOLYTICS AND PLATELET INHIBITORS,045,CVA AND PRECEREBRAL OCCLUSION WITH INFARCTION,01,DISEASES AND DISORDERS OF THE NERVOUS SYSTEM,2,Moderate,Minor,Medical,Private Health Insurance,,,,,Y,92831.97,32550.25
New York City,Manhattan,7002001,001438,Bellevue Hospital Center,50 to 69,114,M,Other Race,Unknown,3,Urgent,Home or Self Care,2022,CIR020,Cerebral infarction,ADM017,ADMINISTRATION OF NUTRITIONAL AND ELECTROLYTIC SUBSTANCES,045,CVA AND PRECEREBRAL OCCLUSION WITH INFARCTION,01,DISEASES AND DISORDERS OF THE NERVOUS SYSTEM,2,Moderate,Major,Medical,Medicaid,,,,,N,22429.79,12899.01
New York City,Manhattan,7002001,001438,Bellevue Hospital Center,70 or Older,112,F,Black/African American,Unknown,3,Emergency,Home or Self Care,2022,CIR020,Cerebral infarction,IMG007,COMPUTERIZED TOMOGRAPHY (CT) WITHOUT CONTRAST,045,CVA AND PRECEREBRAL OCCLUSION WITH INFARCTION,01,DISEASES AND DISORDERS OF THE NERVOUS SYSTEM,2,Moderate,Minor,Medical,Medicare,,,,,Y,35969.41,20685.43
New York City,Manhattan,7002001,001438,Bellevue Hospital Center,30 to 49,100,F,Other Race,Unknown,1,Emergency,Left Against Medical Advice,2022,CIR020,Cerebral infarction,ADM015,ADMINISTRATION OF ANTIBIOTICS,045,CVA AND PRECEREBRAL OCCLUSION WITH INFARCTION,01,DISEASES AND DISORDERS OF THE NERVOUS SYSTEM,1,Minor,Minor,Medical,Medicare,Medicaid,,,,Y,12597.98,7244.90
New York City,Manhattan,7002054,001464,New York-Presbyterian Hospital - Columbia Presbyterian Center,70 or Older,100,F,White,Spanish/Hispanic,13,Emergency,Inpatient Rehabilitation Facility,2022,CIR020,Cerebral infarction,OTR004,ISOLATION PROCEDURES,045,CVA AND PRECEREBRAL OCCLUSION WITH INFARCTION,01,DISEASES AND DISORDERS OF THE NERVOUS SYSTEM,3,Major,Moderate,Medical,Medicare,Medicaid,,,,Y,234985.53,74863.48
New York City,Manhattan,7002054,001464,New York-Presbyterian Hospital - Columbia Presbyterian Center,70 or Older,100,M,Other Race,Unknown,6,Emergency,Inpatient Rehabilitation Facility,2022,CIR020,Cerebral infarction,ADM017,ADMINISTRATION OF NUTRITIONAL AND ELECTROLYTIC SUBSTANCES,045,CVA AND PRECEREBRAL OCCLUSION WITH INFARCTION,01,DISEASES AND DISORDERS OF THE NERVOUS SYSTEM,2,Moderate,Moderate,Medical,Private Health Insurance,,,,,Y,93600.32,20014.08
New York City,Manhattan,7002054,001464,New York-Presbyterian Hospital - Columbia Presbyterian Center,30 to 49,100,F,Black/African American,Not Span/Hispanic,6,Emergency,Inpatient Rehabilitation Facility,2022,CIR020,Cerebral infarction,ADM017,ADMINISTRATION OF NUTRITIONAL AND ELECTROLYTIC SUBSTANCES,045,CVA AND PRECEREBRAL OCCLUSION WITH INFARCTION,01,DISEASES AND DISORDERS OF THE NERVOUS SYSTEM,3,Major,Moderate,Medical,Private Health Insurance,,,,,Y,134947.54,34059.22
New York City,Manhattan,7002054,001464,New York-Presbyterian Hospital - Columbia Presbyterian Center,50 to 69,100,M,Black/African American,Spanish/Hispanic,2,Emergency,Home or Self Care,2022,CIR020,Cerebral infarction,MAM011,ELECTROENCEPHALOGRAM (EEG),045,CVA AND PRECEREBRAL OCCLUSION WITH INFARCTION,01,DISEASES AND DISORDERS OF THE NERVOUS SYSTEM,2,Moderate,Minor,Medical,Medicaid,,,,,Y,111598.76,42158.87
New York City,Manhattan,7002054,001464,New York-Presbyterian Hospital - Columbia Presbyterian Center,50 to 69,125,F,White,Not Span/Hispanic,10,Elective,Inpatient Rehabilitation Facility,2022,CIR020,Cerebral infarction,MST028,"SUBCUTANEOUS TISSUE AND FASCIA PROCEDURES, NEC",045,CVA AND PRECEREBRAL OCCLUSION WITH INFARCTION,01,DISEASES AND DISORDERS OF THE NERVOUS SYSTEM,4,Extreme,Major,Medical,Medicare,,,,,N,213996.23,65868.24
New York City,Manhattan,7002054,001464,New York-Presbyterian Hospital - Columbia Presbyterian Center,70 or Older,104,F,Other Race,Spanish/Hispanic,18,Emergency,Inpatient Rehabilitation Facility,2022,CIR020,Cerebral infarction,,,045,CVA AND PRECEREBRAL OCCLUSION WITH INFARCTION,01,DISEASES AND DISORDERS OF THE NERVOUS SYSTEM,2,Moderate,Moderate,Medical,Medicare,Medicaid,,,,Y,367302.53,137168.08
New York City,Manhattan,7002054,001464,New York-Presbyterian Hospital - Columbia Presbyterian Center,70 or Older,100,M,Other Race,Spanish/Hispanic,6,Emergency,Skilled Nursing Home,2022,CIR020,Cerebral infarction,MAM011,ELECTROENCEPHALOGRAM (EEG),045,CVA AND PRECEREBRAL OCCLUSION WITH INFARCTION,01,DISEASES AND DISORDERS OF THE NERVOUS SYSTEM,3,Major,Major,Medical,Medicare,,,,,Y,120426.37,25236.04
New York City,Manhattan,7002054,001464,New York-Presbyterian Hospital - Columbia Presbyterian Center,30 to 49,116,M,Black/African American,Not Span/Hispanic,7,Emergency,Home or Self Care,2022,CIR020,Cerebral infarction,,,045,CVA AND PRECEREBRAL OCCLUSION WITH INFARCTION,01,DISEASES AND DISORDERS OF THE NERVOUS SYSTEM,2,Moderate,Major,Medical,Medicaid,,,,,Y,115710.36,25610.30
New York City,Manhattan,7002001,001438,Bellevue Hospital Center,50 to 69,101,F,Black/African American,Not Span/Hispanic,19,Urgent,Inpatient Rehabilitation Facility,2022,CIR020,Cerebral infarction,IMG007,COMPUTERIZED TOMOGRAPHY (CT) WITHOUT CONTRAST,045,CVA AND PRECEREBRAL OCCLUSION WITH INFARCTION,01,DISEASES AND DISORDERS OF THE NERVOUS SYSTEM,3,Major,Moderate,Medical,Medicaid,,,,,N,158101.37,90921.57
New York City,Manhattan,7002001,001438,Bellevue Hospital Center,70 or Older,112,M,Other Race,Spanish/Hispanic,1,Emergency,Home or Self Care,2022,CIR020,Cerebral infarction,IMG008,ULTRASONOGRAPHY,045,CVA AND PRECEREBRAL OCCLUSION WITH INFARCTION,01,DISEASES AND DISORDERS OF THE NERVOUS SYSTEM,2,Moderate,Minor,Medical,Medicare,Medicaid,,,,Y,26677.10,15341.57
New York City,Manhattan,7002001,001438,Bellevue Hospital Center,30 to 49,104,M,Other Race,Spanish/Hispanic,1,Emergency,Home w/ Home Health Services,2022,CIR020,Cerebral infarction,IMG008,ULTRASONOGRAPHY,045,CVA AND PRECEREBRAL OCCLUSION WITH INFARCTION,01,DISEASES AND DISORDERS OF THE NERVOUS SYSTEM,1,Minor,Minor,Medical,Medicaid,,,,,Y,22243.68,12791.98
New York City,Manhattan,7002001,001438,Bellevue Hospital Center,70 or Older,112,F,Other Race,Not Span/Hispanic,2,Urgent,Short-term Hospital,2022,CIR020,Cerebral infarction,IMG007,COMPUTERIZED TOMOGRAPHY (CT) WITHOUT CONTRAST,045,CVA AND PRECEREBRAL OCCLUSION WITH INFARCTION,01,DISEASES AND DISORDERS OF THE NERVOUS SYSTEM,3,Major,Major,Medical,Medicare,Medicaid,,,,N,24137.12,13880.87
New York City,Manhattan,7002001,001438,Bellevue Hospital Center,50 to 69,112,M,Black/African American,Not Span/Hispanic,8,Emergency,Inpatient Rehabilitation Facility,2022,CIR020,Cerebral infarction,IMG006,COMPUTERIZED TOMOGRAPHY (CT) WITH CONTRAST,045,CVA AND PRECEREBRAL OCCLUSION WITH INFARCTION,01,DISEASES AND DISORDERS OF THE NERVOUS SYSTEM,4,Extreme,Major,Medical,Private Health Insurance,Medicaid,,,,Y,90093.35,51811.24
New York City,Manhattan,7002054,001464,New York-Presbyterian Hospital - Columbia Presbyterian Center,50 to 69,104,F,Other Race,Spanish/Hispanic,1,Emergency,Home or Self Care,2022,CIR020,Cerebral infarction,,,045,CVA AND PRECEREBRAL OCCLUSION WITH INFARCTION,01,DISEASES AND DISORDERS OF THE NERVOUS SYSTEM,3,Major,Moderate,Medical,Private Health Insurance,,,,,Y,34979.97,7221.93
New York City,Manhattan,7002054,001464,New York-Presbyterian Hospital - Columbia Presbyterian Center,30 to 49,100,M,Other Race,Spanish/Hispanic,17,Emergency,Home or Self Care,2022,CIR020,Cerebral infarction,ADM005,ADMINISTRATION OF THROMBOLYTICS AND PLATELET INHIBITORS,045,CVA AND PRECEREBRAL OCCLUSION WITH INFARCTION,01,DISEASES AND DISORDERS OF THE NERVOUS SYSTEM,3,Major,Extreme,Medical,Medicaid,,,,,Y,332804.06,87579.75
New York City,Manhattan,7002054,001464,New York-Presbyterian Hospital - Columbia Presbyterian Center,70 or Older,100,F,Other Race,Unknown,10,Emergency,Inpatient Rehabilitation Facility,2022,CIR020,Cerebral infarction,OTR004,ISOLATION PROCEDURES,045,CVA AND PRECEREBRAL OCCLUSION WITH INFARCTION,01,DISEASES AND DISORDERS OF THE NERVOUS SYSTEM,3,Major,Major,Medical,Medicare,,,,,Y,167813.71,36490.33
New York City,Manhattan,7002053,001463,NYU Langone Hospitals,50 to 69,100,M,Black/African American,Not Span/Hispanic,1,Emergency,Home or Self Care,2022,CIR020,Cerebral infarction,,,045,CVA AND PRECEREBRAL OCCLUSION WITH INFARCTION,01,DISEASES AND DISORDERS OF THE NERVOUS SYSTEM,1,Minor,Moderate,Medical,Blue Cross/Blue Shield,,,,,Y,58348.72,9941.75
New York City,Manhattan,7002053,001463,NYU Langone Hospitals,30 to 49,112,F,Black/African American,Not Span/Hispanic,1,Emergency,Home or Self Care,2022,CIR020,Cerebral infarction,IMG008,ULTRASONOGRAPHY,045,CVA AND PRECEREBRAL OCCLUSION WITH INFARCTION,01,DISEASES AND DISORDERS OF THE NERVOUS SYSTEM,3,Major,Moderate,Medical,Medicaid,,,,,Y,50221.26,13382.69
New York City,Manhattan,7002053,001463,NYU Langone Hospitals,50 to 69,112,F,Black/African American,Not Span/Hispanic,1,Emergency,Home w/ Home Health Services,2022,CIR020,Cerebral infarction,,,045,CVA AND PRECEREBRAL OCCLUSION WITH INFARCTION,01,DISEASES AND DISORDERS OF THE NERVOUS SYSTEM,2,Moderate,Moderate,Medical,Medicare,Medicaid,,,,Y,61592.20,12843.81
New York City,Manhattan,7002054,001464,New York-Presbyterian Hospital - Columbia Presbyterian Center,70 or Older,104,F,Other Race,Spanish/Hispanic,7,Emergency,Home w/ Home Health Services,2022,CIR020,Cerebral infarction,,,045,CVA AND PRECEREBRAL OCCLUSION WITH INFARCTION,01,DISEASES AND DISORDERS OF THE NERVOUS SYSTEM,3,Major,Moderate,Medical,Medicare,Medicaid,,,,Y,107609.00,23912.51
New York City,Manhattan,7002054,001464,New York-Presbyterian Hospital - Columbia Presbyterian Center,50 to 69,100,M,Other Race,Spanish/Hispanic,3,Emergency,Home or Self Care,2022,CIR020,Cerebral infarction,,,045,CVA AND PRECEREBRAL OCCLUSION WITH INFARCTION,01,DISEASES AND DISORDERS OF THE NERVOUS SYSTEM,3,Major,Moderate,Medical,Medicare,Medicaid,,,,Y,50524.17,11308.20
New York City,Manhattan,7002054,001464,New York-Presbyterian Hospital - Columbia Presbyterian Center,70 or Older,100,M,Other Race,Spanish/Hispanic,8,Emergency,Inpatient Rehabilitation Facility,2022,CIR020,Cerebral infarction,MST028,"SUBCUTANEOUS TISSUE AND FASCIA PROCEDURES, NEC",045,CVA AND PRECEREBRAL OCCLUSION WITH INFARCTION,01,DISEASES AND DISORDERS OF THE NERVOUS SYSTEM,3,Major,Moderate,Medical,Medicaid,,,,,Y,146923.20,36851.60
New York City,Manhattan,7002001,001438,Bellevue Hospital Center,50 to 69,114,F,White,Unknown,3,Emergency,Home w/ Home Health Services,2022,CIR020,Cerebral infarction,ADM005,ADMINISTRATION OF THROMBOLYTICS AND PLATELET INHIBITORS,045,CVA AND PRECEREBRAL OCCLUSION WITH INFARCTION,01,DISEASES AND DISORDERS OF THE NERVOUS SYSTEM,3,Major,Minor,Medical,Private Health Insurance,,,,,Y,58677.00,33744.20
New York City,Manhattan,7002001,001438,Bellevue Hospital Center,70 or Older,112,F,Other Race,Not Span/Hispanic,2,Urgent,Home w/ Home Health Services,2022,CIR020,Cerebral infarction,IMG007,COMPUTERIZED TOMOGRAPHY (CT) WITHOUT CONTRAST,045,CVA AND PRECEREBRAL OCCLUSION WITH INFARCTION,01,DISEASES AND DISORDERS OF THE NERVOUS SYSTEM,2,Moderate,Moderate,Medical,Medicare,Medicaid,,,,N,17900.07,10294.04
New York City,Manhattan,7002054,001464,New York-Presbyterian Hospital - Columbia Presbyterian Center,50 to 69,100,F,Other Race,Spanish/Hispanic,1,Emergency,Home or Self Care,2022,CIR020,Cerebral infarction,,,045,CVA AND PRECEREBRAL OCCLUSION WITH INFARCTION,01,DISEASES AND DISORDERS OF THE NERVOUS SYSTEM,1,Minor,Minor,Medical,Medicaid,,,,,Y,26974.76,5849.11
New York City,Manhattan,7002053,001463,NYU Langone Hospitals,70 or Older,100,M,Other Race,Not Span/Hispanic,1,Emergency,Inpatient Rehabilitation Facility,2022,CIR020,Cerebral infarction,,,045,CVA AND PRECEREBRAL OCCLUSION WITH INFARCTION,01,DISEASES AND DISORDERS OF THE NERVOUS SYSTEM,2,Moderate,Moderate,Medical,Medicare,Medicare,,,,Y,64263.02,10848.44
New York City,Manhattan,7002053,001463,NYU Langone Hospitals,50 to 69,109,M,White,Not Span/Hispanic,1,Emergency,Home or Self Care,2022,CIR020,Cerebral infarction,OTR004,ISOLATION PROCEDURES,045,CVA AND PRECEREBRAL OCCLUSION WITH INFARCTION,01,DISEASES AND DISORDERS OF THE NERVOUS SYSTEM,3,Major,Major,Medical,Medicare,Medicaid,,,,Y,46069.05,7795.49
New York City,Manhattan,7002053,001463,NYU Langone Hospitals,30 to 49,112,M,Other Race,Unknown,2,Emergency,Home or Self Care,2022,CIR020,Cerebral infarction,,,045,CVA AND PRECEREBRAL OCCLUSION WITH INFARCTION,01,DISEASES AND DISORDERS OF THE NERVOUS SYSTEM,2,Moderate,Moderate,Medical,Medicaid,,,,,Y,61139.19,12802.19
New York City,Manhattan,7002053,001463,NYU Langone Hospitals,50 to 69,112,M,Black/African American,Not Span/Hispanic,1,Urgent,Inpatient Rehabilitation Facility,2022,CIR020,Cerebral infarction,,,045,CVA AND PRECEREBRAL OCCLUSION WITH INFARCTION,01,DISEASES AND DISORDERS OF THE NERVOUS SYSTEM,2,Moderate,Minor,Medical,Medicare,Blue Cross/Blue Shield,,,,N,19868.61,5859.63
New York City,Manhattan,7002054,001464,New York-Presbyterian Hospital - Columbia Presbyterian Center,70 or Older,100,M,White,Spanish/Hispanic,31,Emergency,Inpatient Rehabilitation Facility,2022,CIR020,Cerebral infarction,ESA003,MECHANICAL VENTILATION,045,CVA AND PRECEREBRAL OCCLUSION WITH INFARCTION,01,DISEASES AND DISORDERS OF THE NERVOUS SYSTEM,4,Extreme,Extreme,Medical,Medicare,,,,,Y,703671.74,255705.01
New York City,Manhattan,7002001,001438,Bellevue Hospital Center,50 to 69,100,M,Black/African American,Unknown,2,Emergency,Home or Self Care,2022,CIR020,Cerebral infarction,ADM021,"ADMINISTRATION OF THERAPEUTIC SUBSTANCES, NEC",045,CVA AND PRECEREBRAL OCCLUSION WITH INFARCTION,01,DISEASES AND DISORDERS OF THE NERVOUS SYSTEM,2,Moderate,Minor,Medical,Medicaid,,,,,Y,28332.65,16293.65
New York City,Manhattan,7002054,001464,New York-Presbyterian Hospital - Columbia Presbyterian Center,70 or Older,100,F,Black/African American,Not Span/Hispanic,7,Emergency,Home w/ Home Health Services,2022,CIR020,Cerebral infarction,,,045,CVA AND PRECEREBRAL OCCLUSION WITH INFARCTION,01,DISEASES AND DISORDERS OF THE NERVOUS SYSTEM,3,Major,Major,Medical,Medicaid,,,,,Y,121083.97,26461.15
New York City,Manhattan,7002001,001438,Bellevue Hospital Center,70 or Older,112,F,White,Not Span/Hispanic,6,Emergency,Hospice - Home,2022,CIR020,Cerebral infarction,ADM015,ADMINISTRATION OF ANTIBIOTICS,045,CVA AND PRECEREBRAL OCCLUSION WITH INFARCTION,01,DISEASES AND DISORDERS OF THE NERVOUS SYSTEM,3,Major,Major,Medical,Medicare,Medicaid,,,,Y,51097.10,29385.12
Finger Lakes,Monroe,2701005,000413,Strong Memorial Hospital,70 or Older,145,F,White,Not Span/Hispanic,1,Emergency,Expired,2022,CIR020,Cerebral infarction,,,045,CVA AND PRECEREBRAL OCCLUSION WITH INFARCTION,01,DISEASES AND DISORDERS OF THE NERVOUS SYSTEM,3,Major,Major,Medical,Medicare,Blue Cross/Blue Shield,,,,Y,8241.29,2407.91
Finger Lakes,Monroe,2701005,000413,Strong Memorial Hospital,70 or Older,145,M,White,Not Span/Hispanic,1,Emergency,Home or Self Care,2022,CIR020,Cerebral infarction,,,045,CVA AND PRECEREBRAL OCCLUSION WITH INFARCTION,01,DISEASES AND DISORDERS OF THE NERVOUS SYSTEM,2,Moderate,Minor,Medical,Medicare,,,,,Y,12497.43,4136.63
Finger Lakes,Monroe,2701005,000413,Strong Memorial Hospital,50 to 69,145,M,Other Race,Unknown,16,Emergency,Skilled Nursing Home,2022,CIR020,Cerebral infarction,ADM019,POTENTIAL COVID-19 THERAPIES,045,CVA AND PRECEREBRAL OCCLUSION WITH INFARCTION,01,DISEASES AND DISORDERS OF THE NERVOUS SYSTEM,4,Extreme,Extreme,Medical,Medicare,Medicaid,,,,Y,68491.29,31375.89
Finger Lakes,Monroe,2701005,000413,Strong Memorial Hospital,70 or Older,145,F,White,Not Span/Hispanic,2,Emergency,Skilled Nursing Home,2022,CIR020,Cerebral infarction,ADM005,ADMINISTRATION OF THROMBOLYTICS AND PLATELET INHIBITORS,045,CVA AND PRECEREBRAL OCCLUSION WITH INFARCTION,01,DISEASES AND DISORDERS OF THE NERVOUS SYSTEM,2,Moderate,Moderate,Medical,Medicare,,,,,Y,37604.96,14749.58
Finger Lakes,Monroe,2701005,000413,Strong Memorial Hospital,50 to 69,146,M,Black/African American,Not Span/Hispanic,11,Emergency,Home or Self Care,2022,CIR020,Cerebral infarction,,,045,CVA AND PRECEREBRAL OCCLUSION WITH INFARCTION,01,DISEASES AND DISORDERS OF THE NERVOUS SYSTEM,2,Moderate,Moderate,Medical,Medicare,Medicaid,,,,Y,34431.80,16794.00
Finger Lakes,Monroe,2701005,000413,Strong Memorial Hospital,50 to 69,146,F,Black/African American,Not Span/Hispanic,1,Emergency,Home or Self Care,2022,CIR020,Cerebral infarction,,,045,CVA AND PRECEREBRAL OCCLUSION WITH INFARCTION,01,DISEASES AND DISORDERS OF THE NERVOUS SYSTEM,2,Moderate,Minor,Medical,Medicare,Medicaid,,,,Y,20792.12,5533.90
Finger Lakes,Monroe,2701005,000413,Strong Memorial Hospital,30 to 49,146,M,Black/African American,Unknown,1,Emergency,Left Against Medical Advice,2022,CIR020,Cerebral infarction,,,045,CVA AND PRECEREBRAL OCCLUSION WITH INFARCTION,01,DISEASES AND DISORDERS OF THE NERVOUS SYSTEM,2,Moderate,Minor,Medical,Self-Pay,,,,,Y,9167.46,2467.17
Finger Lakes,Monroe,2701005,000413,Strong Memorial Hospital,30 to 49,144,M,White,Not Span/Hispanic,2,Emergency,Hospice - Home,2022,CIR020,Cerebral infarction,,,045,CVA AND PRECEREBRAL OCCLUSION WITH INFARCTION,01,DISEASES AND DISORDERS OF THE NERVOUS SYSTEM,3,Major,Major,Medical,Medicaid,,,,,Y,12816.27,5778.64
Finger Lakes,Monroe,2701005,000413,Strong Memorial Hospital,70 or Older,145,F,White,Not Span/Hispanic,10,Emergency,Skilled Nursing Home,2022,CIR020,Cerebral infarction,,,045,CVA AND PRECEREBRAL OCCLUSION WITH INFARCTION,01,DISEASES AND DISORDERS OF THE NERVOUS SYSTEM,4,Extreme,Extreme,Medical,Medicare,Blue Cross/Blue Shield,,,,Y,42390.63,16952.35
Finger Lakes,Monroe,2701005,000413,Strong Memorial Hospital,70 or Older,146,F,White,Not Span/Hispanic,6,Emergency,Expired,2022,CIR020,Cerebral infarction,ADM005,ADMINISTRATION OF THROMBOLYTICS AND PLATELET INHIBITORS,045,CVA AND PRECEREBRAL OCCLUSION WITH INFARCTION,01,DISEASES AND DISORDERS OF THE NERVOUS SYSTEM,3,Major,Extreme,Medical,Medicare,,,,,Y,44341.24,18403.58
Finger Lakes,Monroe,2701005,000413,Strong Memorial Hospital,70 or Older,144,F,White,Not Span/Hispanic,1,Emergency,Home or Self Care,2022,CIR020,Cerebral infarction,,,045,CVA AND PRECEREBRAL OCCLUSION WITH INFARCTION,01,DISEASES AND DISORDERS OF THE NERVOUS SYSTEM,2,Moderate,Moderate,Medical,Medicare,,,,,Y,14914.87,4428.55
Finger Lakes,Monroe,2701005,000413,Strong Memorial Hospital,70 or Older,131,F,Other Race,Not Span/Hispanic,8,Emergency,Home w/ Home Health Services,2022,CIR020,Cerebral infarction,IMG002,FLUOROSCOPIC ANGIOGRAPHY (EXCLUDING CORONARY),045,CVA AND PRECEREBRAL OCCLUSION WITH INFARCTION,01,DISEASES AND DISORDERS OF THE NERVOUS SYSTEM,2,Moderate,Moderate,Medical,Medicare,,,,,Y,41043.30,19448.94