Hospital Service Area,Hospital County,Operating Certificate Number,Permanent Facility Id,Facility Name,Age Group,Zip Code - 3 digits,Gender,Race,Ethnicity,Length of Stay,Type of Admission,Patient Disposition,Discharge Year,CCS Diagnosis Code,CCS Diagnosis Description,CCS Procedure Code,CCS Procedure Description,APR DRG Code,APR DRG Description,APR MDC Code,APR MDC Description,APR Severity of Illness Code,APR Severity of Illness Description,APR Risk of Mortality,APR Medical Surgical Description,Payment Typology 1,Payment Typology 2,Payment Typology 3,Birth Weight,Abortion Edit Indicator,Emergency Department Indicator,Total Charges,Total Costs
New York City,Manhattan,7002001,001438,Bellevue Hospital Center,50 to 69,100,M,Multi-racial,Not Span/Hispanic,13,Emergency,Skilled Nursing Home,2022,NEO043,Urinary system cancers - bladder,RES003,THORACENTESIS (DIAGNOSTIC),461,KIDNEY AND URINARY TRACT MALIGNANCY,11,DISEASES AND DISORDERS OF THE KIDNEY AND URINARY TRACT,4,Extreme,Extreme,Medical,Medicaid,,,,,Y,115806.05,66598.21
New York City,Manhattan,7002054,001464,New York-Presbyterian Hospital - Columbia Presbyterian Center,50 to 69,104,F,Black/African American,Not Span/Hispanic,2,Urgent,Skilled Nursing Home,2022,NEO043,Urinary system cancers - bladder,ADM001,TRANSFUSION OF BLOOD AND BLOOD PRODUCTS,461,KIDNEY AND URINARY TRACT MALIGNANCY,11,DISEASES AND DISORDERS OF THE KIDNEY AND URINARY TRACT,3,Major,Major,Medical,Medicare,Medicaid,,,,Y,40385.28,8388.87
New York City,Manhattan,7002053,001463,NYU Langone Hospitals,70 or Older,112,M,White,Not Span/Hispanic,1,Elective,Home or Self Care,2022,NEO043,Urinary system cancers - bladder,,,461,KIDNEY AND URINARY TRACT MALIGNANCY,11,DISEASES AND DISORDERS OF THE KIDNEY AND URINARY TRACT,2,Moderate,Moderate,Medical,Medicare,Medicare,,,,N,72352.90,13280.28
New York City,Manhattan,7002053,001463,NYU Langone Hospitals,70 or Older,100,F,Black/African American,Not Span/Hispanic,9,Emergency,Skilled Nursing Home,2022,NEO043,Urinary system cancers - bladder,ADM018,IRRIGATION (DIAGNOSTIC AND THERAPEUTIC),461,KIDNEY AND URINARY TRACT MALIGNANCY,11,DISEASES AND DISORDERS OF THE KIDNEY AND URINARY TRACT,3,Major,Major,Medical,Medicare,,,,,Y,164600.88,46121.52
New York City,Manhattan,7002054,001464,New York-Presbyterian Hospital - Columbia Presbyterian Center,70 or Older,100,M,Other Race,Spanish/Hispanic,4,Emergency,Home w/ Home Health Services,2022,NEO043,Urinary system cancers - bladder,,,461,KIDNEY AND URINARY TRACT MALIGNANCY,11,DISEASES AND DISORDERS OF THE KIDNEY AND URINARY TRACT,3,Major,Major,Medical,Medicare,,,,,Y,60816.48,12794.17
New York City,Manhattan,7002001,001438,Bellevue Hospital Center,30 to 49,114,M,Multi-racial,Unknown,1,Emergency,Home or Self Care,2022,NEO045,Urinary system cancers - kidney,MAM008,CARDIAC MONITORING,461,KIDNEY AND URINARY TRACT MALIGNANCY,11,DISEASES AND DISORDERS OF THE KIDNEY AND URINARY TRACT,3,Major,Major,Medical,Medicaid,,,,,Y,34589.11,19891.64
New York City,Manhattan,7002001,001438,Bellevue Hospital Center,70 or Older,114,F,White,Unknown,2,Emergency,Home or Self Care,2022,NEO043,Urinary system cancers - bladder,IMG007,COMPUTERIZED TOMOGRAPHY (CT) WITHOUT CONTRAST,461,KIDNEY AND URINARY TRACT MALIGNANCY,11,DISEASES AND DISORDERS OF THE KIDNEY AND URINARY TRACT,2,Moderate,Moderate,Medical,Medicare,Medicaid,,,,Y,18840.18,10834.69
Finger Lakes,Monroe,2701005,000413,Strong Memorial Hospital,70 or Older,145,M,White,Not Span/Hispanic,16,Emergency,Expired,2022,NEO045,Urinary system cancers - kidney,RES005,CHEST TUBE PLACEMENT AND THERAPEUTIC THORACENTESIS,461,KIDNEY AND URINARY TRACT MALIGNANCY,11,DISEASES AND DISORDERS OF THE KIDNEY AND URINARY TRACT,4,Extreme,Extreme,Medical,Medicare,Private Health Insurance,,,,Y,80892.13,33332.27
Finger Lakes,Monroe,2701005,000413,Strong Memorial Hospital,70 or Older,146,F,White,Not Span/Hispanic,15,Urgent,Hospice - Medical Facility,2022,NEO043,Urinary system cancers - bladder,,,461,KIDNEY AND URINARY TRACT MALIGNANCY,11,DISEASES AND DISORDERS OF THE KIDNEY AND URINARY TRACT,3,Major,Minor,Medical,Medicare,,,,,N,64822.50,24967.13
New York City,Manhattan,7002054,001464,New York-Presbyterian Hospital - Columbia Presbyterian Center,70 or Older,100,M,Other Race,Spanish/Hispanic,4,Emergency,Skilled Nursing Home,2022,NEO043,Urinary system cancers - bladder,ADM017,ADMINISTRATION OF NUTRITIONAL AND ELECTROLYTIC SUBSTANCES,461,KIDNEY AND URINARY TRACT MALIGNANCY,11,DISEASES AND DISORDERS OF THE KIDNEY AND URINARY TRACT,3,Major,Moderate,Medical,Medicare,,,,,Y,59397.68,12978.30
Long Island,Nassau,2951001,000541,North Shore University Hospital,70 or Older,113,F,Other Race,Not Span/Hispanic,1,Urgent,Home or Self Care,2022,NEO043,Urinary system cancers - bladder,ENT002,ENT DIAGNOSTIC ENDOSCOPY (EXCLUDING LARYNGOSCOPY),461,KIDNEY AND URINARY TRACT MALIGNANCY,11,DISEASES AND DISORDERS OF THE KIDNEY AND URINARY TRACT,2,Moderate,Minor,Medical,Private Health Insurance,,,,,N,45253.46,7301.43
Long Island,Nassau,2951001,000541,North Shore University Hospital,50 to 69,110,M,White,Not Span/Hispanic,21,Emergency,Expired,2022,NEO045,Urinary system cancers - kidney,ADM019,POTENTIAL COVID-19 THERAPIES,461,KIDNEY AND URINARY TRACT MALIGNANCY,11,DISEASES AND DISORDERS OF THE KIDNEY AND URINARY TRACT,4,Extreme,Extreme,Medical,Private Health Insurance,Medicare,,,,Y,399698.63,63926.19
New York City,Manhattan,7002054,001464,New York-Presbyterian Hospital - Columbia Presbyterian Center,70 or Older,104,M,Other Race,Spanish/Hispanic,2,Emergency,Home or Self Care,2022,NEO043,Urinary system cancers - bladder,ADM015,ADMINISTRATION OF ANTIBIOTICS,461,KIDNEY AND URINARY TRACT MALIGNANCY,11,DISEASES AND DISORDERS OF THE KIDNEY AND URINARY TRACT,2,Moderate,Moderate,Medical,Medicare,Medicaid,,,,Y,61665.57,13844.73
Capital/Adirond,Warren,5601000,001005,Glens Falls Hospital,50 to 69,128,M,White,Not Span/Hispanic,9,Urgent,Hospice - Home,2022,NEO070,Secondary malignancies,URN001,CYSTOSCOPY AND URETEROSCOPY (INCLUDING BIOPSY),461,KIDNEY AND URINARY TRACT MALIGNANCY,11,DISEASES AND DISORDERS OF THE KIDNEY AND URINARY TRACT,2,Moderate,Moderate,Medical,Medicare,Private Health Insurance,,,,N,37222.23,12433.97
Hudson Valley,Dutchess,1302001,000181,Vassar Brothers Medical Center,70 or Older,125,M,White,Not Span/Hispanic,3,Emergency,Hospice - Home,2022,NEO045,Urinary system cancers - kidney,,,461,KIDNEY AND URINARY TRACT MALIGNANCY,11,DISEASES AND DISORDERS OF THE KIDNEY AND URINARY TRACT,4,Extreme,Major,Medical,Medicare,Private Health Insurance,,,,Y,26223.86,6654.25
New York City,Manhattan,7002054,001464,New York-Presbyterian Hospital - Columbia Presbyterian Center,30 to 49,OOS,M,White,Not Span/Hispanic,3,Emergency,Home or Self Care,2022,NEO046,Urinary system cancers - urethra,ADM001,TRANSFUSION OF BLOOD AND BLOOD PRODUCTS,461,KIDNEY AND URINARY TRACT MALIGNANCY,11,DISEASES AND DISORDERS OF THE KIDNEY AND URINARY TRACT,2,Moderate,Moderate,Medical,Private Health Insurance,Blue Cross/Blue Shield,,,,Y,65915.12,13838.70
New York City,Manhattan,7002054,001464,New York-Presbyterian Hospital - Columbia Presbyterian Center,70 or Older,100,M,Other Race,Spanish/Hispanic,3,Emergency,Hospice - Medical Facility,2022,NEO047,Urinary system cancers - all other types,,,461,KIDNEY AND URINARY TRACT MALIGNANCY,11,DISEASES AND DISORDERS OF THE KIDNEY AND URINARY TRACT,3,Major,Major,Medical,Medicare,,,,,Y,43880.35,9190.75
Finger Lakes,Monroe,2701005,000413,Strong Memorial Hospital,70 or Older,144,M,White,Not Span/Hispanic,7,Emergency,Skilled Nursing Home,2022,NEO045,Urinary system cancers - kidney,SKB001,SKIN BIOPSY AND DIAGNOSTIC DRAINAGE,461,KIDNEY AND URINARY TRACT MALIGNANCY,11,DISEASES AND DISORDERS OF THE KIDNEY AND URINARY TRACT,2,Moderate,Major,Medical,Medicare,,,,,Y,29656.08,11393.95
Finger Lakes,Monroe,2701005,000413,Strong Memorial Hospital,70 or Older,146,M,White,Not Span/Hispanic,4,Emergency,Expired,2022,NEO043,Urinary system cancers - bladder,,,461,KIDNEY AND URINARY TRACT MALIGNANCY,11,DISEASES AND DISORDERS OF THE KIDNEY AND URINARY TRACT,2,Moderate,Major,Medical,Medicare,Blue Cross/Blue Shield,,,,Y,15697.23,6777.35
Finger Lakes,Monroe,2701005,000413,Strong Memorial Hospital,50 to 69,145,M,White,Not Span/Hispanic,1,Elective,Home or Self Care,2022,NEO045,Urinary system cancers - kidney,URN002,KIDNEY AND OTHER URINARY TRACT BIOPSY (NON-ENDOSCOPIC),461,KIDNEY AND URINARY TRACT MALIGNANCY,11,DISEASES AND DISORDERS OF THE KIDNEY AND URINARY TRACT,1,Minor,Moderate,Medical,Medicare,,,,,N,38841.29,18072.10
Finger Lakes,Monroe,2701005,000413,Strong Memorial Hospital,70 or Older,135,M,White,Not Span/Hispanic,37,Urgent,Hospice - Medical Facility,2022,NEO043,Urinary system cancers - bladder,MST002,BONE AND JOINT BIOPSY,461,KIDNEY AND URINARY TRACT MALIGNANCY,11,DISEASES AND DISORDERS OF THE KIDNEY AND URINARY TRACT,4,Extreme,Extreme,Medical,Medicare,,,,,N,130179.06,58342.81
Finger Lakes,Monroe,2701005,000413,Strong Memorial Hospital,70 or Older,144,F,White,Not Span/Hispanic,17,Emergency,Home w/ Home Health Services,2022,NEO047,Urinary system cancers - all other types,HEP003,DIAGNOSTIC ERCP WITH OR WITHOUT BIOPSY,461,KIDNEY AND URINARY TRACT MALIGNANCY,11,DISEASES AND DISORDERS OF THE KIDNEY AND URINARY TRACT,4,Extreme,Extreme,Medical,Medicare,,,,,Y,93745.45,37701.09
Long Island,Nassau,2951001,000541,North Shore University Hospital,50 to 69,113,F,Other Race,Spanish/Hispanic,6,Emergency,Home or Self Care,2022,NEO045,Urinary system cancers - kidney,URN002,KIDNEY AND OTHER URINARY TRACT BIOPSY (NON-ENDOSCOPIC),461,KIDNEY AND URINARY TRACT MALIGNANCY,11,DISEASES AND DISORDERS OF THE KIDNEY AND URINARY TRACT,3,Major,Major,Medical,Blue Cross/Blue Shield,,,,,Y,114076.01,16280.77
New York City,Manhattan,7002001,001438,Bellevue Hospital Center,50 to 69,104,M,Black/African American,Unknown,6,Urgent,Home or Self Care,2022,NEO043,Urinary system cancers - bladder,ADM021,"ADMINISTRATION OF THERAPEUTIC SUBSTANCES, NEC",461,KIDNEY AND URINARY TRACT MALIGNANCY,11,DISEASES AND DISORDERS OF THE KIDNEY AND URINARY TRACT,3,Major,Major,Medical,Private Health Insurance,Medicare,Medicaid,,,N,55077.27,31674.06
New York City,Manhattan,7002054,001464,New York-Presbyterian Hospital - Columbia Presbyterian Center,70 or Older,100,F,White,Spanish/Hispanic,34,Emergency,Hospice - Medical Facility,2022,NEO045,Urinary system cancers - kidney,RAD004,"RADIATION THERAPY, NEC",461,KIDNEY AND URINARY TRACT MALIGNANCY,11,DISEASES AND DISORDERS OF THE KIDNEY AND URINARY TRACT,4,Extreme,Extreme,Medical,Medicare,,,,,Y,581216.97,119983.49
Finger Lakes,Monroe,2701005,000413,Strong Memorial Hospital,70 or Older,146,M,White,Not Span/Hispanic,2,Urgent,Home or Self Care,2022,NEO047,Urinary system cancers - all other types,RES002,"LUNG, PLEURA, OR DIAPHRAGM BIOPSY (NON-ENDOSCOPIC)",461,KIDNEY AND URINARY TRACT MALIGNANCY,11,DISEASES AND DISORDERS OF THE KIDNEY AND URINARY TRACT,2,Moderate,Minor,Medical,Medicare,,,,,N,23294.88,8388.98
Capital/Adirond,Warren,5601000,001005,Glens Falls Hospital,70 or Older,128,M,White,Not Span/Hispanic,8,Emergency,Home w/ Home Health Services,2022,NEO043,Urinary system cancers - bladder,ADM001,TRANSFUSION OF BLOOD AND BLOOD PRODUCTS,461,KIDNEY AND URINARY TRACT MALIGNANCY,11,DISEASES AND DISORDERS OF THE KIDNEY AND URINARY TRACT,3,Major,Major,Medical,Medicare,,,,,Y,31747.34,13606.81
New York City,Manhattan,7002054,001464,New York-Presbyterian Hospital - Columbia Presbyterian Center,70 or Older,104,M,Other Race,Unknown,8,Emergency,Skilled Nursing Home,2022,NEO045,Urinary system cancers - kidney,CAR024,VENOUS AND ARTERIAL CATHETER PLACEMENT,461,KIDNEY AND URINARY TRACT MALIGNANCY,11,DISEASES AND DISORDERS OF THE KIDNEY AND URINARY TRACT,4,Extreme,Major,Medical,Medicare,Medicaid,,,,Y,131061.81,28934.96
Long Island,Nassau,2951001,000541,North Shore University Hospital,50 to 69,117,M,White,Not Span/Hispanic,4,Urgent,Home w/ Home Health Services,2022,NEO045,Urinary system cancers - kidney,URN003,URETER AND OTHER URINARY TRACT DILATION,461,KIDNEY AND URINARY TRACT MALIGNANCY,11,DISEASES AND DISORDERS OF THE KIDNEY AND URINARY TRACT,2,Moderate,Minor,Medical,Medicare,Private Health Insurance,,,,N,92913.83,15870.80
New York City,Manhattan,7002001,001438,Bellevue Hospital Center,50 to 69,114,F,Other Race,Unknown,7,Emergency,Home or Self Care,2022,NEO045,Urinary system cancers - kidney,URN002,KIDNEY AND OTHER URINARY TRACT BIOPSY (NON-ENDOSCOPIC),461,KIDNEY AND URINARY TRACT MALIGNANCY,11,DISEASES AND DISORDERS OF THE KIDNEY AND URINARY TRACT,2,Moderate,Moderate,Medical,Private Health Insurance,,,,,Y,57415.29,33018.61
Western NY,Cattaraugus,0401001,000066,Olean General Hospital,70 or Older,147,F,White,Not Span/Hispanic,11,Emergency,Skilled Nursing Home,2022,NEO043,Urinary system cancers - bladder,URN003,URETER AND OTHER URINARY TRACT DILATION,461,KIDNEY AND URINARY TRACT MALIGNANCY,11,DISEASES AND DISORDERS OF THE KIDNEY AND URINARY TRACT,2,Moderate,Moderate,Medical,Medicare,Medicaid,Federal/State/Local/VA,,,Y,34755.20,14758.80
New York City,Manhattan,7002053,001463,NYU Langone Hospitals,50 to 69,104,M,Black/African American,Not Span/Hispanic,8,Emergency,Home w/ Home Health Services,2022,NEO045,Urinary system cancers - kidney,ENP001,ENDOCRINE SYSTEM BIOPSY,461,KIDNEY AND URINARY TRACT MALIGNANCY,11,DISEASES AND DISORDERS OF THE KIDNEY AND URINARY TRACT,3,Major,Major,Medical,Medicare,Blue Cross/Blue Shield,,,,Y,176959.56,51193.85
New York City,Manhattan,7002001,001438,Bellevue Hospital Center,50 to 69,100,M,Other Race,Unknown,1,Emergency,Home or Self Care,2022,NEO045,Urinary system cancers - kidney,MAM008,CARDIAC MONITORING,461,KIDNEY AND URINARY TRACT MALIGNANCY,11,DISEASES AND DISORDERS OF THE KIDNEY AND URINARY TRACT,3,Major,Major,Medical,Medicaid,,,,,Y,14885.77,8560.57
New York City,Manhattan,7002054,001464,New York-Presbyterian Hospital - Columbia Presbyterian Center,70 or Older,100,F,White,Spanish/Hispanic,10,Emergency,Hospice - Home,2022,NEO043,Urinary system cancers - bladder,ADM001,TRANSFUSION OF BLOOD AND BLOOD PRODUCTS,461,KIDNEY AND URINARY TRACT MALIGNANCY,11,DISEASES AND DISORDERS OF THE KIDNEY AND URINARY TRACT,2,Moderate,Major,Medical,Medicare,Medicaid,,,,Y,144952.73,30287.80
Finger Lakes,Monroe,2701005,000413,Strong Memorial Hospital,70 or Older,146,M,White,Not Span/Hispanic,4,Emergency,Home w/ Home Health Services,2022,NEO045,Urinary system cancers - kidney,,,461,KIDNEY AND URINARY TRACT MALIGNANCY,11,DISEASES AND DISORDERS OF THE KIDNEY AND URINARY TRACT,3,Major,Major,Medical,Medicare,,,,,Y,18699.22,7627.29
New York City,Manhattan,7002054,001464,New York-Presbyterian Hospital - Columbia Presbyterian Center,30 to 49,111,M,White,Not Span/Hispanic,16,Emergency,Home or Self Care,2022,NEO046,Urinary system cancers - urethra,URN005,NEPHROSTOMY AND URETEROSTOMY PROCEDURES (INCLUDING STENTS),461,KIDNEY AND URINARY TRACT MALIGNANCY,11,DISEASES AND DISORDERS OF THE KIDNEY AND URINARY TRACT,3,Major,Major,Medical,Blue Cross/Blue Shield,Private Health Insurance,,,,Y,239009.83,55068.14
Finger Lakes,Monroe,2701005,000413,Strong Memorial Hospital,70 or Older,145,M,White,Not Span/Hispanic,6,Emergency,Home or Self Care,2022,NEO043,Urinary system cancers - bladder,,,461,KIDNEY AND URINARY TRACT MALIGNANCY,11,DISEASES AND DISORDERS OF THE KIDNEY AND URINARY TRACT,2,Moderate,Minor,Medical,Federal/State/Local/VA,,,,,Y,20296.04,9110.95
Finger Lakes,Monroe,2701005,000413,Strong Memorial Hospital,70 or Older,145,M,White,Not Span/Hispanic,7,Emergency,Hospice - Home,2022,NEO045,Urinary system cancers - kidney,,,461,KIDNEY AND URINARY TRACT MALIGNANCY,11,DISEASES AND DISORDERS OF THE KIDNEY AND URINARY TRACT,3,Major,Major,Medical,Federal/State/Local/VA,,,,,Y,21819.82,10319.27
New York City,Manhattan,7002001,001438,Bellevue Hospital Center,70 or Older,100,M,Other Race,Not Span/Hispanic,7,Emergency,Skilled Nursing Home,2022,NEO043,Urinary system cancers - bladder,ADM001,TRANSFUSION OF BLOOD AND BLOOD PRODUCTS,461,KIDNEY AND URINARY TRACT MALIGNANCY,11,DISEASES AND DISORDERS OF THE KIDNEY AND URINARY TRACT,3,Major,Major,Medical,Medicare,Medicaid,,,,Y,52853.65,30395.29
Long Island,Nassau,2951001,000541,North Shore University Hospital,50 to 69,115,F,Black/African American,Not Span/Hispanic,2,Urgent,Home w/ Home Health Services,2022,NEO043,Urinary system cancers - bladder,URN001,CYSTOSCOPY AND URETEROSCOPY (INCLUDING BIOPSY),461,KIDNEY AND URINARY TRACT MALIGNANCY,11,DISEASES AND DISORDERS OF THE KIDNEY AND URINARY TRACT,2,Moderate,Moderate,Medical,Medicaid,Medicaid,,,,N,71967.76,11690.41
New York City,Manhattan,7002054,001464,New York-Presbyterian Hospital - Columbia Presbyterian Center,50 to 69,112,M,Other Race,Spanish/Hispanic,22,Emergency,Expired,2022,NEO047,Urinary system cancers - all other types,RES005,CHEST TUBE PLACEMENT AND THERAPEUTIC THORACENTESIS,461,KIDNEY AND URINARY TRACT MALIGNANCY,11,DISEASES AND DISORDERS OF THE KIDNEY AND URINARY TRACT,4,Extreme,Extreme,Medical,Private Health Insurance,,,,,Y,342022.51,74133.06
New York City,Manhattan,7002054,001464,New York-Presbyterian Hospital - Columbia Presbyterian Center,50 to 69,100,F,Black/African American,Not Span/Hispanic,6,Elective,Home w/ Home Health Services,2022,NEO043,Urinary system cancers - bladder,URN003,URETER AND OTHER URINARY TRACT DILATION,461,KIDNEY AND URINARY TRACT MALIGNANCY,11,DISEASES AND DISORDERS OF THE KIDNEY AND URINARY TRACT,3,Major,Moderate,Medical,Medicare,Medicaid,,,,N,121759.83,31977.38
Hudson Valley,Dutchess,1302001,000181,Vassar Brothers Medical Center,70 or Older,125,M,White,Not Span/Hispanic,3,Emergency,Home or Self Care,2022,NEO043,Urinary system cancers - bladder,ADM001,TRANSFUSION OF BLOOD AND BLOOD PRODUCTS,461,KIDNEY AND URINARY TRACT MALIGNANCY,11,DISEASES AND DISORDERS OF THE KIDNEY AND URINARY TRACT,2,Moderate,Moderate,Medical,Medicare,,,,,Y,19343.29,5952.91
Western NY,Cattaraugus,0401001,000066,Olean General Hospital,70 or Older,OOS,M,White,Not Span/Hispanic,7,Elective,Home w/ Home Health Services,2022,NEO045,Urinary system cancers - kidney,GNR008,"ABDOMINAL WALL PROCEDURES, NEC",461,KIDNEY AND URINARY TRACT MALIGNANCY,11,DISEASES AND DISORDERS OF THE KIDNEY AND URINARY TRACT,3,Major,Major,Medical,Medicare,Self-Pay,,,,Y,19994.28,8155.14
New York City,Manhattan,7002054,001464,New York-Presbyterian Hospital - Columbia Presbyterian Center,50 to 69,100,M,Black/African American,Not Span/Hispanic,16,Emergency,Home or Self Care,2022,NEO070,Secondary malignancies,ADM001,TRANSFUSION OF BLOOD AND BLOOD PRODUCTS,461,KIDNEY AND URINARY TRACT MALIGNANCY,11,DISEASES AND DISORDERS OF THE KIDNEY AND URINARY TRACT,3,Major,Major,Medical,Medicare,Medicaid,,,,Y,278283.31,57747.74
New York City,Manhattan,7002054,001464,New York-Presbyterian Hospital - Columbia Presbyterian Center,50 to 69,100,M,Black/African American,Not Span/Hispanic,1,Emergency,Left Against Medical Advice,2022,NEO044,Urinary system cancers - ureter and renal pelvis,ADM021,"ADMINISTRATION OF THERAPEUTIC SUBSTANCES, NEC",461,KIDNEY AND URINARY TRACT MALIGNANCY,11,DISEASES AND DISORDERS OF THE KIDNEY AND URINARY TRACT,3,Major,Major,Medical,Medicaid,,,,,Y,29672.63,5840.34
Capital/Adirond,Warren,5601000,001005,Glens Falls Hospital,70 or Older,128,M,White,Not Span/Hispanic,3,Emergency,Home or Self Care,2022,NEO045,Urinary system cancers - kidney,URN004,REMOVAL OF CALCULI AND OTHER MATTER FROM URINARY TRACT,461,KIDNEY AND URINARY TRACT MALIGNANCY,11,DISEASES AND DISORDERS OF THE KIDNEY AND URINARY TRACT,2,Moderate,Moderate,Medical,Medicare,,,,,Y,17796.82,4310.09
Capital/Adirond,Warren,5601000,001005,Glens Falls Hospital,70 or Older,128,M,White,Not Span/Hispanic,2,Emergency,Home or Self Care,2022,NEO045,Urinary system cancers - kidney,,,461,KIDNEY AND URINARY TRACT MALIGNANCY,11,DISEASES AND DISORDERS OF THE KIDNEY AND URINARY TRACT,2,Moderate,Minor,Medical,Federal/State/Local/VA,,,,,Y,13742.97,4139.17
Capital/Adirond,Warren,5601000,001005,Glens Falls Hospital,70 or Older,128,F,White,Not Span/Hispanic,5,Emergency,Home w/ Home Health Services,2022,NEO045,Urinary system cancers - kidney,,,461,KIDNEY AND URINARY TRACT MALIGNANCY,11,DISEASES AND DISORDERS OF THE KIDNEY AND URINARY TRACT,2,Moderate,Moderate,Medical,Medicare,Blue Cross/Blue Shield,Federal/State/Local/VA,,,Y,23042.34,12588.49
New York City,Manhattan,7002053,001463,NYU Langone Hospitals,70 or Older,OOS,M,Other Race,Not Span/Hispanic,9,Elective,Home w/ Home Health Services,2022,NEO043,Urinary system cancers - bladder,RHB002,"PHYSICAL, OCCUPATIONAL, AND RESPIRATORY THERAPY TREATMENT",461,KIDNEY AND URINARY TRACT MALIGNANCY,11,DISEASES AND DISORDERS OF THE KIDNEY AND URINARY TRACT,3,Major,Major,Medical,Medicare,,,,,N,102952.43,30492.55
New York City,Manhattan,7002054,001464,New York-Presbyterian Hospital - Columbia Presbyterian Center,70 or Older,105,M,White,Not Span/Hispanic,1,Elective,Home or Self Care,2022,NEO047,Urinary system cancers - all other types,URN003,URETER AND OTHER URINARY TRACT DILATION,461,KIDNEY AND URINARY TRACT MALIGNANCY,11,DISEASES AND DISORDERS OF THE KIDNEY AND URINARY TRACT,2,Moderate,Moderate,Medical,Medicare,,,,,N,35066.64,10454.66
Finger Lakes,Monroe,2701005,000413,Strong Memorial Hospital,50 to 69,145,F,White,Not Span/Hispanic,27,Emergency,Hospice - Medical Facility,2022,NEO045,Urinary system cancers - kidney,CAR017,PERICARDIAL PROCEDURES,461,KIDNEY AND URINARY TRACT MALIGNANCY,11,DISEASES AND DISORDERS OF THE KIDNEY AND URINARY TRACT,4,Extreme,Extreme,Medical,Blue Cross/Blue Shield,,,,,Y,114581.52,54680.26
New York City,Manhattan,7002001,001438,Bellevue Hospital Center,70 or Older,100,M,Other Race,Not Span/Hispanic,22,Emergency,Skilled Nursing Home,2022,NEO043,Urinary system cancers - bladder,URN006,BLADDER CATHETERIZATION AND DRAINAGE,461,KIDNEY AND URINARY TRACT MALIGNANCY,11,DISEASES AND DISORDERS OF THE KIDNEY AND URINARY TRACT,3,Major,Major,Medical,Medicare,Medicaid,,,,Y,184616.32,106169.89
Long Island,Nassau,2951001,000541,North Shore University Hospital,50 to 69,117,F,Other Race,Spanish/Hispanic,5,Emergency,Home or Self Care,2022,NEO045,Urinary system cancers - kidney,,,461,KIDNEY AND URINARY TRACT MALIGNANCY,11,DISEASES AND DISORDERS OF THE KIDNEY AND URINARY TRACT,2,Moderate,Minor,Medical,Medicaid,Medicaid,,,,Y,80163.82,11984.55
New York City,Manhattan,7002001,001438,Bellevue Hospital Center,50 to 69,100,M,Other Race,Unknown,11,Emergency,Home w/ Home Health Services,2022,NEO045,Urinary system cancers - kidney,GIS001,ESOPHAGOGASTRODUODENOSCOPY (EGD) WITH BIOPSY,461,KIDNEY AND URINARY TRACT MALIGNANCY,11,DISEASES AND DISORDERS OF THE KIDNEY AND URINARY TRACT,3,Major,Major,Medical,Medicaid,,,,,Y,85936.17,49420.52
New York City,Manhattan,7002001,001438,Bellevue Hospital Center,70 or Older,100,M,Other Race,Unknown,17,Emergency,Skilled Nursing Home,2022,NEO045,Urinary system cancers - kidney,HEP001,LIVER BIOPSY,461,KIDNEY AND URINARY TRACT MALIGNANCY,11,DISEASES AND DISORDERS OF THE KIDNEY AND URINARY TRACT,3,Major,Major,Medical,Medicare,Medicaid,,,,Y,133452.04,76746.13
New York City,Manhattan,7002001,001438,Bellevue Hospital Center,70 or Older,114,F,Black/African American,Unknown,16,Urgent,Expired,2022,NEO043,Urinary system cancers - bladder,URN005,NEPHROSTOMY AND URETEROSTOMY PROCEDURES (INCLUDING STENTS),461,KIDNEY AND URINARY TRACT MALIGNANCY,11,DISEASES AND DISORDERS OF THE KIDNEY AND URINARY TRACT,4,Extreme,Extreme,Medical,Medicare,,,,,N,267298.78,153719.25
Finger Lakes,Monroe,2701005,000413,Strong Memorial Hospital,70 or Older,144,F,White,Not Span/Hispanic,43,Emergency,Expired,2022,NEO047,Urinary system cancers - all other types,HEP003,DIAGNOSTIC ERCP WITH OR WITHOUT BIOPSY,461,KIDNEY AND URINARY TRACT MALIGNANCY,11,DISEASES AND DISORDERS OF THE KIDNEY AND URINARY TRACT,4,Extreme,Extreme,Medical,Medicare,,,,,Y,206585.77,86906.47