Hospital Service Area,Hospital County,Operating Certificate Number,Permanent Facility Id,Facility Name,Age Group,Zip Code - 3 digits,Gender,Race,Ethnicity,Length of Stay,Type of Admission,Patient Disposition,Discharge Year,CCS Diagnosis Code,CCS Diagnosis Description,CCS Procedure Code,CCS Procedure Description,APR DRG Code,APR DRG Description,APR MDC Code,APR MDC Description,APR Severity of Illness Code,APR Severity of Illness Description,APR Risk of Mortality,APR Medical Surgical Description,Payment Typology 1,Payment Typology 2,Payment Typology 3,Birth Weight,Abortion Edit Indicator,Emergency Department Indicator,Total Charges,Total Costs
New York City,Manhattan,7002054,001464,New York-Presbyterian Hospital - Columbia Presbyterian Center,50 to 69,104,M,Other Race,Unknown,14,Emergency,Skilled Nursing Home,2022,GEN002,Acute and unspecified renal failure,ADM007,INTRAVENOUS INDUCTION OF LABOR,469,ACUTE KIDNEY INJURY,11,DISEASES AND DISORDERS OF THE KIDNEY AND URINARY TRACT,4,Extreme,Extreme,Medical,Medicare,Medicaid,,,,Y,199337.83,42476.16
New York City,Manhattan,7002054,001464,New York-Presbyterian Hospital - Columbia Presbyterian Center,50 to 69,100,F,Other Race,Unknown,6,Emergency,Home w/ Home Health Services,2022,GEN002,Acute and unspecified renal failure,MAM006,PACEMAKER AND DEFIBRILLATOR INTERROGATION,469,ACUTE KIDNEY INJURY,11,DISEASES AND DISORDERS OF THE KIDNEY AND URINARY TRACT,2,Moderate,Major,Medical,Medicare,Medicaid,,,,Y,85010.53,18157.29
New York City,Manhattan,7002054,001464,New York-Presbyterian Hospital - Columbia Presbyterian Center,70 or Older,111,F,Black/African American,Not Span/Hispanic,13,Emergency,Hospice - Medical Facility,2022,GEN002,Acute and unspecified renal failure,ADM017,ADMINISTRATION OF NUTRITIONAL AND ELECTROLYTIC SUBSTANCES,469,ACUTE KIDNEY INJURY,11,DISEASES AND DISORDERS OF THE KIDNEY AND URINARY TRACT,3,Major,Major,Medical,Medicare,,,,,Y,159194.21,34370.69
New York City,Manhattan,7002001,001438,Bellevue Hospital Center,70 or Older,101,M,White,Unknown,3,Emergency,Expired,2022,GEN002,Acute and unspecified renal failure,ESA003,MECHANICAL VENTILATION,469,ACUTE KIDNEY INJURY,11,DISEASES AND DISORDERS OF THE KIDNEY AND URINARY TRACT,4,Extreme,Extreme,Medical,Medicare,,,,,Y,84515.59,48603.56
New York City,Manhattan,7002054,001464,New York-Presbyterian Hospital - Columbia Presbyterian Center,70 or Older,100,M,Black/African American,Spanish/Hispanic,2,Emergency,Expired,2022,GEN002,Acute and unspecified renal failure,ESA001,HEMODIALYSIS,469,ACUTE KIDNEY INJURY,11,DISEASES AND DISORDERS OF THE KIDNEY AND URINARY TRACT,4,Extreme,Extreme,Medical,Medicare,Medicaid,,,,Y,107430.41,38558.50
New York City,Manhattan,7002054,001464,New York-Presbyterian Hospital - Columbia Presbyterian Center,70 or Older,100,F,Black/African American,Not Span/Hispanic,4,Emergency,Home w/ Home Health Services,2022,GEN002,Acute and unspecified renal failure,OTR004,ISOLATION PROCEDURES,469,ACUTE KIDNEY INJURY,11,DISEASES AND DISORDERS OF THE KIDNEY AND URINARY TRACT,3,Major,Major,Medical,Medicare,Medicaid,,,,Y,80804.94,19058.33
New York City,Manhattan,7002054,001464,New York-Presbyterian Hospital - Columbia Presbyterian Center,70 or Older,100,M,Other Race,Spanish/Hispanic,2,Emergency,Home or Self Care,2022,GEN002,Acute and unspecified renal failure,ADM017,ADMINISTRATION OF NUTRITIONAL AND ELECTROLYTIC SUBSTANCES,469,ACUTE KIDNEY INJURY,11,DISEASES AND DISORDERS OF THE KIDNEY AND URINARY TRACT,2,Moderate,Moderate,Medical,Medicare,,,,,Y,38035.17,8487.28
New York City,Manhattan,7002001,001438,Bellevue Hospital Center,70 or Older,100,M,Other Race,Spanish/Hispanic,6,Emergency,Home or Self Care,2022,GEN002,Acute and unspecified renal failure,IMG007,COMPUTERIZED TOMOGRAPHY (CT) WITHOUT CONTRAST,469,ACUTE KIDNEY INJURY,11,DISEASES AND DISORDERS OF THE KIDNEY AND URINARY TRACT,2,Moderate,Moderate,Medical,Medicare,Medicaid,,,,Y,44907.93,25825.83
New York City,Manhattan,7002054,001464,New York-Presbyterian Hospital - Columbia Presbyterian Center,70 or Older,100,F,Other Race,Spanish/Hispanic,3,Emergency,Skilled Nursing Home,2022,GEN002,Acute and unspecified renal failure,PLC001,IMMOBILIZATION BY SPLINT OR OTHER EXTERNAL DEVICE,469,ACUTE KIDNEY INJURY,11,DISEASES AND DISORDERS OF THE KIDNEY AND URINARY TRACT,3,Major,Major,Medical,Medicare,,,,,Y,47254.70,10407.58
New York City,Manhattan,7002001,001438,Bellevue Hospital Center,70 or Older,112,F,Other Race,Spanish/Hispanic,8,Emergency,Home or Self Care,2022,GEN002,Acute and unspecified renal failure,MAM005,MEASUREMENT DURING CARDIAC CATHETERIZATION,469,ACUTE KIDNEY INJURY,11,DISEASES AND DISORDERS OF THE KIDNEY AND URINARY TRACT,3,Major,Major,Medical,Medicare,Medicaid,,,,Y,88876.55,51111.48
New York City,Manhattan,7002001,001438,Bellevue Hospital Center,50 to 69,100,M,Black/African American,Not Span/Hispanic,7,Emergency,Home or Self Care,2022,GEN002,Acute and unspecified renal failure,ADM021,"ADMINISTRATION OF THERAPEUTIC SUBSTANCES, NEC",469,ACUTE KIDNEY INJURY,11,DISEASES AND DISORDERS OF THE KIDNEY AND URINARY TRACT,3,Major,Major,Medical,Medicaid,,,,,Y,52562.03,30227.58
New York City,Manhattan,7002054,001464,New York-Presbyterian Hospital - Columbia Presbyterian Center,50 to 69,100,M,Black/African American,Spanish/Hispanic,4,Emergency,Home or Self Care,2022,GEN002,Acute and unspecified renal failure,ADM017,ADMINISTRATION OF NUTRITIONAL AND ELECTROLYTIC SUBSTANCES,469,ACUTE KIDNEY INJURY,11,DISEASES AND DISORDERS OF THE KIDNEY AND URINARY TRACT,3,Major,Major,Medical,Medicaid,,,,,Y,70939.32,14861.86
New York City,Manhattan,7002054,001464,New York-Presbyterian Hospital - Columbia Presbyterian Center,50 to 69,100,M,Other Race,Spanish/Hispanic,24,Emergency,Home or Self Care,2022,GEN002,Acute and unspecified renal failure,CAR025,PLACEMENT OF TUNNELED OR IMPLANTABLE PORTION OF A VASCULAR ACCESS DEVICE,469,ACUTE KIDNEY INJURY,11,DISEASES AND DISORDERS OF THE KIDNEY AND URINARY TRACT,3,Major,Major,Medical,Self-Pay,,,,,Y,399764.43,91169.84
New York City,Manhattan,7002053,001463,NYU Langone Hospitals,50 to 69,112,F,Other Race,Not Span/Hispanic,4,Emergency,Home or Self Care,2022,GEN002,Acute and unspecified renal failure,ADM001,TRANSFUSION OF BLOOD AND BLOOD PRODUCTS,469,ACUTE KIDNEY INJURY,11,DISEASES AND DISORDERS OF THE KIDNEY AND URINARY TRACT,3,Major,Moderate,Medical,Medicare,Medicaid,,,,Y,148176.39,24654.94
New York City,Manhattan,7002053,001463,NYU Langone Hospitals,50 to 69,112,M,White,Not Span/Hispanic,7,Emergency,Home or Self Care,2022,GEN002,Acute and unspecified renal failure,ESA001,HEMODIALYSIS,469,ACUTE KIDNEY INJURY,11,DISEASES AND DISORDERS OF THE KIDNEY AND URINARY TRACT,3,Major,Moderate,Medical,Medicare,Medicare,,,,Y,139557.20,44544.67
New York City,Manhattan,7002054,001464,New York-Presbyterian Hospital - Columbia Presbyterian Center,50 to 69,100,M,Other Race,Spanish/Hispanic,1,Emergency,Home or Self Care,2022,GEN002,Acute and unspecified renal failure,,,469,ACUTE KIDNEY INJURY,11,DISEASES AND DISORDERS OF THE KIDNEY AND URINARY TRACT,2,Moderate,Minor,Medical,Medicaid,,,,,Y,22270.13,4844.48
New York City,Manhattan,7002054,001464,New York-Presbyterian Hospital - Columbia Presbyterian Center,70 or Older,112,M,Multi-racial,Not Span/Hispanic,13,Emergency,Home w/ Home Health Services,2022,GEN002,Acute and unspecified renal failure,ADM017,ADMINISTRATION OF NUTRITIONAL AND ELECTROLYTIC SUBSTANCES,469,ACUTE KIDNEY INJURY,11,DISEASES AND DISORDERS OF THE KIDNEY AND URINARY TRACT,3,Major,Moderate,Medical,Medicare,,,,,Y,268373.65,79256.18
New York City,Manhattan,7002054,001464,New York-Presbyterian Hospital - Columbia Presbyterian Center,50 to 69,104,F,Other Race,Spanish/Hispanic,11,Emergency,Home or Self Care,2022,GEN002,Acute and unspecified renal failure,ADM017,ADMINISTRATION OF NUTRITIONAL AND ELECTROLYTIC SUBSTANCES,469,ACUTE KIDNEY INJURY,11,DISEASES AND DISORDERS OF THE KIDNEY AND URINARY TRACT,3,Major,Major,Medical,Medicaid,,,,,Y,145725.85,30825.23
New York City,Manhattan,7002054,001464,New York-Presbyterian Hospital - Columbia Presbyterian Center,70 or Older,100,F,Black/African American,Spanish/Hispanic,5,Emergency,Home or Self Care,2022,GEN002,Acute and unspecified renal failure,,,469,ACUTE KIDNEY INJURY,11,DISEASES AND DISORDERS OF THE KIDNEY AND URINARY TRACT,3,Major,Major,Medical,Medicare,,,,,Y,79398.90,17131.86
New York City,Manhattan,7002053,001463,NYU Langone Hospitals,50 to 69,119,F,White,Not Span/Hispanic,3,Emergency,Home or Self Care,2022,GEN002,Acute and unspecified renal failure,OTR004,ISOLATION PROCEDURES,469,ACUTE KIDNEY INJURY,11,DISEASES AND DISORDERS OF THE KIDNEY AND URINARY TRACT,3,Major,Moderate,Medical,Medicare,Medicaid,,,,Y,93918.92,19146.55
New York City,Manhattan,7002053,001463,NYU Langone Hospitals,70 or Older,100,M,Other Race,Not Span/Hispanic,5,Emergency,Home w/ Home Health Services,2022,GEN002,Acute and unspecified renal failure,OTR004,ISOLATION PROCEDURES,469,ACUTE KIDNEY INJURY,11,DISEASES AND DISORDERS OF THE KIDNEY AND URINARY TRACT,3,Major,Major,Medical,Medicare,Medicaid,,,,Y,121380.25,29848.27
New York City,Manhattan,7002053,001463,NYU Langone Hospitals,50 to 69,104,M,White,Not Span/Hispanic,2,Emergency,Home w/ Home Health Services,2022,GEN002,Acute and unspecified renal failure,,,469,ACUTE KIDNEY INJURY,11,DISEASES AND DISORDERS OF THE KIDNEY AND URINARY TRACT,3,Major,Moderate,Medical,Medicare,,,,,Y,68010.37,18369.99
New York City,Manhattan,7002053,001463,NYU Langone Hospitals,70 or Older,100,M,Other Race,Spanish/Hispanic,5,Emergency,Skilled Nursing Home,2022,GEN002,Acute and unspecified renal failure,,,469,ACUTE KIDNEY INJURY,11,DISEASES AND DISORDERS OF THE KIDNEY AND URINARY TRACT,3,Major,Moderate,Medical,Medicaid,,,,,Y,82549.06,25744.46
New York City,Manhattan,7002054,001464,New York-Presbyterian Hospital - Columbia Presbyterian Center,70 or Older,105,F,White,Not Span/Hispanic,3,Urgent,Home w/ Home Health Services,2022,GEN002,Acute and unspecified renal failure,LYM007,BONE MARROW BIOPSY,469,ACUTE KIDNEY INJURY,11,DISEASES AND DISORDERS OF THE KIDNEY AND URINARY TRACT,4,Extreme,Major,Medical,Medicare,Private Health Insurance,,,,N,58538.94,12399.23
Finger Lakes,Monroe,2701005,000413,Strong Memorial Hospital,18 to 29,,F,Other Race,Spanish/Hispanic,14,Emergency,Home or Self Care,2022,GEN002,Acute and unspecified renal failure,URN002,KIDNEY AND OTHER URINARY TRACT BIOPSY (NON-ENDOSCOPIC),469,ACUTE KIDNEY INJURY,11,DISEASES AND DISORDERS OF THE KIDNEY AND URINARY TRACT,4,Extreme,Extreme,Medical,Blue Cross/Blue Shield,Medicare,Medicaid,,,Y,137899.28,50631.51
Finger Lakes,Monroe,2701005,000413,Strong Memorial Hospital,70 or Older,146,M,White,Not Span/Hispanic,1,Emergency,Home or Self Care,2022,GEN002,Acute and unspecified renal failure,,,469,ACUTE KIDNEY INJURY,11,DISEASES AND DISORDERS OF THE KIDNEY AND URINARY TRACT,3,Major,Moderate,Medical,Medicare,Blue Cross/Blue Shield,,,,Y,10307.99,3444.29
Finger Lakes,Monroe,2701005,000413,Strong Memorial Hospital,50 to 69,146,M,Black/African American,Not Span/Hispanic,8,Emergency,Home w/ Home Health Services,2022,GEN002,Acute and unspecified renal failure,,,469,ACUTE KIDNEY INJURY,11,DISEASES AND DISORDERS OF THE KIDNEY AND URINARY TRACT,3,Major,Major,Medical,Medicaid,,,,,Y,26154.15,12820.80
Finger Lakes,Monroe,2701005,000413,Strong Memorial Hospital,30 to 49,146,M,White,Not Span/Hispanic,3,Emergency,Expired,2022,GEN002,Acute and unspecified renal failure,,,469,ACUTE KIDNEY INJURY,11,DISEASES AND DISORDERS OF THE KIDNEY AND URINARY TRACT,3,Major,Major,Medical,Private Health Insurance,,,,,Y,13005.36,5358.65
Finger Lakes,Monroe,2701005,000413,Strong Memorial Hospital,70 or Older,146,M,Black/African American,Not Span/Hispanic,4,Urgent,Home or Self Care,2022,GEN002,Acute and unspecified renal failure,URN002,KIDNEY AND OTHER URINARY TRACT BIOPSY (NON-ENDOSCOPIC),469,ACUTE KIDNEY INJURY,11,DISEASES AND DISORDERS OF THE KIDNEY AND URINARY TRACT,2,Moderate,Minor,Medical,Medicare,,,,,N,22221.96,8741.40
Finger Lakes,Monroe,2701005,000413,Strong Memorial Hospital,0 to 17,144,F,White,Not Span/Hispanic,7,Emergency,Home or Self Care,2022,BLD002,Hemolytic anemia,,,469,ACUTE KIDNEY INJURY,11,DISEASES AND DISORDERS OF THE KIDNEY AND URINARY TRACT,3,Major,Major,Medical,Blue Cross/Blue Shield,,,02100,,Y,23954.98,10935.27
Finger Lakes,Monroe,2701005,000413,Strong Memorial Hospital,50 to 69,131,F,White,Not Span/Hispanic,11,Urgent,Home or Self Care,2022,GEN002,Acute and unspecified renal failure,GNR004,ENDOSCOPIC CONTROL OF BLEEDING,469,ACUTE KIDNEY INJURY,11,DISEASES AND DISORDERS OF THE KIDNEY AND URINARY TRACT,3,Major,Major,Medical,Medicare,,,,,N,72548.80,31653.85
Finger Lakes,Monroe,2701005,000413,Strong Memorial Hospital,70 or Older,146,F,Black/African American,Not Span/Hispanic,2,Emergency,Home w/ Home Health Services,2022,GEN002,Acute and unspecified renal failure,,,469,ACUTE KIDNEY INJURY,11,DISEASES AND DISORDERS OF THE KIDNEY AND URINARY TRACT,2,Moderate,Minor,Medical,Medicare,Medicaid,,,,Y,10072.76,3782.75
Finger Lakes,Monroe,2701005,000413,Strong Memorial Hospital,70 or Older,145,M,White,Not Span/Hispanic,9,Urgent,Home w/ Home Health Services,2022,GEN002,Acute and unspecified renal failure,LYM007,BONE MARROW BIOPSY,469,ACUTE KIDNEY INJURY,11,DISEASES AND DISORDERS OF THE KIDNEY AND URINARY TRACT,2,Moderate,Moderate,Medical,Medicare,,,,,N,50712.56,20256.72
Finger Lakes,Monroe,2701005,000413,Strong Memorial Hospital,50 to 69,146,M,Black/African American,Not Span/Hispanic,7,Emergency,Home w/ Home Health Services,2022,GEN002,Acute and unspecified renal failure,ESA004,NON-INVASIVE VENTILATION,469,ACUTE KIDNEY INJURY,11,DISEASES AND DISORDERS OF THE KIDNEY AND URINARY TRACT,3,Major,Moderate,Medical,Medicare,Medicaid,,,,Y,28078.99,11814.03
Finger Lakes,Monroe,2701005,000413,Strong Memorial Hospital,70 or Older,145,F,White,Not Span/Hispanic,6,Emergency,Skilled Nursing Home,2022,GEN002,Acute and unspecified renal failure,,,469,ACUTE KIDNEY INJURY,11,DISEASES AND DISORDERS OF THE KIDNEY AND URINARY TRACT,2,Moderate,Major,Medical,Medicare,Medicaid,,,,Y,22068.69,9872.32
Finger Lakes,Monroe,2701005,000413,Strong Memorial Hospital,70 or Older,145,F,White,Not Span/Hispanic,5,Emergency,Home or Self Care,2022,GEN002,Acute and unspecified renal failure,,,469,ACUTE KIDNEY INJURY,11,DISEASES AND DISORDERS OF THE KIDNEY AND URINARY TRACT,3,Major,Moderate,Medical,Medicare,,,,,Y,19624.61,8835.19
Finger Lakes,Monroe,2701005,000413,Strong Memorial Hospital,70 or Older,144,F,White,Not Span/Hispanic,3,Emergency,Hospice - Home,2022,GEN002,Acute and unspecified renal failure,,,469,ACUTE KIDNEY INJURY,11,DISEASES AND DISORDERS OF THE KIDNEY AND URINARY TRACT,3,Major,Major,Medical,Medicare,,,,,Y,14103.65,5272.96
Finger Lakes,Monroe,2701005,000413,Strong Memorial Hospital,50 to 69,146,M,Black/African American,Not Span/Hispanic,7,Emergency,Home or Self Care,2022,GEN002,Acute and unspecified renal failure,,,469,ACUTE KIDNEY INJURY,11,DISEASES AND DISORDERS OF THE KIDNEY AND URINARY TRACT,3,Major,Major,Medical,Medicare,Medicaid,,,,Y,24250.39,11851.51
Finger Lakes,Monroe,2701005,000413,Strong Memorial Hospital,50 to 69,146,F,Black/African American,Not Span/Hispanic,2,Emergency,Home or Self Care,2022,GEN002,Acute and unspecified renal failure,,,469,ACUTE KIDNEY INJURY,11,DISEASES AND DISORDERS OF THE KIDNEY AND URINARY TRACT,2,Moderate,Moderate,Medical,Medicare,Medicaid,,,,Y,9955.35,3752.04
Finger Lakes,Monroe,2701005,000413,Strong Memorial Hospital,70 or Older,146,M,White,Not Span/Hispanic,25,Emergency,Skilled Nursing Home,2022,GEN002,Acute and unspecified renal failure,IMG004,FLUOROSCOPY OF NON-CIRCULATORY ORGANS,469,ACUTE KIDNEY INJURY,11,DISEASES AND DISORDERS OF THE KIDNEY AND URINARY TRACT,4,Extreme,Extreme,Medical,Medicare,Blue Cross/Blue Shield,,,,Y,81348.46,40266.55
Finger Lakes,Monroe,2701005,000413,Strong Memorial Hospital,70 or Older,146,M,Black/African American,Not Span/Hispanic,2,Emergency,Home or Self Care,2022,GEN002,Acute and unspecified renal failure,,,469,ACUTE KIDNEY INJURY,11,DISEASES AND DISORDERS OF THE KIDNEY AND URINARY TRACT,3,Major,Moderate,Medical,Medicare,Medicaid,,,,Y,9638.05,3785.57
Finger Lakes,Monroe,2701005,000413,Strong Memorial Hospital,50 to 69,146,M,Other Race,Spanish/Hispanic,6,Emergency,Home or Self Care,2022,GEN002,Acute and unspecified renal failure,,,469,ACUTE KIDNEY INJURY,11,DISEASES AND DISORDERS OF THE KIDNEY AND URINARY TRACT,2,Moderate,Moderate,Medical,Medicare,Medicaid,,,,Y,30774.00,13540.43
Finger Lakes,Monroe,2701005,000413,Strong Memorial Hospital,70 or Older,146,M,Black/African American,Not Span/Hispanic,12,Emergency,Skilled Nursing Home,2022,GEN002,Acute and unspecified renal failure,,,469,ACUTE KIDNEY INJURY,11,DISEASES AND DISORDERS OF THE KIDNEY AND URINARY TRACT,2,Moderate,Minor,Medical,Medicare,Medicaid,,,,Y,32502.49,16578.78
Finger Lakes,Monroe,2701005,000413,Strong Memorial Hospital,70 or Older,145,F,White,Not Span/Hispanic,1,Emergency,Expired,2022,GEN002,Acute and unspecified renal failure,,,469,ACUTE KIDNEY INJURY,11,DISEASES AND DISORDERS OF THE KIDNEY AND URINARY TRACT,4,Extreme,Extreme,Medical,Medicare,,,,,Y,5400.01,2100.93
Finger Lakes,Monroe,2701005,000413,Strong Memorial Hospital,70 or Older,145,F,White,Not Span/Hispanic,2,Emergency,Home or Self Care,2022,GEN002,Acute and unspecified renal failure,GIS006,PARACENTESIS,469,ACUTE KIDNEY INJURY,11,DISEASES AND DISORDERS OF THE KIDNEY AND URINARY TRACT,2,Moderate,Moderate,Medical,Medicare,,,,,Y,7974.77,3482.98
New York City,Manhattan,7002053,001463,NYU Langone Hospitals,70 or Older,104,F,Black/African American,Not Span/Hispanic,1,Emergency,Home or Self Care,2022,GEN002,Acute and unspecified renal failure,,,469,ACUTE KIDNEY INJURY,11,DISEASES AND DISORDERS OF THE KIDNEY AND URINARY TRACT,2,Moderate,Major,Medical,Medicare,,,,,Y,36752.12,11930.19
New York City,Manhattan,7002053,001463,NYU Langone Hospitals,50 to 69,100,F,Other Race,Spanish/Hispanic,10,Emergency,Home or Self Care,2022,GEN002,Acute and unspecified renal failure,GIS002,COLONOSCOPY AND PROCTOSCOPY WITH BIOPSY,469,ACUTE KIDNEY INJURY,11,DISEASES AND DISORDERS OF THE KIDNEY AND URINARY TRACT,3,Major,Major,Medical,Medicaid,,,,,Y,190049.70,68251.76
New York City,Manhattan,7002053,001463,NYU Langone Hospitals,50 to 69,100,M,Other Race,Spanish/Hispanic,14,Emergency,Home or Self Care,2022,GEN002,Acute and unspecified renal failure,OTR004,ISOLATION PROCEDURES,469,ACUTE KIDNEY INJURY,11,DISEASES AND DISORDERS OF THE KIDNEY AND URINARY TRACT,3,Major,Major,Medical,Medicare,Medicaid,,,,Y,234113.92,70506.26
New York City,Manhattan,7002053,001463,NYU Langone Hospitals,70 or Older,112,M,White,Not Span/Hispanic,12,Emergency,Home w/ Home Health Services,2022,GEN002,Acute and unspecified renal failure,ESA004,NON-INVASIVE VENTILATION,469,ACUTE KIDNEY INJURY,11,DISEASES AND DISORDERS OF THE KIDNEY AND URINARY TRACT,3,Major,Major,Medical,Medicare,Blue Cross/Blue Shield,,,,Y,242649.82,62090.32
New York City,Manhattan,7002053,001463,NYU Langone Hospitals,70 or Older,112,M,White,Not Span/Hispanic,6,Emergency,Home or Self Care,2022,GEN002,Acute and unspecified renal failure,,,469,ACUTE KIDNEY INJURY,11,DISEASES AND DISORDERS OF THE KIDNEY AND URINARY TRACT,2,Moderate,Moderate,Medical,Medicare,Blue Cross/Blue Shield,,,,Y,109171.16,35746.87
New York City,Manhattan,7002053,001463,NYU Langone Hospitals,50 to 69,113,M,White,Not Span/Hispanic,2,Emergency,Home or Self Care,2022,GEN002,Acute and unspecified renal failure,,,469,ACUTE KIDNEY INJURY,11,DISEASES AND DISORDERS OF THE KIDNEY AND URINARY TRACT,3,Major,Major,Medical,Blue Cross/Blue Shield,Medicare,,,,Y,56397.00,17714.53
New York City,Manhattan,7002053,001463,NYU Langone Hospitals,70 or Older,125,M,White,Not Span/Hispanic,3,Emergency,Home or Self Care,2022,GEN002,Acute and unspecified renal failure,URN003,URETER AND OTHER URINARY TRACT DILATION,469,ACUTE KIDNEY INJURY,11,DISEASES AND DISORDERS OF THE KIDNEY AND URINARY TRACT,3,Major,Moderate,Medical,Medicare,Medicare,,,,Y,111292.38,21998.41
New York City,Manhattan,7002001,001438,Bellevue Hospital Center,50 to 69,100,F,Other Race,Unknown,5,Emergency,Expired,2022,GEN002,Acute and unspecified renal failure,IMG006,COMPUTERIZED TOMOGRAPHY (CT) WITH CONTRAST,469,ACUTE KIDNEY INJURY,11,DISEASES AND DISORDERS OF THE KIDNEY AND URINARY TRACT,3,Major,Major,Medical,Medicaid,,,,,Y,42097.62,24209.67
Finger Lakes,Monroe,2701005,000413,Strong Memorial Hospital,50 to 69,146,M,Black/African American,Not Span/Hispanic,1,Emergency,Home or Self Care,2022,GEN002,Acute and unspecified renal failure,GIS006,PARACENTESIS,469,ACUTE KIDNEY INJURY,11,DISEASES AND DISORDERS OF THE KIDNEY AND URINARY TRACT,3,Major,Major,Medical,Blue Cross/Blue Shield,,,,,Y,14613.86,4732.67
Finger Lakes,Monroe,2701005,000413,Strong Memorial Hospital,70 or Older,146,F,White,Not Span/Hispanic,13,Emergency,Home w/ Home Health Services,2022,GEN002,Acute and unspecified renal failure,GIS001,ESOPHAGOGASTRODUODENOSCOPY (EGD) WITH BIOPSY,469,ACUTE KIDNEY INJURY,11,DISEASES AND DISORDERS OF THE KIDNEY AND URINARY TRACT,3,Major,Major,Medical,Medicare,,,,,Y,45582.87,21430.37
New York City,Manhattan,7002001,001438,Bellevue Hospital Center,50 to 69,114,M,Other Race,Spanish/Hispanic,17,Emergency,Home or Self Care,2022,GEN002,Acute and unspecified renal failure,CAR024,VENOUS AND ARTERIAL CATHETER PLACEMENT,469,ACUTE KIDNEY INJURY,11,DISEASES AND DISORDERS OF THE KIDNEY AND URINARY TRACT,4,Extreme,Extreme,Medical,Medicaid,,,,,Y,128308.95,73788.42
New York City,Manhattan,7002001,001438,Bellevue Hospital Center,70 or Older,100,F,Other Race,Unknown,2,Emergency,Home w/ Home Health Services,2022,GEN002,Acute and unspecified renal failure,ADM015,ADMINISTRATION OF ANTIBIOTICS,469,ACUTE KIDNEY INJURY,11,DISEASES AND DISORDERS OF THE KIDNEY AND URINARY TRACT,2,Moderate,Major,Medical,Medicare,Medicaid,,,,Y,20074.20,
New York City,Manhattan,7002053,001463,NYU Langone Hospitals,70 or Older,100,F,White,Not Span/Hispanic,3,Emergency,Home w/ Home Health Services,2022,GEN002,Acute and unspecified renal failure,,,469,ACUTE KIDNEY INJURY,11,DISEASES AND DISORDERS OF THE KIDNEY AND URINARY TRACT,3,Major,Major,Medical,Medicare,Medicare,,,,Y,45669.31,15632.58
New York City,Manhattan,7002053,001463,NYU Langone Hospitals,50 to 69,104,F,Other Race,Spanish/Hispanic,2,Emergency,Home or Self Care,2022,GEN002,Acute and unspecified renal failure,,,469,ACUTE KIDNEY INJURY,11,DISEASES AND DISORDERS OF THE KIDNEY AND URINARY TRACT,3,Major,Major,Medical,Medicare,Medicaid,,,,Y,47758.40,11495.61
New York City,Manhattan,7002053,001463,NYU Langone Hospitals,70 or Older,100,F,Other Race,Not Span/Hispanic,8,Emergency,Home w/ Home Health Services,2022,GEN002,Acute and unspecified renal failure,URN005,NEPHROSTOMY AND URETEROSTOMY PROCEDURES (INCLUDING STENTS),469,ACUTE KIDNEY INJURY,11,DISEASES AND DISORDERS OF THE KIDNEY AND URINARY TRACT,2,Moderate,Moderate,Medical,Medicare,Medicare,,,,Y,127346.46,41319.50
New York City,Manhattan,7002053,001463,NYU Langone Hospitals,70 or Older,100,M,Other Race,Spanish/Hispanic,11,Emergency,Home w/ Home Health Services,2022,GEN002,Acute and unspecified renal failure,CAR025,PLACEMENT OF TUNNELED OR IMPLANTABLE PORTION OF A VASCULAR ACCESS DEVICE,469,ACUTE KIDNEY INJURY,11,DISEASES AND DISORDERS OF THE KIDNEY AND URINARY TRACT,3,Major,Major,Medical,Medicare,Blue Cross/Blue Shield,,,,Y,250113.77,75919.25
New York City,Manhattan,7002053,001463,NYU Langone Hospitals,50 to 69,112,M,White,Not Span/Hispanic,1,Emergency,Home or Self Care,2022,GEN002,Acute and unspecified renal failure,,,469,ACUTE KIDNEY INJURY,11,DISEASES AND DISORDERS OF THE KIDNEY AND URINARY TRACT,2,Moderate,Moderate,Medical,Medicare,Medicaid,,,,Y,43572.81,12948.56