Hospital Service Area,Hospital County,Operating Certificate Number,Permanent Facility Id,Facility Name,Age Group,Zip Code - 3 digits,Gender,Race,Ethnicity,Length of Stay,Type of Admission,Patient Disposition,Discharge Year,CCS Diagnosis Code,CCS Diagnosis Description,CCS Procedure Code,CCS Procedure Description,APR DRG Code,APR DRG Description,APR MDC Code,APR MDC Description,APR Severity of Illness Code,APR Severity of Illness Description,APR Risk of Mortality,APR Medical Surgical Description,Payment Typology 1,Payment Typology 2,Payment Typology 3,Birth Weight,Abortion Edit Indicator,Emergency Department Indicator,Total Charges,Total Costs
New York City,Manhattan,7002054,001464,New York-Presbyterian Hospital - Columbia Presbyterian Center,70 or Older,100,F,Other Race,Spanish/Hispanic,1,Emergency,Home or Self Care,2022,NVS012,Transient cerebral ischemia,,,047,TRANSIENT ISCHEMIA,01,DISEASES AND DISORDERS OF THE NERVOUS SYSTEM,2,Moderate,Moderate,Medical,Medicare,,,,,Y,38442.01,7619.64
New York City,Manhattan,7002001,001438,Bellevue Hospital Center,50 to 69,112,F,Black/African American,Unknown,1,Urgent,Home or Self Care,2022,NVS012,Transient cerebral ischemia,,,047,TRANSIENT ISCHEMIA,01,DISEASES AND DISORDERS OF THE NERVOUS SYSTEM,2,Moderate,Minor,Medical,Medicare,,,,,N,10193.40,5862.06
New York City,Manhattan,7002054,001464,New York-Presbyterian Hospital - Columbia Presbyterian Center,70 or Older,100,F,Other Race,Spanish/Hispanic,1,Emergency,Home w/ Home Health Services,2022,NVS012,Transient cerebral ischemia,,,047,TRANSIENT ISCHEMIA,01,DISEASES AND DISORDERS OF THE NERVOUS SYSTEM,2,Moderate,Minor,Medical,Medicaid,,,,,Y,35309.39,7517.96
New York City,Manhattan,7002053,001463,NYU Langone Hospitals,30 to 49,,F,White,Not Span/Hispanic,2,Emergency,Home or Self Care,2022,NVS012,Transient cerebral ischemia,,,047,TRANSIENT ISCHEMIA,01,DISEASES AND DISORDERS OF THE NERVOUS SYSTEM,3,Major,Major,Medical,Blue Cross/Blue Shield,,,,,N,76549.61,13863.84
New York City,Manhattan,7002054,001464,New York-Presbyterian Hospital - Columbia Presbyterian Center,70 or Older,100,F,Black/African American,Not Span/Hispanic,12,Emergency,Skilled Nursing Home,2022,NVS012,Transient cerebral ischemia,IMG009,PLAIN RADIOGRAPHY,047,TRANSIENT ISCHEMIA,01,DISEASES AND DISORDERS OF THE NERVOUS SYSTEM,3,Major,Major,Medical,Medicare,Medicaid,,,,Y,155616.46,33825.53
New York City,Manhattan,7002054,001464,New York-Presbyterian Hospital - Columbia Presbyterian Center,70 or Older,104,M,Black/African American,Spanish/Hispanic,1,Emergency,Home or Self Care,2022,NVS012,Transient cerebral ischemia,IMG005,MAGNETIC RESONANCE IMAGING (MRI),047,TRANSIENT ISCHEMIA,01,DISEASES AND DISORDERS OF THE NERVOUS SYSTEM,2,Moderate,Moderate,Medical,Medicare,Medicaid,,,,Y,36825.60,7475.18
New York City,Manhattan,7002054,001464,New York-Presbyterian Hospital - Columbia Presbyterian Center,30 to 49,109,M,White,Not Span/Hispanic,1,Emergency,Home or Self Care,2022,NVS012,Transient cerebral ischemia,ADM021,"ADMINISTRATION OF THERAPEUTIC SUBSTANCES, NEC",047,TRANSIENT ISCHEMIA,01,DISEASES AND DISORDERS OF THE NERVOUS SYSTEM,2,Moderate,Minor,Medical,Medicaid,,,,,Y,31470.10,
Finger Lakes,Monroe,2701005,000413,Strong Memorial Hospital,70 or Older,144,F,White,Not Span/Hispanic,2,Emergency,Home w/ Home Health Services,2022,NVS012,Transient cerebral ischemia,ADM005,ADMINISTRATION OF THROMBOLYTICS AND PLATELET INHIBITORS,047,TRANSIENT ISCHEMIA,01,DISEASES AND DISORDERS OF THE NERVOUS SYSTEM,2,Moderate,Minor,Medical,Medicare,,,,,Y,39414.56,15309.80
Finger Lakes,Monroe,2701005,000413,Strong Memorial Hospital,70 or Older,130,M,Multi-racial,Not Span/Hispanic,1,Urgent,Home or Self Care,2022,NVS012,Transient cerebral ischemia,,,047,TRANSIENT ISCHEMIA,01,DISEASES AND DISORDERS OF THE NERVOUS SYSTEM,3,Major,Moderate,Medical,Medicare,Private Health Insurance,,,,N,6850.43,3462.69
Finger Lakes,Monroe,2701005,000413,Strong Memorial Hospital,70 or Older,144,F,White,Not Span/Hispanic,3,Emergency,Home w/ Home Health Services,2022,NVS012,Transient cerebral ischemia,MAM011,ELECTROENCEPHALOGRAM (EEG),047,TRANSIENT ISCHEMIA,01,DISEASES AND DISORDERS OF THE NERVOUS SYSTEM,2,Moderate,Moderate,Medical,Medicare,,,,,Y,25335.27,8755.56
Finger Lakes,Monroe,2701005,000413,Strong Memorial Hospital,30 to 49,144,F,White,Not Span/Hispanic,1,Emergency,Home or Self Care,2022,NVS012,Transient cerebral ischemia,,,047,TRANSIENT ISCHEMIA,01,DISEASES AND DISORDERS OF THE NERVOUS SYSTEM,2,Moderate,Minor,Medical,Private Health Insurance,,,,,Y,10770.02,2907.03
New York City,Manhattan,7002053,001463,NYU Langone Hospitals,30 to 49,117,F,White,Not Span/Hispanic,2,Emergency,Home or Self Care,2022,NVS012,Transient cerebral ischemia,IMG008,ULTRASONOGRAPHY,047,TRANSIENT ISCHEMIA,01,DISEASES AND DISORDERS OF THE NERVOUS SYSTEM,1,Minor,Minor,Medical,Blue Cross/Blue Shield,,,,,Y,67203.94,14005.63
Finger Lakes,Monroe,2701005,000413,Strong Memorial Hospital,70 or Older,146,F,Black/African American,Not Span/Hispanic,9,Emergency,Home w/ Home Health Services,2022,NVS020,Other nervous system disorders (neither hereditary nor degenerative),,,047,TRANSIENT ISCHEMIA,01,DISEASES AND DISORDERS OF THE NERVOUS SYSTEM,2,Moderate,Moderate,Medical,Medicare,,,,,Y,35013.95,14880.32
New York City,Manhattan,7002053,001463,NYU Langone Hospitals,50 to 69,100,F,Other Race,Not Span/Hispanic,1,Emergency,Home or Self Care,2022,NVS012,Transient cerebral ischemia,,,047,TRANSIENT ISCHEMIA,01,DISEASES AND DISORDERS OF THE NERVOUS SYSTEM,1,Minor,Moderate,Medical,Private Health Insurance,,,,,Y,26888.18,6679.51
New York City,Manhattan,7002054,001464,New York-Presbyterian Hospital - Columbia Presbyterian Center,30 to 49,OOS,F,White,Not Span/Hispanic,2,Emergency,Home or Self Care,2022,NVS012,Transient cerebral ischemia,ADM021,"ADMINISTRATION OF THERAPEUTIC SUBSTANCES, NEC",047,TRANSIENT ISCHEMIA,01,DISEASES AND DISORDERS OF THE NERVOUS SYSTEM,1,Minor,Minor,Medical,Private Health Insurance,,,,,Y,57312.32,11911.45
New York City,Manhattan,7002054,001464,New York-Presbyterian Hospital - Columbia Presbyterian Center,70 or Older,100,M,White,Not Span/Hispanic,6,Emergency,Home w/ Home Health Services,2022,NVS012,Transient cerebral ischemia,IMG008,ULTRASONOGRAPHY,047,TRANSIENT ISCHEMIA,01,DISEASES AND DISORDERS OF THE NERVOUS SYSTEM,3,Major,Major,Medical,Medicare,Medicaid,,,,Y,123510.58,25849.31
Finger Lakes,Monroe,2701005,000413,Strong Memorial Hospital,50 to 69,145,F,White,Not Span/Hispanic,5,Emergency,Home w/ Home Health Services,2022,NVS012,Transient cerebral ischemia,MAM011,ELECTROENCEPHALOGRAM (EEG),047,TRANSIENT ISCHEMIA,01,DISEASES AND DISORDERS OF THE NERVOUS SYSTEM,2,Moderate,Minor,Medical,Medicare,Medicaid,,,,Y,68825.89,28653.27
Finger Lakes,Monroe,2701005,000413,Strong Memorial Hospital,50 to 69,144,M,White,Not Span/Hispanic,1,Emergency,Home or Self Care,2022,NVS012,Transient cerebral ischemia,,,047,TRANSIENT ISCHEMIA,01,DISEASES AND DISORDERS OF THE NERVOUS SYSTEM,2,Moderate,Minor,Medical,Blue Cross/Blue Shield,,,,,Y,16382.31,5053.89
Finger Lakes,Monroe,2701005,000413,Strong Memorial Hospital,50 to 69,145,M,White,Not Span/Hispanic,3,Emergency,Home w/ Home Health Services,2022,NVS012,Transient cerebral ischemia,ADM005,ADMINISTRATION OF THROMBOLYTICS AND PLATELET INHIBITORS,047,TRANSIENT ISCHEMIA,01,DISEASES AND DISORDERS OF THE NERVOUS SYSTEM,3,Major,Moderate,Medical,Medicare,,,,,Y,46403.40,18620.97
New York City,Manhattan,7002054,001464,New York-Presbyterian Hospital - Columbia Presbyterian Center,70 or Older,100,M,Other Race,Unknown,2,Emergency,Facility w/ Custodial/Supportive Care,2022,NVS012,Transient cerebral ischemia,,,047,TRANSIENT ISCHEMIA,01,DISEASES AND DISORDERS OF THE NERVOUS SYSTEM,2,Moderate,Moderate,Medical,Medicare,Medicaid,,,,Y,50189.14,10388.95
New York City,Manhattan,7002054,001464,New York-Presbyterian Hospital - Columbia Presbyterian Center,0 to 17,,M,Other Race,Unknown,2,Emergency,Home or Self Care,2022,NVS012,Transient cerebral ischemia,IMG008,ULTRASONOGRAPHY,047,TRANSIENT ISCHEMIA,01,DISEASES AND DISORDERS OF THE NERVOUS SYSTEM,3,Major,Moderate,Medical,Private Health Insurance,,,,,Y,77324.46,30264.43
New York City,Manhattan,7002054,001464,New York-Presbyterian Hospital - Columbia Presbyterian Center,30 to 49,100,M,Other Race,Spanish/Hispanic,1,Emergency,Home or Self Care,2022,NVS012,Transient cerebral ischemia,,,047,TRANSIENT ISCHEMIA,01,DISEASES AND DISORDERS OF THE NERVOUS SYSTEM,1,Minor,Minor,Medical,Medicaid,,,,,Y,35452.37,6681.59
New York City,Manhattan,7002054,001464,New York-Presbyterian Hospital - Columbia Presbyterian Center,50 to 69,100,F,Other Race,Spanish/Hispanic,6,Emergency,Home w/ Home Health Services,2022,NVS012,Transient cerebral ischemia,ADM007,INTRAVENOUS INDUCTION OF LABOR,047,TRANSIENT ISCHEMIA,01,DISEASES AND DISORDERS OF THE NERVOUS SYSTEM,1,Minor,Minor,Medical,Medicare,,,,,Y,107626.84,23219.63
Long Island,Nassau,2951001,000541,North Shore University Hospital,70 or Older,113,F,White,Not Span/Hispanic,4,Emergency,Home w/ Home Health Services,2022,NVS012,Transient cerebral ischemia,,,047,TRANSIENT ISCHEMIA,01,DISEASES AND DISORDERS OF THE NERVOUS SYSTEM,2,Moderate,Minor,Medical,Medicare,Private Health Insurance,,,,Y,70926.60,9962.79
Long Island,Nassau,2951001,000541,North Shore University Hospital,30 to 49,110,M,White,Not Span/Hispanic,1,Emergency,Home or Self Care,2022,NVS012,Transient cerebral ischemia,OTR004,ISOLATION PROCEDURES,047,TRANSIENT ISCHEMIA,01,DISEASES AND DISORDERS OF THE NERVOUS SYSTEM,2,Moderate,Moderate,Medical,Private Health Insurance,,,,,Y,52312.24,6079.31
Long Island,Nassau,2951001,000541,North Shore University Hospital,50 to 69,110,F,Other Race,Spanish/Hispanic,3,Emergency,Home or Self Care,2022,NVS012,Transient cerebral ischemia,,,047,TRANSIENT ISCHEMIA,01,DISEASES AND DISORDERS OF THE NERVOUS SYSTEM,2,Moderate,Minor,Medical,Medicaid,Medicaid,,,,Y,64291.73,8684.58
Long Island,Nassau,2951001,000541,North Shore University Hospital,70 or Older,114,F,Other Race,Not Span/Hispanic,1,Emergency,Home or Self Care,2022,NVS012,Transient cerebral ischemia,,,047,TRANSIENT ISCHEMIA,01,DISEASES AND DISORDERS OF THE NERVOUS SYSTEM,1,Minor,Minor,Medical,Medicare,Medicare,,,,Y,35061.57,4902.55
Long Island,Nassau,2951001,000541,North Shore University Hospital,50 to 69,110,F,Other Race,Not Span/Hispanic,3,Urgent,Home w/ Home Health Services,2022,NVS012,Transient cerebral ischemia,,,047,TRANSIENT ISCHEMIA,01,DISEASES AND DISORDERS OF THE NERVOUS SYSTEM,1,Minor,Minor,Medical,Medicaid,Medicaid,,,,N,68182.28,10933.68
New York City,Manhattan,7002054,001464,New York-Presbyterian Hospital - Columbia Presbyterian Center,50 to 69,100,F,Other Race,Spanish/Hispanic,1,Emergency,Home or Self Care,2022,NVS012,Transient cerebral ischemia,IMG007,COMPUTERIZED TOMOGRAPHY (CT) WITHOUT CONTRAST,047,TRANSIENT ISCHEMIA,01,DISEASES AND DISORDERS OF THE NERVOUS SYSTEM,2,Moderate,Major,Medical,Medicare,,,,,Y,37799.74,
New York City,Manhattan,7002053,001463,NYU Langone Hospitals,30 to 49,112,M,Black/African American,Not Span/Hispanic,1,Emergency,Home or Self Care,2022,NVS012,Transient cerebral ischemia,OTR004,ISOLATION PROCEDURES,047,TRANSIENT ISCHEMIA,01,DISEASES AND DISORDERS OF THE NERVOUS SYSTEM,4,Extreme,Extreme,Medical,Blue Cross/Blue Shield,,,,,Y,59085.51,12667.57
Hudson Valley,Dutchess,1302001,000181,Vassar Brothers Medical Center,50 to 69,126,M,White,Not Span/Hispanic,3,Emergency,Home or Self Care,2022,NVS012,Transient cerebral ischemia,,,047,TRANSIENT ISCHEMIA,01,DISEASES AND DISORDERS OF THE NERVOUS SYSTEM,2,Moderate,Moderate,Medical,Medicaid,,,,,Y,25310.14,5312.88
Hudson Valley,Dutchess,1302001,000181,Vassar Brothers Medical Center,70 or Older,125,M,White,Not Span/Hispanic,8,Emergency,Skilled Nursing Home,2022,NVS012,Transient cerebral ischemia,,,047,TRANSIENT ISCHEMIA,01,DISEASES AND DISORDERS OF THE NERVOUS SYSTEM,2,Moderate,Moderate,Medical,Medicare,Medicaid,,,,Y,42746.56,13684.32
Hudson Valley,Dutchess,1302001,000181,Vassar Brothers Medical Center,30 to 49,126,M,Other Race,Spanish/Hispanic,3,Emergency,Home or Self Care,2022,NVS012,Transient cerebral ischemia,ADM005,ADMINISTRATION OF THROMBOLYTICS AND PLATELET INHIBITORS,047,TRANSIENT ISCHEMIA,01,DISEASES AND DISORDERS OF THE NERVOUS SYSTEM,1,Minor,Minor,Medical,"Managed Care, Unspecified",,,,,Y,94135.51,23133.41
Capital/Adirond,Warren,5601000,001005,Glens Falls Hospital,70 or Older,128,M,White,Not Span/Hispanic,3,Emergency,Home or Self Care,2022,NVS012,Transient cerebral ischemia,MAM010,OTHER CARDIOVASCULAR SYSTEM MEASUREMENT AND MONITORING,047,TRANSIENT ISCHEMIA,01,DISEASES AND DISORDERS OF THE NERVOUS SYSTEM,2,Moderate,Minor,Medical,Medicare,,,,,Y,16606.08,5034.12
Capital/Adirond,Warren,5601000,001005,Glens Falls Hospital,30 to 49,128,F,White,Not Span/Hispanic,4,Emergency,Home or Self Care,2022,NVS012,Transient cerebral ischemia,,,047,TRANSIENT ISCHEMIA,01,DISEASES AND DISORDERS OF THE NERVOUS SYSTEM,1,Minor,Minor,Medical,Medicaid,,,,,Y,21221.70,6882.73
Capital/Adirond,Warren,5601000,001005,Glens Falls Hospital,50 to 69,128,M,White,Not Span/Hispanic,1,Emergency,Home or Self Care,2022,NVS012,Transient cerebral ischemia,MAM010,OTHER CARDIOVASCULAR SYSTEM MEASUREMENT AND MONITORING,047,TRANSIENT ISCHEMIA,01,DISEASES AND DISORDERS OF THE NERVOUS SYSTEM,2,Moderate,Moderate,Medical,Medicare,Medicaid,,,,Y,12301.94,3041.07
Hudson Valley,Dutchess,1302001,000181,Vassar Brothers Medical Center,70 or Older,125,F,White,Not Span/Hispanic,1,Emergency,Home or Self Care,2022,NVS012,Transient cerebral ischemia,,,047,TRANSIENT ISCHEMIA,01,DISEASES AND DISORDERS OF THE NERVOUS SYSTEM,2,Moderate,Moderate,Medical,Medicare,Blue Cross/Blue Shield,,,,Y,15424.09,3614.40
Hudson Valley,Dutchess,1302001,000181,Vassar Brothers Medical Center,70 or Older,126,F,White,Not Span/Hispanic,3,Emergency,Facility w/ Custodial/Supportive Care,2022,NVS012,Transient cerebral ischemia,,,047,TRANSIENT ISCHEMIA,01,DISEASES AND DISORDERS OF THE NERVOUS SYSTEM,3,Major,Major,Medical,Medicare,Blue Cross/Blue Shield,"Managed Care, Unspecified",,,Y,30962.68,7713.10
New York City,Manhattan,7002054,001464,New York-Presbyterian Hospital - Columbia Presbyterian Center,70 or Older,104,M,Black/African American,Not Span/Hispanic,1,Emergency,Home or Self Care,2022,NVS012,Transient cerebral ischemia,IMG007,COMPUTERIZED TOMOGRAPHY (CT) WITHOUT CONTRAST,047,TRANSIENT ISCHEMIA,01,DISEASES AND DISORDERS OF THE NERVOUS SYSTEM,2,Moderate,Moderate,Medical,Medicaid,,,,,Y,36737.92,
New York City,Manhattan,7002054,001464,New York-Presbyterian Hospital - Columbia Presbyterian Center,30 to 49,100,M,Other Race,Spanish/Hispanic,1,Emergency,Home or Self Care,2022,NVS012,Transient cerebral ischemia,IMG007,COMPUTERIZED TOMOGRAPHY (CT) WITHOUT CONTRAST,047,TRANSIENT ISCHEMIA,01,DISEASES AND DISORDERS OF THE NERVOUS SYSTEM,1,Minor,Minor,Medical,Medicaid,,,,,Y,35511.57,7161.11
New York City,Manhattan,7002054,001464,New York-Presbyterian Hospital - Columbia Presbyterian Center,70 or Older,100,F,Other Race,Spanish/Hispanic,6,Emergency,Skilled Nursing Home,2022,NVS012,Transient cerebral ischemia,,,047,TRANSIENT ISCHEMIA,01,DISEASES AND DISORDERS OF THE NERVOUS SYSTEM,3,Major,Major,Medical,Medicare,Medicaid,,,,Y,101124.38,22379.34
New York City,Manhattan,7002054,001464,New York-Presbyterian Hospital - Columbia Presbyterian Center,50 to 69,100,M,Other Race,Spanish/Hispanic,1,Emergency,Home or Self Care,2022,NVS012,Transient cerebral ischemia,ADM021,"ADMINISTRATION OF THERAPEUTIC SUBSTANCES, NEC",047,TRANSIENT ISCHEMIA,01,DISEASES AND DISORDERS OF THE NERVOUS SYSTEM,1,Minor,Minor,Medical,Medicaid,,,,,Y,46284.95,8940.78
Finger Lakes,Monroe,2701005,000413,Strong Memorial Hospital,70 or Older,146,F,Black/African American,Not Span/Hispanic,1,Emergency,Home or Self Care,2022,NVS012,Transient cerebral ischemia,IMG006,COMPUTERIZED TOMOGRAPHY (CT) WITH CONTRAST,047,TRANSIENT ISCHEMIA,01,DISEASES AND DISORDERS OF THE NERVOUS SYSTEM,1,Minor,Minor,Medical,Medicare,,,,,Y,13294.16,4161.75
Finger Lakes,Monroe,2701005,000413,Strong Memorial Hospital,70 or Older,144,F,White,Not Span/Hispanic,4,Emergency,Home or Self Care,2022,NVS012,Transient cerebral ischemia,,,047,TRANSIENT ISCHEMIA,01,DISEASES AND DISORDERS OF THE NERVOUS SYSTEM,3,Major,Moderate,Medical,Medicare,,,,,Y,22012.72,8625.38
Finger Lakes,Monroe,2701005,000413,Strong Memorial Hospital,50 to 69,148,M,White,Not Span/Hispanic,1,Emergency,Home or Self Care,2022,NVS012,Transient cerebral ischemia,,,047,TRANSIENT ISCHEMIA,01,DISEASES AND DISORDERS OF THE NERVOUS SYSTEM,1,Minor,Minor,Medical,Medicare,,,,,Y,8913.47,3503.78
Finger Lakes,Monroe,2701005,000413,Strong Memorial Hospital,70 or Older,146,M,White,Not Span/Hispanic,2,Emergency,Home or Self Care,2022,NVS012,Transient cerebral ischemia,IMG006,COMPUTERIZED TOMOGRAPHY (CT) WITH CONTRAST,047,TRANSIENT ISCHEMIA,01,DISEASES AND DISORDERS OF THE NERVOUS SYSTEM,2,Moderate,Minor,Medical,Medicare,,,,,Y,14768.62,5141.35
Finger Lakes,Monroe,2701005,000413,Strong Memorial Hospital,70 or Older,145,M,White,Not Span/Hispanic,1,Emergency,Home or Self Care,2022,NVS012,Transient cerebral ischemia,,,047,TRANSIENT ISCHEMIA,01,DISEASES AND DISORDERS OF THE NERVOUS SYSTEM,2,Moderate,Minor,Medical,Medicare,,,,,Y,12752.76,3860.18
Finger Lakes,Monroe,2701005,000413,Strong Memorial Hospital,50 to 69,146,F,Black/African American,Not Span/Hispanic,1,Emergency,Home or Self Care,2022,NVS012,Transient cerebral ischemia,,,047,TRANSIENT ISCHEMIA,01,DISEASES AND DISORDERS OF THE NERVOUS SYSTEM,2,Moderate,Minor,Medical,Blue Cross/Blue Shield,Medicare,,,,N,10113.65,3458.06
Finger Lakes,Monroe,2701005,000413,Strong Memorial Hospital,70 or Older,146,F,White,Not Span/Hispanic,1,Emergency,Home w/ Home Health Services,2022,NVS012,Transient cerebral ischemia,,,047,TRANSIENT ISCHEMIA,01,DISEASES AND DISORDERS OF THE NERVOUS SYSTEM,2,Moderate,Minor,Medical,Medicare,,,,,Y,13591.05,4356.90
Capital/Adirond,Warren,5601000,001005,Glens Falls Hospital,70 or Older,128,M,White,Not Span/Hispanic,3,Emergency,Short-term Hospital,2022,NVS012,Transient cerebral ischemia,MAM010,OTHER CARDIOVASCULAR SYSTEM MEASUREMENT AND MONITORING,047,TRANSIENT ISCHEMIA,01,DISEASES AND DISORDERS OF THE NERVOUS SYSTEM,3,Major,Major,Medical,Medicare,Blue Cross/Blue Shield,,,,Y,20827.57,6833.03
Capital/Adirond,Warren,5601000,001005,Glens Falls Hospital,70 or Older,128,M,White,Not Span/Hispanic,2,Emergency,Home or Self Care,2022,NVS012,Transient cerebral ischemia,MAM010,OTHER CARDIOVASCULAR SYSTEM MEASUREMENT AND MONITORING,047,TRANSIENT ISCHEMIA,01,DISEASES AND DISORDERS OF THE NERVOUS SYSTEM,3,Major,Major,Medical,Medicare,,,,,Y,17226.75,4570.37
Capital/Adirond,Warren,5601000,001005,Glens Falls Hospital,50 to 69,128,F,White,Not Span/Hispanic,4,Emergency,Home or Self Care,2022,NVS012,Transient cerebral ischemia,ADM005,ADMINISTRATION OF THROMBOLYTICS AND PLATELET INHIBITORS,047,TRANSIENT ISCHEMIA,01,DISEASES AND DISORDERS OF THE NERVOUS SYSTEM,1,Minor,Minor,Medical,Medicare,Blue Cross/Blue Shield,,,,Y,60235.30,61855.96
Capital/Adirond,Warren,5601000,001005,Glens Falls Hospital,70 or Older,128,F,White,Not Span/Hispanic,3,Emergency,Skilled Nursing Home,2022,NVS012,Transient cerebral ischemia,,,047,TRANSIENT ISCHEMIA,01,DISEASES AND DISORDERS OF THE NERVOUS SYSTEM,2,Moderate,Moderate,Medical,Medicare,Federal/State/Local/VA,,,,Y,20415.79,6127.16
Capital/Adirond,Warren,5601000,001005,Glens Falls Hospital,70 or Older,128,F,White,Not Span/Hispanic,2,Emergency,Home or Self Care,2022,NVS012,Transient cerebral ischemia,,,047,TRANSIENT ISCHEMIA,01,DISEASES AND DISORDERS OF THE NERVOUS SYSTEM,2,Moderate,Moderate,Medical,Medicare,Medicaid,,,,Y,15223.60,4524.12
Capital/Adirond,Warren,5601000,001005,Glens Falls Hospital,50 to 69,128,F,White,Not Span/Hispanic,2,Emergency,Home or Self Care,2022,NVS012,Transient cerebral ischemia,,,047,TRANSIENT ISCHEMIA,01,DISEASES AND DISORDERS OF THE NERVOUS SYSTEM,2,Moderate,Moderate,Medical,Medicare,Private Health Insurance,,,,Y,13917.74,3678.42
Long Island,Nassau,2951001,000541,North Shore University Hospital,70 or Older,114,M,Black/African American,Not Span/Hispanic,2,Emergency,Home or Self Care,2022,NVS012,Transient cerebral ischemia,CNS002,LUMBAR PUNCTURE,047,TRANSIENT ISCHEMIA,01,DISEASES AND DISORDERS OF THE NERVOUS SYSTEM,2,Moderate,Minor,Medical,Medicare,Blue Cross/Blue Shield,,,,Y,54902.69,7346.41
Long Island,Nassau,2951001,000541,North Shore University Hospital,70 or Older,110,M,Other Race,Not Span/Hispanic,10,Emergency,Skilled Nursing Home,2022,NVS012,Transient cerebral ischemia,OTR004,ISOLATION PROCEDURES,047,TRANSIENT ISCHEMIA,01,DISEASES AND DISORDERS OF THE NERVOUS SYSTEM,3,Major,Moderate,Medical,Medicare,Medicare,Medicaid,,,Y,140168.61,21983.15
Long Island,Nassau,2951001,000541,North Shore University Hospital,70 or Older,113,F,White,Not Span/Hispanic,4,Emergency,Skilled Nursing Home,2022,NVS012,Transient cerebral ischemia,,,047,TRANSIENT ISCHEMIA,01,DISEASES AND DISORDERS OF THE NERVOUS SYSTEM,2,Moderate,Moderate,Medical,Medicare,Private Health Insurance,,,,Y,63754.59,9045.67
Long Island,Nassau,2951001,000541,North Shore University Hospital,70 or Older,114,M,Black/African American,Not Span/Hispanic,2,Emergency,Home or Self Care,2022,NVS012,Transient cerebral ischemia,,,047,TRANSIENT ISCHEMIA,01,DISEASES AND DISORDERS OF THE NERVOUS SYSTEM,1,Minor,Minor,Medical,Medicare,Blue Cross/Blue Shield,,,,Y,50690.38,6822.98
Long Island,Nassau,2951001,000541,North Shore University Hospital,70 or Older,112,F,Other Race,Not Span/Hispanic,7,Emergency,Home or Self Care,2022,NVS012,Transient cerebral ischemia,MST028,"SUBCUTANEOUS TISSUE AND FASCIA PROCEDURES, NEC",047,TRANSIENT ISCHEMIA,01,DISEASES AND DISORDERS OF THE NERVOUS SYSTEM,3,Major,Moderate,Medical,Medicare,Medicare,,,,Y,185733.01,36606.98
Long Island,Nassau,2951001,000541,North Shore University Hospital,50 to 69,117,M,White,Not Span/Hispanic,2,Emergency,Home or Self Care,2022,NVS012,Transient cerebral ischemia,,,047,TRANSIENT ISCHEMIA,01,DISEASES AND DISORDERS OF THE NERVOUS SYSTEM,3,Major,Major,Medical,Blue Cross/Blue Shield,Private Health Insurance,,,,Y,52467.88,6871.36
Finger Lakes,Monroe,2701005,000413,Strong Memorial Hospital,50 to 69,146,F,White,Not Span/Hispanic,2,Emergency,Home w/ Home Health Services,2022,NVS012,Transient cerebral ischemia,ESA001,HEMODIALYSIS,047,TRANSIENT ISCHEMIA,01,DISEASES AND DISORDERS OF THE NERVOUS SYSTEM,3,Major,Major,Medical,Medicare,Medicaid,,,,Y,20997.52,6279.74
Hudson Valley,Dutchess,1302001,000181,Vassar Brothers Medical Center,30 to 49,126,M,White,Spanish/Hispanic,1,Emergency,Home or Self Care,2022,NVS012,Transient cerebral ischemia,,,047,TRANSIENT ISCHEMIA,01,DISEASES AND DISORDERS OF THE NERVOUS SYSTEM,2,Moderate,Minor,Medical,Blue Cross/Blue Shield,,,,,Y,17744.43,3802.34
Hudson Valley,Dutchess,1302001,000181,Vassar Brothers Medical Center,50 to 69,125,F,Other Race,Not Span/Hispanic,2,Emergency,Home or Self Care,2022,NVS012,Transient cerebral ischemia,ADM005,ADMINISTRATION OF THROMBOLYTICS AND PLATELET INHIBITORS,047,TRANSIENT ISCHEMIA,01,DISEASES AND DISORDERS OF THE NERVOUS SYSTEM,3,Major,Major,Medical,Medicare,,,,,Y,84490.01,20833.27
Hudson Valley,Dutchess,1302001,000181,Vassar Brothers Medical Center,30 to 49,125,M,White,Not Span/Hispanic,1,Emergency,Home or Self Care,2022,NVS012,Transient cerebral ischemia,,,047,TRANSIENT ISCHEMIA,01,DISEASES AND DISORDERS OF THE NERVOUS SYSTEM,2,Moderate,Minor,Medical,Blue Cross/Blue Shield,,,,,Y,17407.02,3795.32
Hudson Valley,Dutchess,1302001,000181,Vassar Brothers Medical Center,50 to 69,125,F,White,Not Span/Hispanic,2,Emergency,Home or Self Care,2022,NVS012,Transient cerebral ischemia,,,047,TRANSIENT ISCHEMIA,01,DISEASES AND DISORDERS OF THE NERVOUS SYSTEM,1,Minor,Minor,Medical,Blue Cross/Blue Shield,,,,,Y,17696.72,3655.35