Hospital Service Area,Hospital County,Operating Certificate Number,Permanent Facility Id,Facility Name,Age Group,Zip Code - 3 digits,Gender,Race,Ethnicity,Length of Stay,Type of Admission,Patient Disposition,Discharge Year,CCS Diagnosis Code,CCS Diagnosis Description,CCS Procedure Code,CCS Procedure Description,APR DRG Code,APR DRG Description,APR MDC Code,APR MDC Description,APR Severity of Illness Code,APR Severity of Illness Description,APR Risk of Mortality,APR Medical Surgical Description,Payment Typology 1,Payment Typology 2,Payment Typology 3,Birth Weight,Abortion Edit Indicator,Emergency Department Indicator,Total Charges,Total Costs
New York City,Manhattan,7002054,001464,New York-Presbyterian Hospital - Columbia Presbyterian Center,30 to 49,104,F,White,Spanish/Hispanic,6,Emergency,Home w/ Home Health Services,2022,END003,Diabetes mellitus with complication,,,048,"PERIPHERAL, CRANIAL AND AUTONOMIC NERVE DISORDERS",01,DISEASES AND DISORDERS OF THE NERVOUS SYSTEM,3,Major,Moderate,Medical,Medicaid,,,,,Y,94626.73,22810.47
New York City,Manhattan,7002054,001464,New York-Presbyterian Hospital - Columbia Presbyterian Center,70 or Older,OOS,M,Other Race,Unknown,5,Emergency,Inpatient Rehabilitation Facility,2022,NVS015,Polyneuropathies,IMG009,PLAIN RADIOGRAPHY,048,"PERIPHERAL, CRANIAL AND AUTONOMIC NERVE DISORDERS",01,DISEASES AND DISORDERS OF THE NERVOUS SYSTEM,3,Major,Minor,Medical,Medicare,,,,,Y,80219.15,16871.80
New York City,Manhattan,7002054,001464,New York-Presbyterian Hospital - Columbia Presbyterian Center,50 to 69,116,F,White,Not Span/Hispanic,73,Urgent,Expired,2022,END003,Diabetes mellitus with complication,GIS027,"UPPER GI THERAPEUTIC PROCEDURES, NEC (ENDOSCOPIC)",048,"PERIPHERAL, CRANIAL AND AUTONOMIC NERVE DISORDERS",01,DISEASES AND DISORDERS OF THE NERVOUS SYSTEM,4,Extreme,Extreme,Medical,Medicare,,,,,N,2111886.15,793561.59
New York City,Manhattan,7002054,001464,New York-Presbyterian Hospital - Columbia Presbyterian Center,18 to 29,100,F,Black/African American,Not Span/Hispanic,3,Emergency,Left Against Medical Advice,2022,END003,Diabetes mellitus with complication,,,048,"PERIPHERAL, CRANIAL AND AUTONOMIC NERVE DISORDERS",01,DISEASES AND DISORDERS OF THE NERVOUS SYSTEM,2,Moderate,Moderate,Medical,Private Health Insurance,,,,,Y,58790.80,11875.53
New York City,Manhattan,7002054,001464,New York-Presbyterian Hospital - Columbia Presbyterian Center,30 to 49,100,M,Black/African American,Not Span/Hispanic,10,Emergency,Skilled Nursing Home,2022,END003,Diabetes mellitus with complication,,,048,"PERIPHERAL, CRANIAL AND AUTONOMIC NERVE DISORDERS",01,DISEASES AND DISORDERS OF THE NERVOUS SYSTEM,3,Major,Major,Medical,Medicaid,,,,,Y,167604.11,37343.71
New York City,Manhattan,7002001,001438,Bellevue Hospital Center,50 to 69,100,M,Black/African American,Not Span/Hispanic,23,Emergency,Skilled Nursing Home,2022,END003,Diabetes mellitus with complication,ADM021,"ADMINISTRATION OF THERAPEUTIC SUBSTANCES, NEC",048,"PERIPHERAL, CRANIAL AND AUTONOMIC NERVE DISORDERS",01,DISEASES AND DISORDERS OF THE NERVOUS SYSTEM,3,Major,Extreme,Medical,Medicaid,,,,,Y,156664.82,90095.43
New York City,Manhattan,7002054,001464,New York-Presbyterian Hospital - Columbia Presbyterian Center,30 to 49,103,F,Other Race,Unknown,14,Emergency,Home w/ Home Health Services,2022,MUS011,Spondylopathies/spondyloarthropathy (including infective),CNS002,LUMBAR PUNCTURE,048,"PERIPHERAL, CRANIAL AND AUTONOMIC NERVE DISORDERS",01,DISEASES AND DISORDERS OF THE NERVOUS SYSTEM,2,Moderate,Minor,Medical,Medicaid,,,,,Y,288386.74,70286.98
New York City,Manhattan,7002054,001464,New York-Presbyterian Hospital - Columbia Presbyterian Center,0 to 17,100,F,Other Race,Spanish/Hispanic,5,Emergency,Home or Self Care,2022,NVS019,Nervous system pain and pain syndromes,ADM021,"ADMINISTRATION OF THERAPEUTIC SUBSTANCES, NEC",048,"PERIPHERAL, CRANIAL AND AUTONOMIC NERVE DISORDERS",01,DISEASES AND DISORDERS OF THE NERVOUS SYSTEM,1,Minor,Minor,Medical,Medicaid,,,,,Y,77570.57,23903.11
New York City,Manhattan,7002054,001464,New York-Presbyterian Hospital - Columbia Presbyterian Center,50 to 69,111,M,White,Not Span/Hispanic,13,Emergency,Facility w/ Custodial/Supportive Care,2022,NVS015,Polyneuropathies,OTR004,ISOLATION PROCEDURES,048,"PERIPHERAL, CRANIAL AND AUTONOMIC NERVE DISORDERS",01,DISEASES AND DISORDERS OF THE NERVOUS SYSTEM,3,Major,Moderate,Medical,Medicare,,,,,Y,168567.25,36761.36
New York City,Manhattan,7002001,001438,Bellevue Hospital Center,18 to 29,112,F,Other Race,Spanish/Hispanic,1,Emergency,Home or Self Care,2022,NVS017,Nerve and nerve root disorders,ADM014,REGIONAL ANESTHESIA,048,"PERIPHERAL, CRANIAL AND AUTONOMIC NERVE DISORDERS",01,DISEASES AND DISORDERS OF THE NERVOUS SYSTEM,3,Major,Moderate,Medical,Private Health Insurance,,,,,Y,11258.09,6474.35
New York City,Manhattan,7002001,001438,Bellevue Hospital Center,70 or Older,112,M,Other Race,Spanish/Hispanic,6,Emergency,Home or Self Care,2022,END003,Diabetes mellitus with complication,ADM021,"ADMINISTRATION OF THERAPEUTIC SUBSTANCES, NEC",048,"PERIPHERAL, CRANIAL AND AUTONOMIC NERVE DISORDERS",01,DISEASES AND DISORDERS OF THE NERVOUS SYSTEM,2,Moderate,Major,Medical,Medicare,,,,,Y,56586.73,32542.12
New York City,Manhattan,7002054,001464,New York-Presbyterian Hospital - Columbia Presbyterian Center,50 to 69,104,M,Other Race,Spanish/Hispanic,4,Emergency,Home w/ Home Health Services,2022,END003,Diabetes mellitus with complication,,,048,"PERIPHERAL, CRANIAL AND AUTONOMIC NERVE DISORDERS",01,DISEASES AND DISORDERS OF THE NERVOUS SYSTEM,1,Minor,Minor,Medical,Medicare,,,,,Y,81710.57,18091.46
New York City,Manhattan,7002054,001464,New York-Presbyterian Hospital - Columbia Presbyterian Center,30 to 49,100,M,Black/African American,Not Span/Hispanic,3,Emergency,Home or Self Care,2022,END003,Diabetes mellitus with complication,ADM014,REGIONAL ANESTHESIA,048,"PERIPHERAL, CRANIAL AND AUTONOMIC NERVE DISORDERS",01,DISEASES AND DISORDERS OF THE NERVOUS SYSTEM,2,Moderate,Moderate,Medical,Medicaid,,,,,Y,48701.40,10468.02
New York City,Manhattan,7002054,001464,New York-Presbyterian Hospital - Columbia Presbyterian Center,30 to 49,104,F,White,Spanish/Hispanic,13,Emergency,Home w/ Home Health Services,2022,END003,Diabetes mellitus with complication,CAR024,VENOUS AND ARTERIAL CATHETER PLACEMENT,048,"PERIPHERAL, CRANIAL AND AUTONOMIC NERVE DISORDERS",01,DISEASES AND DISORDERS OF THE NERVOUS SYSTEM,4,Extreme,Major,Medical,Medicaid,,,,,Y,243342.65,62164.67
New York City,Manhattan,7002053,001463,NYU Langone Hospitals,70 or Older,103,F,Other Race,Not Span/Hispanic,4,Emergency,Skilled Nursing Home,2022,NVS020,Other nervous system disorders (neither hereditary nor degenerative),,,048,"PERIPHERAL, CRANIAL AND AUTONOMIC NERVE DISORDERS",01,DISEASES AND DISORDERS OF THE NERVOUS SYSTEM,3,Major,Extreme,Medical,Medicare,Private Health Insurance,,,,Y,71261.64,21355.21
New York City,Manhattan,7002053,001463,NYU Langone Hospitals,18 to 29,112,F,Black/African American,Not Span/Hispanic,3,Emergency,Home or Self Care,2022,NVS017,Nerve and nerve root disorders,CNS002,LUMBAR PUNCTURE,048,"PERIPHERAL, CRANIAL AND AUTONOMIC NERVE DISORDERS",01,DISEASES AND DISORDERS OF THE NERVOUS SYSTEM,2,Moderate,Minor,Medical,Medicare,,,,,Y,90964.47,19974.16
New York City,Manhattan,7002001,001438,Bellevue Hospital Center,50 to 69,100,M,Black/African American,Unknown,4,Emergency,Home or Self Care,2022,NVS015,Polyneuropathies,IMG007,COMPUTERIZED TOMOGRAPHY (CT) WITHOUT CONTRAST,048,"PERIPHERAL, CRANIAL AND AUTONOMIC NERVE DISORDERS",01,DISEASES AND DISORDERS OF THE NERVOUS SYSTEM,1,Minor,Minor,Medical,Medicaid,,,,,Y,30971.13,17811.00
New York City,Manhattan,7002001,001438,Bellevue Hospital Center,50 to 69,112,M,Other Race,Unknown,2,Emergency,Home or Self Care,2022,MUS011,Spondylopathies/spondyloarthropathy (including infective),ADM021,"ADMINISTRATION OF THERAPEUTIC SUBSTANCES, NEC",048,"PERIPHERAL, CRANIAL AND AUTONOMIC NERVE DISORDERS",01,DISEASES AND DISORDERS OF THE NERVOUS SYSTEM,1,Minor,Minor,Medical,Medicaid,,,,,Y,29263.08,16828.73
Finger Lakes,Monroe,2701005,000413,Strong Memorial Hospital,0 to 17,145,M,White,Not Span/Hispanic,5,Emergency,Home or Self Care,2022,END003,Diabetes mellitus with complication,,,048,"PERIPHERAL, CRANIAL AND AUTONOMIC NERVE DISORDERS",01,DISEASES AND DISORDERS OF THE NERVOUS SYSTEM,2,Moderate,Minor,Medical,Blue Cross/Blue Shield,,,,,Y,13554.03,7051.45
Finger Lakes,Monroe,2701005,000413,Strong Memorial Hospital,18 to 29,146,F,Black/African American,Not Span/Hispanic,3,Emergency,Home or Self Care,2022,END003,Diabetes mellitus with complication,GIS001,ESOPHAGOGASTRODUODENOSCOPY (EGD) WITH BIOPSY,048,"PERIPHERAL, CRANIAL AND AUTONOMIC NERVE DISORDERS",01,DISEASES AND DISORDERS OF THE NERVOUS SYSTEM,2,Moderate,Moderate,Medical,Medicaid,,,,,Y,27715.08,8912.06
Finger Lakes,Monroe,2701005,000413,Strong Memorial Hospital,30 to 49,146,F,Black/African American,Not Span/Hispanic,2,Emergency,Home or Self Care,2022,END003,Diabetes mellitus with complication,ESA001,HEMODIALYSIS,048,"PERIPHERAL, CRANIAL AND AUTONOMIC NERVE DISORDERS",01,DISEASES AND DISORDERS OF THE NERVOUS SYSTEM,3,Major,Major,Medical,Medicare,Medicaid,,,,Y,16207.29,4949.54
Finger Lakes,Monroe,2701005,000413,Strong Memorial Hospital,50 to 69,146,F,Black/African American,Not Span/Hispanic,4,Emergency,Home w/ Home Health Services,2022,END003,Diabetes mellitus with complication,,,048,"PERIPHERAL, CRANIAL AND AUTONOMIC NERVE DISORDERS",01,DISEASES AND DISORDERS OF THE NERVOUS SYSTEM,3,Major,Moderate,Medical,Private Health Insurance,Medicare,,,,Y,18475.02,7409.04
New York City,Manhattan,7002001,001438,Bellevue Hospital Center,50 to 69,114,M,Black/African American,Unknown,3,Emergency,Home or Self Care,2022,END003,Diabetes mellitus with complication,ADM010,VACCINATIONS,048,"PERIPHERAL, CRANIAL AND AUTONOMIC NERVE DISORDERS",01,DISEASES AND DISORDERS OF THE NERVOUS SYSTEM,2,Moderate,Moderate,Medical,Medicare,Medicaid,,,,Y,32405.50,18635.88
New York City,Manhattan,7002053,001463,NYU Langone Hospitals,30 to 49,100,F,White,Not Span/Hispanic,1,Emergency,Inpatient Rehabilitation Facility,2022,MUS025,Other specified connective tissue disease,CNS002,LUMBAR PUNCTURE,048,"PERIPHERAL, CRANIAL AND AUTONOMIC NERVE DISORDERS",01,DISEASES AND DISORDERS OF THE NERVOUS SYSTEM,1,Minor,Minor,Medical,Blue Cross/Blue Shield,,,,,Y,85819.41,15509.02
New York City,Manhattan,7002001,001438,Bellevue Hospital Center,50 to 69,100,M,Other Race,Spanish/Hispanic,3,Emergency,Home or Self Care,2022,NVS019,Nervous system pain and pain syndromes,IMG007,COMPUTERIZED TOMOGRAPHY (CT) WITHOUT CONTRAST,048,"PERIPHERAL, CRANIAL AND AUTONOMIC NERVE DISORDERS",01,DISEASES AND DISORDERS OF THE NERVOUS SYSTEM,2,Moderate,Major,Medical,Medicaid,,,,,Y,37160.10,21370.18
New York City,Manhattan,7002054,001464,New York-Presbyterian Hospital - Columbia Presbyterian Center,50 to 69,104,M,Other Race,Spanish/Hispanic,4,Emergency,Home or Self Care,2022,END003,Diabetes mellitus with complication,ESA001,HEMODIALYSIS,048,"PERIPHERAL, CRANIAL AND AUTONOMIC NERVE DISORDERS",01,DISEASES AND DISORDERS OF THE NERVOUS SYSTEM,3,Major,Major,Medical,Medicaid,,,,,Y,67519.54,15845.56
New York City,Manhattan,7002054,001464,New York-Presbyterian Hospital - Columbia Presbyterian Center,30 to 49,100,M,Black/African American,Not Span/Hispanic,4,Emergency,Home or Self Care,2022,END003,Diabetes mellitus with complication,,,048,"PERIPHERAL, CRANIAL AND AUTONOMIC NERVE DISORDERS",01,DISEASES AND DISORDERS OF THE NERVOUS SYSTEM,2,Moderate,Minor,Medical,Medicaid,,,,,Y,67578.53,14912.21
New York City,Manhattan,7002054,001464,New York-Presbyterian Hospital - Columbia Presbyterian Center,70 or Older,104,F,Other Race,Unknown,2,Emergency,Skilled Nursing Home,2022,END003,Diabetes mellitus with complication,ADM017,ADMINISTRATION OF NUTRITIONAL AND ELECTROLYTIC SUBSTANCES,048,"PERIPHERAL, CRANIAL AND AUTONOMIC NERVE DISORDERS",01,DISEASES AND DISORDERS OF THE NERVOUS SYSTEM,2,Moderate,Moderate,Medical,Medicaid,,,,,Y,35212.70,7583.64
New York City,Manhattan,7002053,001463,NYU Langone Hospitals,50 to 69,113,M,Other Race,Spanish/Hispanic,6,Emergency,Home or Self Care,2022,NVS020,Other nervous system disorders (neither hereditary nor degenerative),EST001,PHERESIS THERAPY,048,"PERIPHERAL, CRANIAL AND AUTONOMIC NERVE DISORDERS",01,DISEASES AND DISORDERS OF THE NERVOUS SYSTEM,3,Major,Moderate,Medical,Medicare,Private Health Insurance,,,,N,131228.59,33704.43
New York City,Manhattan,7002001,001438,Bellevue Hospital Center,30 to 49,112,F,Other Race,Unknown,1,Emergency,Home or Self Care,2022,MUS011,Spondylopathies/spondyloarthropathy (including infective),IMG005,MAGNETIC RESONANCE IMAGING (MRI),048,"PERIPHERAL, CRANIAL AND AUTONOMIC NERVE DISORDERS",01,DISEASES AND DISORDERS OF THE NERVOUS SYSTEM,1,Minor,Minor,Medical,Private Health Insurance,,,,,Y,24689.19,14198.36
New York City,Manhattan,7002001,001438,Bellevue Hospital Center,50 to 69,111,M,White,Unknown,3,Emergency,Home w/ Home Health Services,2022,INJ025,"Injury to nerves, muscles and tendons, initial encounter",IMG005,MAGNETIC RESONANCE IMAGING (MRI),048,"PERIPHERAL, CRANIAL AND AUTONOMIC NERVE DISORDERS",01,DISEASES AND DISORDERS OF THE NERVOUS SYSTEM,2,Moderate,Moderate,Medical,Miscellaneous/Other,,,,,Y,27308.00,15704.39
Finger Lakes,Monroe,2701005,000413,Strong Memorial Hospital,18 to 29,146,M,Multi-racial,Not Span/Hispanic,1,Emergency,Home or Self Care,2022,INJ025,"Injury to nerves, muscles and tendons, initial encounter",,,048,"PERIPHERAL, CRANIAL AND AUTONOMIC NERVE DISORDERS",01,DISEASES AND DISORDERS OF THE NERVOUS SYSTEM,1,Minor,Minor,Medical,Medicaid,,,,,Y,6056.42,2431.17
Finger Lakes,Monroe,2701005,000413,Strong Memorial Hospital,30 to 49,146,M,Black/African American,Not Span/Hispanic,2,Emergency,Home or Self Care,2022,END003,Diabetes mellitus with complication,,,048,"PERIPHERAL, CRANIAL AND AUTONOMIC NERVE DISORDERS",01,DISEASES AND DISORDERS OF THE NERVOUS SYSTEM,1,Minor,Minor,Medical,Medicaid,,,,,Y,7717.81,3356.67
Finger Lakes,Monroe,2701005,000413,Strong Memorial Hospital,70 or Older,146,F,Black/African American,Not Span/Hispanic,9,Emergency,Home w/ Home Health Services,2022,NVS017,Nerve and nerve root disorders,,,048,"PERIPHERAL, CRANIAL AND AUTONOMIC NERVE DISORDERS",01,DISEASES AND DISORDERS OF THE NERVOUS SYSTEM,1,Minor,Moderate,Medical,Medicare,,,,,Y,28739.42,13481.26
Finger Lakes,Monroe,2701005,000413,Strong Memorial Hospital,50 to 69,146,M,Black/African American,Not Span/Hispanic,4,Elective,Home or Self Care,2022,NVS017,Nerve and nerve root disorders,MAM011,ELECTROENCEPHALOGRAM (EEG),048,"PERIPHERAL, CRANIAL AND AUTONOMIC NERVE DISORDERS",01,DISEASES AND DISORDERS OF THE NERVOUS SYSTEM,1,Minor,Minor,Medical,Blue Cross/Blue Shield,,,,,N,34840.28,14750.54
Finger Lakes,Monroe,2701005,000413,Strong Memorial Hospital,50 to 69,146,M,Black/African American,Not Span/Hispanic,2,Emergency,Home or Self Care,2022,END003,Diabetes mellitus with complication,,,048,"PERIPHERAL, CRANIAL AND AUTONOMIC NERVE DISORDERS",01,DISEASES AND DISORDERS OF THE NERVOUS SYSTEM,2,Moderate,Moderate,Medical,Medicare,Medicaid,,,,Y,8121.30,3476.57
Finger Lakes,Monroe,2701005,000413,Strong Memorial Hospital,50 to 69,146,F,Black/African American,Spanish/Hispanic,11,Emergency,Home or Self Care,2022,END003,Diabetes mellitus with complication,,,048,"PERIPHERAL, CRANIAL AND AUTONOMIC NERVE DISORDERS",01,DISEASES AND DISORDERS OF THE NERVOUS SYSTEM,3,Major,Major,Medical,Medicaid,,,,,Y,41609.16,17882.92
Finger Lakes,Monroe,2701005,000413,Strong Memorial Hospital,50 to 69,146,F,Black/African American,Not Span/Hispanic,6,Emergency,Home w/ Home Health Services,2022,END003,Diabetes mellitus with complication,,,048,"PERIPHERAL, CRANIAL AND AUTONOMIC NERVE DISORDERS",01,DISEASES AND DISORDERS OF THE NERVOUS SYSTEM,3,Major,Major,Medical,Medicare,Medicaid,,,,Y,21176.32,9448.05
New York City,Manhattan,7002054,001464,New York-Presbyterian Hospital - Columbia Presbyterian Center,50 to 69,109,M,White,Unknown,1,Emergency,Home or Self Care,2022,NVS015,Polyneuropathies,IMG006,COMPUTERIZED TOMOGRAPHY (CT) WITH CONTRAST,048,"PERIPHERAL, CRANIAL AND AUTONOMIC NERVE DISORDERS",01,DISEASES AND DISORDERS OF THE NERVOUS SYSTEM,2,Moderate,Minor,Medical,Private Health Insurance,,,,,Y,34329.12,7318.61
New York City,Manhattan,7002054,001464,New York-Presbyterian Hospital - Columbia Presbyterian Center,50 to 69,104,M,Black/African American,Not Span/Hispanic,3,Emergency,Home w/ Home Health Services,2022,NVS015,Polyneuropathies,ADM017,ADMINISTRATION OF NUTRITIONAL AND ELECTROLYTIC SUBSTANCES,048,"PERIPHERAL, CRANIAL AND AUTONOMIC NERVE DISORDERS",01,DISEASES AND DISORDERS OF THE NERVOUS SYSTEM,3,Major,Major,Medical,Medicare,,,,,Y,62007.56,15045.12
New York City,Manhattan,7002054,001464,New York-Presbyterian Hospital - Columbia Presbyterian Center,18 to 29,100,F,Black/African American,Not Span/Hispanic,1,Emergency,Home or Self Care,2022,END003,Diabetes mellitus with complication,ADM014,REGIONAL ANESTHESIA,048,"PERIPHERAL, CRANIAL AND AUTONOMIC NERVE DISORDERS",01,DISEASES AND DISORDERS OF THE NERVOUS SYSTEM,2,Moderate,Minor,Medical,Medicaid,,,,,Y,28180.21,6291.06
Finger Lakes,Monroe,2701005,000413,Strong Memorial Hospital,18 to 29,146,M,Black/African American,Not Span/Hispanic,3,Emergency,Home or Self Care,2022,INJ025,"Injury to nerves, muscles and tendons, initial encounter",,,048,"PERIPHERAL, CRANIAL AND AUTONOMIC NERVE DISORDERS",01,DISEASES AND DISORDERS OF THE NERVOUS SYSTEM,2,Moderate,Minor,Medical,Medicaid,,,,,Y,11194.27,5224.12
New York City,Manhattan,7002001,001438,Bellevue Hospital Center,50 to 69,112,M,Black/African American,Unknown,4,Emergency,Home or Self Care,2022,END003,Diabetes mellitus with complication,ADM017,ADMINISTRATION OF NUTRITIONAL AND ELECTROLYTIC SUBSTANCES,048,"PERIPHERAL, CRANIAL AND AUTONOMIC NERVE DISORDERS",01,DISEASES AND DISORDERS OF THE NERVOUS SYSTEM,2,Moderate,Minor,Medical,Medicaid,,,,,Y,40722.52,23418.87
New York City,Manhattan,7002001,001438,Bellevue Hospital Center,30 to 49,100,F,Other Race,Spanish/Hispanic,5,Emergency,Home or Self Care,2022,END003,Diabetes mellitus with complication,MAM008,CARDIAC MONITORING,048,"PERIPHERAL, CRANIAL AND AUTONOMIC NERVE DISORDERS",01,DISEASES AND DISORDERS OF THE NERVOUS SYSTEM,2,Moderate,Minor,Medical,Medicaid,,,,,Y,44298.06,25475.11
New York City,Manhattan,7002053,001463,NYU Langone Hospitals,70 or Older,112,F,Black/African American,Not Span/Hispanic,3,Emergency,Skilled Nursing Home,2022,END003,Diabetes mellitus with complication,ADM001,TRANSFUSION OF BLOOD AND BLOOD PRODUCTS,048,"PERIPHERAL, CRANIAL AND AUTONOMIC NERVE DISORDERS",01,DISEASES AND DISORDERS OF THE NERVOUS SYSTEM,3,Major,Major,Medical,Medicare,Medicaid,,,,Y,70302.16,17329.97
New York City,Manhattan,7002053,001463,NYU Langone Hospitals,30 to 49,100,F,White,Not Span/Hispanic,21,Emergency,Home w/ Home Health Services,2022,END003,Diabetes mellitus with complication,GIS017,GASTROSTOMY,048,"PERIPHERAL, CRANIAL AND AUTONOMIC NERVE DISORDERS",01,DISEASES AND DISORDERS OF THE NERVOUS SYSTEM,3,Major,Moderate,Medical,Blue Cross/Blue Shield,Private Health Insurance,,,,Y,485329.87,114141.62
New York City,Manhattan,7002053,001463,NYU Langone Hospitals,70 or Older,112,M,White,Not Span/Hispanic,9,Emergency,Skilled Nursing Home,2022,NVS017,Nerve and nerve root disorders,ADM005,ADMINISTRATION OF THROMBOLYTICS AND PLATELET INHIBITORS,048,"PERIPHERAL, CRANIAL AND AUTONOMIC NERVE DISORDERS",01,DISEASES AND DISORDERS OF THE NERVOUS SYSTEM,3,Major,Major,Medical,Blue Cross/Blue Shield,Medicare,,,,Y,189993.14,51100.77
New York City,Manhattan,7002054,001464,New York-Presbyterian Hospital - Columbia Presbyterian Center,50 to 69,100,F,Black/African American,Not Span/Hispanic,3,Emergency,Home or Self Care,2022,END003,Diabetes mellitus with complication,ADM021,"ADMINISTRATION OF THERAPEUTIC SUBSTANCES, NEC",048,"PERIPHERAL, CRANIAL AND AUTONOMIC NERVE DISORDERS",01,DISEASES AND DISORDERS OF THE NERVOUS SYSTEM,2,Moderate,Moderate,Medical,Private Health Insurance,,,,,Y,44418.60,9282.36
New York City,Manhattan,7002054,001464,New York-Presbyterian Hospital - Columbia Presbyterian Center,50 to 69,100,F,White,Spanish/Hispanic,3,Emergency,Home or Self Care,2022,END003,Diabetes mellitus with complication,ESA001,HEMODIALYSIS,048,"PERIPHERAL, CRANIAL AND AUTONOMIC NERVE DISORDERS",01,DISEASES AND DISORDERS OF THE NERVOUS SYSTEM,3,Major,Major,Medical,Medicare,Medicaid,,,,Y,59818.87,14035.35
New York City,Manhattan,7002054,001464,New York-Presbyterian Hospital - Columbia Presbyterian Center,50 to 69,100,F,Other Race,Spanish/Hispanic,1,Emergency,Home or Self Care,2022,END003,Diabetes mellitus with complication,ADM017,ADMINISTRATION OF NUTRITIONAL AND ELECTROLYTIC SUBSTANCES,048,"PERIPHERAL, CRANIAL AND AUTONOMIC NERVE DISORDERS",01,DISEASES AND DISORDERS OF THE NERVOUS SYSTEM,1,Minor,Minor,Medical,Medicaid,,,,,Y,19164.18,4018.09
New York City,Manhattan,7002054,001464,New York-Presbyterian Hospital - Columbia Presbyterian Center,30 to 49,100,M,Black/African American,Not Span/Hispanic,2,Emergency,Home or Self Care,2022,END003,Diabetes mellitus with complication,,,048,"PERIPHERAL, CRANIAL AND AUTONOMIC NERVE DISORDERS",01,DISEASES AND DISORDERS OF THE NERVOUS SYSTEM,3,Major,Moderate,Medical,Medicaid,,,,,Y,34799.50,7379.90
Long Island,Nassau,2951001,000541,North Shore University Hospital,70 or Older,115,M,White,Not Span/Hispanic,14,Emergency,Skilled Nursing Home,2022,NVS020,Other nervous system disorders (neither hereditary nor degenerative),MAM011,ELECTROENCEPHALOGRAM (EEG),048,"PERIPHERAL, CRANIAL AND AUTONOMIC NERVE DISORDERS",01,DISEASES AND DISORDERS OF THE NERVOUS SYSTEM,2,Moderate,Major,Medical,Medicare,Blue Cross/Blue Shield,,,,Y,195350.23,29518.47
Long Island,Nassau,2951001,000541,North Shore University Hospital,30 to 49,115,F,Other Race,Spanish/Hispanic,17,Emergency,Left Against Medical Advice,2022,END003,Diabetes mellitus with complication,OTR004,ISOLATION PROCEDURES,048,"PERIPHERAL, CRANIAL AND AUTONOMIC NERVE DISORDERS",01,DISEASES AND DISORDERS OF THE NERVOUS SYSTEM,3,Major,Major,Medical,Medicare,Medicare,Medicaid,,,Y,218420.04,38819.71
Long Island,Nassau,2951001,000541,North Shore University Hospital,70 or Older,113,F,White,Not Span/Hispanic,2,Emergency,Home or Self Care,2022,INJ025,"Injury to nerves, muscles and tendons, initial encounter",,,048,"PERIPHERAL, CRANIAL AND AUTONOMIC NERVE DISORDERS",01,DISEASES AND DISORDERS OF THE NERVOUS SYSTEM,2,Moderate,Moderate,Medical,Medicare,Private Health Insurance,,,,Y,42051.37,5772.99
Long Island,Nassau,2951001,000541,North Shore University Hospital,70 or Older,113,M,Other Race,Not Span/Hispanic,8,Emergency,Skilled Nursing Home,2022,END003,Diabetes mellitus with complication,ADM019,POTENTIAL COVID-19 THERAPIES,048,"PERIPHERAL, CRANIAL AND AUTONOMIC NERVE DISORDERS",01,DISEASES AND DISORDERS OF THE NERVOUS SYSTEM,3,Major,Major,Medical,Medicare,Medicare,,,,Y,114210.90,18282.67
Long Island,Nassau,2951001,000541,North Shore University Hospital,50 to 69,114,M,Black/African American,Not Span/Hispanic,4,Emergency,Home or Self Care,2022,END003,Diabetes mellitus with complication,,,048,"PERIPHERAL, CRANIAL AND AUTONOMIC NERVE DISORDERS",01,DISEASES AND DISORDERS OF THE NERVOUS SYSTEM,2,Moderate,Moderate,Medical,Medicaid,Medicaid,,,,Y,55732.92,9130.30
Long Island,Nassau,2951001,000541,North Shore University Hospital,30 to 49,114,F,Black/African American,Not Span/Hispanic,8,Emergency,Home or Self Care,2022,END003,Diabetes mellitus with complication,,,048,"PERIPHERAL, CRANIAL AND AUTONOMIC NERVE DISORDERS",01,DISEASES AND DISORDERS OF THE NERVOUS SYSTEM,3,Major,Moderate,Medical,Medicaid,Medicaid,,,,Y,117854.95,19312.99