Hospital Service Area,Hospital County,Operating Certificate Number,Permanent Facility Id,Facility Name,Age Group,Zip Code - 3 digits,Gender,Race,Ethnicity,Length of Stay,Type of Admission,Patient Disposition,Discharge Year,CCS Diagnosis Code,CCS Diagnosis Description,CCS Procedure Code,CCS Procedure Description,APR DRG Code,APR DRG Description,APR MDC Code,APR MDC Description,APR Severity of Illness Code,APR Severity of Illness Description,APR Risk of Mortality,APR Medical Surgical Description,Payment Typology 1,Payment Typology 2,Payment Typology 3,Birth Weight,Abortion Edit Indicator,Emergency Department Indicator,Total Charges,Total Costs
New York City,Manhattan,7002054,001464,New York-Presbyterian Hospital - Columbia Presbyterian Center,50 to 69,109,M,White,Not Span/Hispanic,1,Elective,Home or Self Care,2022,NEO039,Male reproductive system cancers - prostate,MRS003,PROSTATECTOMY,480,MAJOR MALE PELVIC PROCEDURES,12,DISEASES AND DISORDERS OF THE MALE REPRODUCTIVE SYSTEM,2,Moderate,Minor,Surgical,Private Health Insurance,,,,,N,60903.51,18411.70
New York City,Manhattan,7002053,001463,NYU Langone Hospitals,70 or Older,113,M,White,Not Span/Hispanic,1,Elective,Home or Self Care,2022,GEN012,Hyperplasia of prostate,MRS003,PROSTATECTOMY,480,MAJOR MALE PELVIC PROCEDURES,12,DISEASES AND DISORDERS OF THE MALE REPRODUCTIVE SYSTEM,1,Minor,Minor,Surgical,Private Health Insurance,,,,,N,67312.34,12372.74
New York City,Manhattan,7002053,001463,NYU Langone Hospitals,50 to 69,114,M,Other Race,Not Span/Hispanic,1,Elective,Home w/ Home Health Services,2022,NEO039,Male reproductive system cancers - prostate,MRS003,PROSTATECTOMY,480,MAJOR MALE PELVIC PROCEDURES,12,DISEASES AND DISORDERS OF THE MALE REPRODUCTIVE SYSTEM,1,Minor,Moderate,Surgical,Blue Cross/Blue Shield,,,,,N,175553.84,27412.46
New York City,Manhattan,7002053,001463,NYU Langone Hospitals,50 to 69,OOS,M,Other Race,Not Span/Hispanic,1,Elective,Home or Self Care,2022,NEO039,Male reproductive system cancers - prostate,MRS003,PROSTATECTOMY,480,MAJOR MALE PELVIC PROCEDURES,12,DISEASES AND DISORDERS OF THE MALE REPRODUCTIVE SYSTEM,1,Minor,Minor,Surgical,Medicare,,,,,N,167127.14,25690.45
New York City,Manhattan,7002053,001463,NYU Langone Hospitals,70 or Older,117,M,White,Not Span/Hispanic,1,Elective,Home or Self Care,2022,NEO039,Male reproductive system cancers - prostate,MRS003,PROSTATECTOMY,480,MAJOR MALE PELVIC PROCEDURES,12,DISEASES AND DISORDERS OF THE MALE REPRODUCTIVE SYSTEM,2,Moderate,Minor,Surgical,Medicare,Medicare,,,,N,160970.52,24810.47
New York City,Manhattan,7002053,001463,NYU Langone Hospitals,50 to 69,OOS,M,Black/African American,Not Span/Hispanic,2,Elective,Home w/ Home Health Services,2022,NEO039,Male reproductive system cancers - prostate,MRS003,PROSTATECTOMY,480,MAJOR MALE PELVIC PROCEDURES,12,DISEASES AND DISORDERS OF THE MALE REPRODUCTIVE SYSTEM,3,Major,Major,Surgical,Medicare,Medicare,,,,N,206329.43,34106.13
New York City,Manhattan,7002053,001463,NYU Langone Hospitals,50 to 69,100,M,White,Not Span/Hispanic,1,Elective,Home w/ Home Health Services,2022,NEO039,Male reproductive system cancers - prostate,MRS003,PROSTATECTOMY,480,MAJOR MALE PELVIC PROCEDURES,12,DISEASES AND DISORDERS OF THE MALE REPRODUCTIVE SYSTEM,1,Minor,Minor,Surgical,Medicare,Blue Cross/Blue Shield,,,,N,157183.47,24827.12
New York City,Manhattan,7002053,001463,NYU Langone Hospitals,70 or Older,100,M,White,Not Span/Hispanic,1,Elective,Home or Self Care,2022,NEO039,Male reproductive system cancers - prostate,MRS003,PROSTATECTOMY,480,MAJOR MALE PELVIC PROCEDURES,12,DISEASES AND DISORDERS OF THE MALE REPRODUCTIVE SYSTEM,1,Minor,Minor,Surgical,Medicare,,,,,N,174350.98,26606.76
New York City,Manhattan,7002053,001463,NYU Langone Hospitals,70 or Older,OOS,M,White,Not Span/Hispanic,1,Elective,Home or Self Care,2022,NEO039,Male reproductive system cancers - prostate,MRS003,PROSTATECTOMY,480,MAJOR MALE PELVIC PROCEDURES,12,DISEASES AND DISORDERS OF THE MALE REPRODUCTIVE SYSTEM,2,Moderate,Minor,Surgical,Medicare,,,,,N,160864.14,25056.85
New York City,Manhattan,7002053,001463,NYU Langone Hospitals,50 to 69,OOS,M,White,Not Span/Hispanic,1,Elective,Home or Self Care,2022,NEO039,Male reproductive system cancers - prostate,MRS003,PROSTATECTOMY,480,MAJOR MALE PELVIC PROCEDURES,12,DISEASES AND DISORDERS OF THE MALE REPRODUCTIVE SYSTEM,2,Moderate,Minor,Surgical,Blue Cross/Blue Shield,,,,,N,147688.06,22738.16
New York City,Manhattan,7002053,001463,NYU Langone Hospitals,70 or Older,100,M,White,Not Span/Hispanic,1,Elective,Home or Self Care,2022,NEO039,Male reproductive system cancers - prostate,MRS003,PROSTATECTOMY,480,MAJOR MALE PELVIC PROCEDURES,12,DISEASES AND DISORDERS OF THE MALE REPRODUCTIVE SYSTEM,2,Moderate,Moderate,Surgical,Medicare,,,,,N,185551.79,28652.12
New York City,Manhattan,7002053,001463,NYU Langone Hospitals,50 to 69,,M,Other Race,Not Span/Hispanic,1,Elective,Home or Self Care,2022,NEO039,Male reproductive system cancers - prostate,MRS003,PROSTATECTOMY,480,MAJOR MALE PELVIC PROCEDURES,12,DISEASES AND DISORDERS OF THE MALE REPRODUCTIVE SYSTEM,2,Moderate,Moderate,Surgical,Private Health Insurance,,,,,N,69212.93,12602.34
New York City,Manhattan,7002053,001463,NYU Langone Hospitals,70 or Older,112,M,White,Not Span/Hispanic,1,Elective,Home or Self Care,2022,NEO039,Male reproductive system cancers - prostate,MRS003,PROSTATECTOMY,480,MAJOR MALE PELVIC PROCEDURES,12,DISEASES AND DISORDERS OF THE MALE REPRODUCTIVE SYSTEM,2,Moderate,Moderate,Surgical,Blue Cross/Blue Shield,,,,,N,180065.70,27750.93
New York City,Manhattan,7002053,001463,NYU Langone Hospitals,70 or Older,100,M,White,Not Span/Hispanic,1,Elective,Home or Self Care,2022,NEO039,Male reproductive system cancers - prostate,MRS004,PROSTATE AND SEMINAL VESICLE PROCEDURES (EXCLUDING PROSTATECTOMY),480,MAJOR MALE PELVIC PROCEDURES,12,DISEASES AND DISORDERS OF THE MALE REPRODUCTIVE SYSTEM,2,Moderate,Moderate,Surgical,Blue Cross/Blue Shield,,,,,N,211988.00,32145.09
New York City,Manhattan,7002053,001463,NYU Langone Hospitals,70 or Older,100,M,Black/African American,Not Span/Hispanic,1,Elective,Home or Self Care,2022,NEO039,Male reproductive system cancers - prostate,MRS004,PROSTATE AND SEMINAL VESICLE PROCEDURES (EXCLUDING PROSTATECTOMY),480,MAJOR MALE PELVIC PROCEDURES,12,DISEASES AND DISORDERS OF THE MALE REPRODUCTIVE SYSTEM,2,Moderate,Moderate,Surgical,Medicare,,,,,N,246655.28,36260.73
Finger Lakes,Monroe,2701005,000413,Strong Memorial Hospital,18 to 29,OOS,M,Other Race,Unknown,1,Elective,Home or Self Care,2022,NEO040,Male reproductive system cancers - testis,LYM003,LYMPH NODE DISSECTION,480,MAJOR MALE PELVIC PROCEDURES,12,DISEASES AND DISORDERS OF THE MALE REPRODUCTIVE SYSTEM,2,Moderate,Moderate,Surgical,Blue Cross/Blue Shield,,,,,N,44443.87,20213.22
New York City,Manhattan,7002001,001438,Bellevue Hospital Center,50 to 69,112,M,Black/African American,Spanish/Hispanic,1,Elective,Home or Self Care,2022,NEO039,Male reproductive system cancers - prostate,MRS003,PROSTATECTOMY,480,MAJOR MALE PELVIC PROCEDURES,12,DISEASES AND DISORDERS OF THE MALE REPRODUCTIVE SYSTEM,1,Minor,Minor,Surgical,Medicaid,,,,,N,59241.51,34068.84
New York City,Manhattan,7002053,001463,NYU Langone Hospitals,50 to 69,OOS,M,White,Not Span/Hispanic,1,Elective,Home or Self Care,2022,NEO039,Male reproductive system cancers - prostate,MRS003,PROSTATECTOMY,480,MAJOR MALE PELVIC PROCEDURES,12,DISEASES AND DISORDERS OF THE MALE REPRODUCTIVE SYSTEM,1,Minor,Minor,Surgical,Blue Cross/Blue Shield,,,,,N,143249.45,22262.04
New York City,Manhattan,7002053,001463,NYU Langone Hospitals,50 to 69,117,M,White,Not Span/Hispanic,1,Elective,Home or Self Care,2022,NEO039,Male reproductive system cancers - prostate,MRS003,PROSTATECTOMY,480,MAJOR MALE PELVIC PROCEDURES,12,DISEASES AND DISORDERS OF THE MALE REPRODUCTIVE SYSTEM,1,Minor,Moderate,Surgical,Blue Cross/Blue Shield,,,,,N,183915.86,28190.26
New York City,Manhattan,7002053,001463,NYU Langone Hospitals,50 to 69,103,M,White,Not Span/Hispanic,1,Elective,Home or Self Care,2022,NEO039,Male reproductive system cancers - prostate,MRS003,PROSTATECTOMY,480,MAJOR MALE PELVIC PROCEDURES,12,DISEASES AND DISORDERS OF THE MALE REPRODUCTIVE SYSTEM,2,Moderate,Minor,Surgical,Blue Cross/Blue Shield,,,,,N,154011.12,23460.49
New York City,Manhattan,7002053,001463,NYU Langone Hospitals,50 to 69,113,M,Other Race,Not Span/Hispanic,1,Elective,Home or Self Care,2022,NEO039,Male reproductive system cancers - prostate,MRS003,PROSTATECTOMY,480,MAJOR MALE PELVIC PROCEDURES,12,DISEASES AND DISORDERS OF THE MALE REPRODUCTIVE SYSTEM,2,Moderate,Moderate,Surgical,Blue Cross/Blue Shield,,,,,N,135155.56,21218.18
New York City,Manhattan,7002053,001463,NYU Langone Hospitals,18 to 29,112,M,Other Race,Not Span/Hispanic,2,Elective,Home or Self Care,2022,NEO040,Male reproductive system cancers - testis,GNR009,"RETROPERITONEAL PROCEDURES, NEC",480,MAJOR MALE PELVIC PROCEDURES,12,DISEASES AND DISORDERS OF THE MALE REPRODUCTIVE SYSTEM,3,Major,Major,Surgical,Medicaid,,,,,N,259150.78,45165.01
New York City,Manhattan,7002054,001464,New York-Presbyterian Hospital - Columbia Presbyterian Center,70 or Older,100,M,Other Race,Spanish/Hispanic,1,Elective,Home w/ Home Health Services,2022,NEO039,Male reproductive system cancers - prostate,MRS003,PROSTATECTOMY,480,MAJOR MALE PELVIC PROCEDURES,12,DISEASES AND DISORDERS OF THE MALE REPRODUCTIVE SYSTEM,2,Moderate,Minor,Surgical,Medicare,Medicaid,,,,N,69418.68,20799.10
Finger Lakes,Monroe,2701005,000413,Strong Memorial Hospital,50 to 69,144,M,White,Not Span/Hispanic,2,Elective,Home or Self Care,2022,NEO039,Male reproductive system cancers - prostate,MRS003,PROSTATECTOMY,480,MAJOR MALE PELVIC PROCEDURES,12,DISEASES AND DISORDERS OF THE MALE REPRODUCTIVE SYSTEM,2,Moderate,Minor,Surgical,Blue Cross/Blue Shield,,,,,N,57689.65,27819.18
New York City,Manhattan,7002053,001463,NYU Langone Hospitals,50 to 69,112,M,Black/African American,Not Span/Hispanic,3,Elective,Home or Self Care,2022,NEO039,Male reproductive system cancers - prostate,MRS003,PROSTATECTOMY,480,MAJOR MALE PELVIC PROCEDURES,12,DISEASES AND DISORDERS OF THE MALE REPRODUCTIVE SYSTEM,2,Moderate,Major,Surgical,Private Health Insurance,,,,,N,165105.21,40175.99
New York City,Manhattan,7002053,001463,NYU Langone Hospitals,30 to 49,115,M,White,Not Span/Hispanic,1,Elective,Home or Self Care,2022,NEO039,Male reproductive system cancers - prostate,MRS003,PROSTATECTOMY,480,MAJOR MALE PELVIC PROCEDURES,12,DISEASES AND DISORDERS OF THE MALE REPRODUCTIVE SYSTEM,1,Minor,Minor,Surgical,Private Health Insurance,,,,,N,76296.18,13320.63
New York City,Manhattan,7002053,001463,NYU Langone Hospitals,50 to 69,OOS,M,Black/African American,Not Span/Hispanic,1,Elective,Home or Self Care,2022,NEO039,Male reproductive system cancers - prostate,MRS003,PROSTATECTOMY,480,MAJOR MALE PELVIC PROCEDURES,12,DISEASES AND DISORDERS OF THE MALE REPRODUCTIVE SYSTEM,1,Minor,Minor,Surgical,Private Health Insurance,,,,,N,176710.16,26751.26
New York City,Manhattan,7002001,001438,Bellevue Hospital Center,50 to 69,100,M,Black/African American,Unknown,2,Elective,Home or Self Care,2022,NEO039,Male reproductive system cancers - prostate,MRS003,PROSTATECTOMY,480,MAJOR MALE PELVIC PROCEDURES,12,DISEASES AND DISORDERS OF THE MALE REPRODUCTIVE SYSTEM,1,Minor,Minor,Surgical,Self-Pay,,,,,N,63613.49,36583.10
New York City,Manhattan,7002001,001438,Bellevue Hospital Center,50 to 69,113,M,Multi-racial,Spanish/Hispanic,1,Elective,Home or Self Care,2022,NEO039,Male reproductive system cancers - prostate,MRS003,PROSTATECTOMY,480,MAJOR MALE PELVIC PROCEDURES,12,DISEASES AND DISORDERS OF THE MALE REPRODUCTIVE SYSTEM,1,Minor,Minor,Surgical,Medicaid,,,,,N,50541.33,29065.51
New York City,Manhattan,7002053,001463,NYU Langone Hospitals,70 or Older,103,M,White,Not Span/Hispanic,1,Elective,Home w/ Home Health Services,2022,NEO039,Male reproductive system cancers - prostate,MRS003,PROSTATECTOMY,480,MAJOR MALE PELVIC PROCEDURES,12,DISEASES AND DISORDERS OF THE MALE REPRODUCTIVE SYSTEM,3,Major,Major,Surgical,Medicare,,,,,N,185014.05,28115.21
New York City,Manhattan,7002053,001463,NYU Langone Hospitals,50 to 69,OOS,M,White,Not Span/Hispanic,1,Elective,Home or Self Care,2022,NEO039,Male reproductive system cancers - prostate,MRS003,PROSTATECTOMY,480,MAJOR MALE PELVIC PROCEDURES,12,DISEASES AND DISORDERS OF THE MALE REPRODUCTIVE SYSTEM,1,Minor,Moderate,Surgical,Medicare,,,,,N,170011.90,26224.00
New York City,Manhattan,7002053,001463,NYU Langone Hospitals,50 to 69,100,M,White,Not Span/Hispanic,1,Elective,Home or Self Care,2022,NEO039,Male reproductive system cancers - prostate,MRS003,PROSTATECTOMY,480,MAJOR MALE PELVIC PROCEDURES,12,DISEASES AND DISORDERS OF THE MALE REPRODUCTIVE SYSTEM,1,Minor,Minor,Surgical,Medicare,Medicare,,,,N,171273.68,26272.54
New York City,Manhattan,7002053,001463,NYU Langone Hospitals,70 or Older,113,M,White,Not Span/Hispanic,1,Elective,Home w/ Home Health Services,2022,NEO039,Male reproductive system cancers - prostate,MRS003,PROSTATECTOMY,480,MAJOR MALE PELVIC PROCEDURES,12,DISEASES AND DISORDERS OF THE MALE REPRODUCTIVE SYSTEM,2,Moderate,Moderate,Surgical,Medicare,,,,,N,144792.01,22733.12
Finger Lakes,Monroe,2701005,000413,Strong Memorial Hospital,50 to 69,145,M,Black/African American,Not Span/Hispanic,1,Elective,Home or Self Care,2022,NEO039,Male reproductive system cancers - prostate,MRS003,PROSTATECTOMY,480,MAJOR MALE PELVIC PROCEDURES,12,DISEASES AND DISORDERS OF THE MALE REPRODUCTIVE SYSTEM,2,Moderate,Minor,Surgical,Private Health Insurance,,,,,N,44378.93,20905.06
New York City,Manhattan,7002054,001464,New York-Presbyterian Hospital - Columbia Presbyterian Center,50 to 69,117,M,White,Not Span/Hispanic,1,Elective,Home or Self Care,2022,NEO039,Male reproductive system cancers - prostate,MRS003,PROSTATECTOMY,480,MAJOR MALE PELVIC PROCEDURES,12,DISEASES AND DISORDERS OF THE MALE REPRODUCTIVE SYSTEM,1,Minor,Minor,Surgical,Private Health Insurance,Private Health Insurance,,,,N,64465.46,19887.65
New York City,Manhattan,7002054,001464,New York-Presbyterian Hospital - Columbia Presbyterian Center,50 to 69,100,M,Other Race,Spanish/Hispanic,1,Elective,Home or Self Care,2022,NEO039,Male reproductive system cancers - prostate,MRS003,PROSTATECTOMY,480,MAJOR MALE PELVIC PROCEDURES,12,DISEASES AND DISORDERS OF THE MALE REPRODUCTIVE SYSTEM,1,Minor,Minor,Surgical,Medicaid,,,,,N,54646.43,16090.18
New York City,Manhattan,7002054,001464,New York-Presbyterian Hospital - Columbia Presbyterian Center,50 to 69,100,M,Other Race,Spanish/Hispanic,1,Elective,Home or Self Care,2022,NEO039,Male reproductive system cancers - prostate,MRS003,PROSTATECTOMY,480,MAJOR MALE PELVIC PROCEDURES,12,DISEASES AND DISORDERS OF THE MALE REPRODUCTIVE SYSTEM,1,Minor,Minor,Surgical,Private Health Insurance,,,,,N,61471.28,19249.04
Long Island,Nassau,2951001,000541,North Shore University Hospital,50 to 69,113,M,White,Not Span/Hispanic,2,Elective,Home or Self Care,2022,GEN012,Hyperplasia of prostate,MRS003,PROSTATECTOMY,480,MAJOR MALE PELVIC PROCEDURES,12,DISEASES AND DISORDERS OF THE MALE REPRODUCTIVE SYSTEM,1,Minor,Minor,Surgical,Private Health Insurance,,,,,N,72954.62,13568.09
New York City,Manhattan,7002053,001463,NYU Langone Hospitals,50 to 69,OOS,M,White,Not Span/Hispanic,1,Elective,Home or Self Care,2022,NEO039,Male reproductive system cancers - prostate,MRS003,PROSTATECTOMY,480,MAJOR MALE PELVIC PROCEDURES,12,DISEASES AND DISORDERS OF THE MALE REPRODUCTIVE SYSTEM,1,Minor,Minor,Surgical,Private Health Insurance,,,,,N,144276.28,22582.83
New York City,Manhattan,7002053,001463,NYU Langone Hospitals,50 to 69,113,M,White,Not Span/Hispanic,1,Elective,Home or Self Care,2022,NEO039,Male reproductive system cancers - prostate,MRS003,PROSTATECTOMY,480,MAJOR MALE PELVIC PROCEDURES,12,DISEASES AND DISORDERS OF THE MALE REPRODUCTIVE SYSTEM,2,Moderate,Moderate,Surgical,Blue Cross/Blue Shield,,,,,N,166767.84,25504.87
New York City,Manhattan,7002053,001463,NYU Langone Hospitals,50 to 69,OOS,M,White,Not Span/Hispanic,1,Elective,Home or Self Care,2022,NEO039,Male reproductive system cancers - prostate,MRS003,PROSTATECTOMY,480,MAJOR MALE PELVIC PROCEDURES,12,DISEASES AND DISORDERS OF THE MALE REPRODUCTIVE SYSTEM,3,Major,Major,Surgical,Private Health Insurance,,,,,N,149776.08,23090.44
New York City,Manhattan,7002053,001463,NYU Langone Hospitals,50 to 69,100,M,White,Not Span/Hispanic,1,Elective,Home or Self Care,2022,NEO039,Male reproductive system cancers - prostate,MRS003,PROSTATECTOMY,480,MAJOR MALE PELVIC PROCEDURES,12,DISEASES AND DISORDERS OF THE MALE REPRODUCTIVE SYSTEM,1,Minor,Moderate,Surgical,Blue Cross/Blue Shield,,,,,N,145125.11,22832.36
New York City,Manhattan,7002053,001463,NYU Langone Hospitals,50 to 69,100,M,White,Not Span/Hispanic,1,Elective,Home or Self Care,2022,NEO039,Male reproductive system cancers - prostate,MRS003,PROSTATECTOMY,480,MAJOR MALE PELVIC PROCEDURES,12,DISEASES AND DISORDERS OF THE MALE REPRODUCTIVE SYSTEM,2,Moderate,Moderate,Surgical,Blue Cross/Blue Shield,,,,,N,160994.20,24998.95
New York City,Manhattan,7002053,001463,NYU Langone Hospitals,50 to 69,104,M,Other Race,Unknown,1,Elective,Home or Self Care,2022,NEO039,Male reproductive system cancers - prostate,MRS003,PROSTATECTOMY,480,MAJOR MALE PELVIC PROCEDURES,12,DISEASES AND DISORDERS OF THE MALE REPRODUCTIVE SYSTEM,1,Minor,Minor,Surgical,Private Health Insurance,,,,,N,192837.53,28893.99
New York City,Manhattan,7002053,001463,NYU Langone Hospitals,50 to 69,112,M,Black/African American,Not Span/Hispanic,1,Elective,Home or Self Care,2022,NEO039,Male reproductive system cancers - prostate,MRS003,PROSTATECTOMY,480,MAJOR MALE PELVIC PROCEDURES,12,DISEASES AND DISORDERS OF THE MALE REPRODUCTIVE SYSTEM,1,Minor,Minor,Surgical,Medicare,Medicare,,,,N,175092.56,26291.62
New York City,Manhattan,7002053,001463,NYU Langone Hospitals,50 to 69,117,M,White,Not Span/Hispanic,1,Elective,Home or Self Care,2022,NEO039,Male reproductive system cancers - prostate,MRS003,PROSTATECTOMY,480,MAJOR MALE PELVIC PROCEDURES,12,DISEASES AND DISORDERS OF THE MALE REPRODUCTIVE SYSTEM,2,Moderate,Minor,Surgical,Private Health Insurance,,,,,N,142043.70,22145.92
New York City,Manhattan,7002053,001463,NYU Langone Hospitals,70 or Older,100,M,Other Race,Not Span/Hispanic,1,Elective,Home or Self Care,2022,NEO039,Male reproductive system cancers - prostate,MRS003,PROSTATECTOMY,480,MAJOR MALE PELVIC PROCEDURES,12,DISEASES AND DISORDERS OF THE MALE REPRODUCTIVE SYSTEM,1,Minor,Minor,Surgical,Medicare,,,,,N,153710.10,24014.24
New York City,Manhattan,7002053,001463,NYU Langone Hospitals,50 to 69,110,M,White,Not Span/Hispanic,1,Elective,Home or Self Care,2022,NEO039,Male reproductive system cancers - prostate,MRS003,PROSTATECTOMY,480,MAJOR MALE PELVIC PROCEDURES,12,DISEASES AND DISORDERS OF THE MALE REPRODUCTIVE SYSTEM,1,Minor,Minor,Surgical,Medicare,,,,,N,80334.36,14233.68
New York City,Manhattan,7002053,001463,NYU Langone Hospitals,50 to 69,119,M,White,Unknown,1,Elective,Home or Self Care,2022,NEO039,Male reproductive system cancers - prostate,MRS003,PROSTATECTOMY,480,MAJOR MALE PELVIC PROCEDURES,12,DISEASES AND DISORDERS OF THE MALE REPRODUCTIVE SYSTEM,2,Moderate,Moderate,Surgical,Private Health Insurance,,,,,N,176701.70,27080.97
New York City,Manhattan,7002053,001463,NYU Langone Hospitals,50 to 69,100,M,White,Not Span/Hispanic,2,Elective,Home w/ Home Health Services,2022,NEO039,Male reproductive system cancers - prostate,MRS003,PROSTATECTOMY,480,MAJOR MALE PELVIC PROCEDURES,12,DISEASES AND DISORDERS OF THE MALE REPRODUCTIVE SYSTEM,3,Major,Moderate,Surgical,Private Health Insurance,,,,,N,101517.87,19798.50
New York City,Manhattan,7002053,001463,NYU Langone Hospitals,50 to 69,100,M,Other Race,Not Span/Hispanic,1,Elective,Home or Self Care,2022,NEO039,Male reproductive system cancers - prostate,MRS003,PROSTATECTOMY,480,MAJOR MALE PELVIC PROCEDURES,12,DISEASES AND DISORDERS OF THE MALE REPRODUCTIVE SYSTEM,2,Moderate,Minor,Surgical,Private Health Insurance,,,,,N,164933.69,24931.12
New York City,Manhattan,7002053,001463,NYU Langone Hospitals,30 to 49,104,M,Black/African American,Not Span/Hispanic,1,Elective,Home or Self Care,2022,NEO039,Male reproductive system cancers - prostate,MRS003,PROSTATECTOMY,480,MAJOR MALE PELVIC PROCEDURES,12,DISEASES AND DISORDERS OF THE MALE REPRODUCTIVE SYSTEM,2,Moderate,Minor,Surgical,Private Health Insurance,,,,,N,136652.07,21530.12
New York City,Manhattan,7002053,001463,NYU Langone Hospitals,50 to 69,OOS,M,White,Not Span/Hispanic,1,Elective,Home w/ Home Health Services,2022,NEO039,Male reproductive system cancers - prostate,MRS003,PROSTATECTOMY,480,MAJOR MALE PELVIC PROCEDURES,12,DISEASES AND DISORDERS OF THE MALE REPRODUCTIVE SYSTEM,2,Moderate,Moderate,Surgical,Medicare,Medicare,,,,N,105535.05,17647.22
New York City,Manhattan,7002053,001463,NYU Langone Hospitals,70 or Older,103,M,White,Not Span/Hispanic,1,Elective,Home or Self Care,2022,NEO039,Male reproductive system cancers - prostate,MRS003,PROSTATECTOMY,480,MAJOR MALE PELVIC PROCEDURES,12,DISEASES AND DISORDERS OF THE MALE REPRODUCTIVE SYSTEM,1,Minor,Minor,Surgical,Medicare,,,,,N,131796.47,20681.96
New York City,Manhattan,7002053,001463,NYU Langone Hospitals,50 to 69,112,M,White,Not Span/Hispanic,1,Elective,Home or Self Care,2022,NEO039,Male reproductive system cancers - prostate,MRS003,PROSTATECTOMY,480,MAJOR MALE PELVIC PROCEDURES,12,DISEASES AND DISORDERS OF THE MALE REPRODUCTIVE SYSTEM,2,Moderate,Minor,Surgical,Private Health Insurance,,,,,N,164550.91,25389.15
New York City,Manhattan,7002053,001463,NYU Langone Hospitals,50 to 69,113,M,White,Not Span/Hispanic,1,Elective,Home or Self Care,2022,NEO039,Male reproductive system cancers - prostate,MRS003,PROSTATECTOMY,480,MAJOR MALE PELVIC PROCEDURES,12,DISEASES AND DISORDERS OF THE MALE REPRODUCTIVE SYSTEM,2,Moderate,Minor,Surgical,Private Health Insurance,,,,,N,63123.01,11894.74
New York City,Manhattan,7002053,001463,NYU Langone Hospitals,50 to 69,100,M,White,Not Span/Hispanic,1,Elective,Home or Self Care,2022,NEO039,Male reproductive system cancers - prostate,MRS003,PROSTATECTOMY,480,MAJOR MALE PELVIC PROCEDURES,12,DISEASES AND DISORDERS OF THE MALE REPRODUCTIVE SYSTEM,2,Moderate,Minor,Surgical,Medicare,,,,,N,190893.42,28939.58
New York City,Manhattan,7002053,001463,NYU Langone Hospitals,50 to 69,103,M,Other Race,Not Span/Hispanic,1,Elective,Home or Self Care,2022,NEO039,Male reproductive system cancers - prostate,MRS003,PROSTATECTOMY,480,MAJOR MALE PELVIC PROCEDURES,12,DISEASES AND DISORDERS OF THE MALE REPRODUCTIVE SYSTEM,2,Moderate,Moderate,Surgical,Medicare,,,,,N,159370.84,24168.47
New York City,Manhattan,7002053,001463,NYU Langone Hospitals,50 to 69,OOS,M,White,Not Span/Hispanic,1,Elective,Home or Self Care,2022,NEO039,Male reproductive system cancers - prostate,MRS003,PROSTATECTOMY,480,MAJOR MALE PELVIC PROCEDURES,12,DISEASES AND DISORDERS OF THE MALE REPRODUCTIVE SYSTEM,2,Moderate,Minor,Surgical,Private Health Insurance,,,,,N,147135.74,22597.61
New York City,Manhattan,7002053,001463,NYU Langone Hospitals,50 to 69,100,M,White,Not Span/Hispanic,1,Elective,Home or Self Care,2022,NEO039,Male reproductive system cancers - prostate,MRS003,PROSTATECTOMY,480,MAJOR MALE PELVIC PROCEDURES,12,DISEASES AND DISORDERS OF THE MALE REPRODUCTIVE SYSTEM,2,Moderate,Minor,Surgical,Private Health Insurance,,,,,N,158107.63,24763.82
New York City,Manhattan,7002053,001463,NYU Langone Hospitals,50 to 69,104,M,Black/African American,Not Span/Hispanic,1,Elective,Home or Self Care,2022,NEO039,Male reproductive system cancers - prostate,MRS003,PROSTATECTOMY,480,MAJOR MALE PELVIC PROCEDURES,12,DISEASES AND DISORDERS OF THE MALE REPRODUCTIVE SYSTEM,2,Moderate,Minor,Surgical,Private Health Insurance,,,,,N,92657.15,15614.62