Hospital Service Area,Hospital County,Operating Certificate Number,Permanent Facility Id,Facility Name,Age Group,Zip Code - 3 digits,Gender,Race,Ethnicity,Length of Stay,Type of Admission,Patient Disposition,Discharge Year,CCS Diagnosis Code,CCS Diagnosis Description,CCS Procedure Code,CCS Procedure Description,APR DRG Code,APR DRG Description,APR MDC Code,APR MDC Description,APR Severity of Illness Code,APR Severity of Illness Description,APR Risk of Mortality,APR Medical Surgical Description,Payment Typology 1,Payment Typology 2,Payment Typology 3,Birth Weight,Abortion Edit Indicator,Emergency Department Indicator,Total Charges,Total Costs
New York City,Manhattan,7002054,001464,New York-Presbyterian Hospital - Columbia Presbyterian Center,50 to 69,117,M,White,Not Span/Hispanic,2,Elective,Home or Self Care,2022,NEO039,Male reproductive system cancers - prostate,MRS003,PROSTATECTOMY,484,OTHER MALE REPRODUCTIVE SYSTEM AND RELATED PROCEDURES,12,DISEASES AND DISORDERS OF THE MALE REPRODUCTIVE SYSTEM,2,Moderate,Minor,Surgical,Private Health Insurance,,,,,N,74820.25,21929.54
New York City,Manhattan,7002054,001464,New York-Presbyterian Hospital - Columbia Presbyterian Center,50 to 69,112,M,White,Not Span/Hispanic,1,Elective,Home or Self Care,2022,NEO039,Male reproductive system cancers - prostate,MRS003,PROSTATECTOMY,484,OTHER MALE REPRODUCTIVE SYSTEM AND RELATED PROCEDURES,12,DISEASES AND DISORDERS OF THE MALE REPRODUCTIVE SYSTEM,2,Moderate,Minor,Surgical,Private Health Insurance,,,,,N,68955.49,20952.92
New York City,Manhattan,7002054,001464,New York-Presbyterian Hospital - Columbia Presbyterian Center,70 or Older,100,M,Other Race,Spanish/Hispanic,2,Elective,Home or Self Care,2022,GEN012,Hyperplasia of prostate,MRS003,PROSTATECTOMY,484,OTHER MALE REPRODUCTIVE SYSTEM AND RELATED PROCEDURES,12,DISEASES AND DISORDERS OF THE MALE REPRODUCTIVE SYSTEM,1,Minor,Minor,Surgical,Medicare,Private Health Insurance,,,,N,78976.14,23063.42
New York City,Manhattan,7002053,001463,NYU Langone Hospitals,50 to 69,112,M,White,Not Span/Hispanic,2,Emergency,Home or Self Care,2022,GEN016,Other specified male genital disorders,URN004,REMOVAL OF CALCULI AND OTHER MATTER FROM URINARY TRACT,484,OTHER MALE REPRODUCTIVE SYSTEM AND RELATED PROCEDURES,12,DISEASES AND DISORDERS OF THE MALE REPRODUCTIVE SYSTEM,2,Moderate,Moderate,Surgical,Medicare,,,,,Y,67569.78,14926.47
Finger Lakes,Monroe,2701005,000413,Strong Memorial Hospital,70 or Older,144,M,White,Not Span/Hispanic,5,Elective,Home or Self Care,2022,GEN012,Hyperplasia of prostate,MRS003,PROSTATECTOMY,484,OTHER MALE REPRODUCTIVE SYSTEM AND RELATED PROCEDURES,12,DISEASES AND DISORDERS OF THE MALE REPRODUCTIVE SYSTEM,2,Moderate,Major,Surgical,Medicare,,,,,N,46488.87,22921.50
Finger Lakes,Monroe,2701005,000413,Strong Memorial Hospital,70 or Older,144,M,White,Not Span/Hispanic,1,Elective,Home or Self Care,2022,GEN012,Hyperplasia of prostate,MRS004,PROSTATE AND SEMINAL VESICLE PROCEDURES (EXCLUDING PROSTATECTOMY),484,OTHER MALE REPRODUCTIVE SYSTEM AND RELATED PROCEDURES,12,DISEASES AND DISORDERS OF THE MALE REPRODUCTIVE SYSTEM,2,Moderate,Minor,Surgical,Medicare,,,,,N,36014.83,16954.68
Finger Lakes,Monroe,2701005,000413,Strong Memorial Hospital,70 or Older,144,M,White,Not Span/Hispanic,1,Elective,Home or Self Care,2022,GEN012,Hyperplasia of prostate,MRS003,PROSTATECTOMY,484,OTHER MALE REPRODUCTIVE SYSTEM AND RELATED PROCEDURES,12,DISEASES AND DISORDERS OF THE MALE REPRODUCTIVE SYSTEM,2,Moderate,Minor,Surgical,Medicare,,,,,N,42987.69,20436.24
New York City,Manhattan,7002053,001463,NYU Langone Hospitals,50 to 69,104,M,Other Race,Unknown,2,Elective,Home or Self Care,2022,GEN012,Hyperplasia of prostate,MRS003,PROSTATECTOMY,484,OTHER MALE REPRODUCTIVE SYSTEM AND RELATED PROCEDURES,12,DISEASES AND DISORDERS OF THE MALE REPRODUCTIVE SYSTEM,2,Moderate,Minor,Surgical,Private Health Insurance,,,,,N,163078.83,29222.18
New York City,Manhattan,7002053,001463,NYU Langone Hospitals,70 or Older,100,M,Black/African American,Not Span/Hispanic,1,Elective,Home or Self Care,2022,NEO039,Male reproductive system cancers - prostate,MRS003,PROSTATECTOMY,484,OTHER MALE REPRODUCTIVE SYSTEM AND RELATED PROCEDURES,12,DISEASES AND DISORDERS OF THE MALE REPRODUCTIVE SYSTEM,2,Moderate,Minor,Surgical,Medicare,,,,,N,137498.83,21642.89
New York City,Manhattan,7002001,001438,Bellevue Hospital Center,50 to 69,112,M,Black/African American,Unknown,1,Elective,Home or Self Care,2022,NEO039,Male reproductive system cancers - prostate,MRS003,PROSTATECTOMY,484,OTHER MALE REPRODUCTIVE SYSTEM AND RELATED PROCEDURES,12,DISEASES AND DISORDERS OF THE MALE REPRODUCTIVE SYSTEM,2,Moderate,Minor,Surgical,Medicare,,,,,N,62816.10,36124.53
New York City,Manhattan,7002001,001438,Bellevue Hospital Center,50 to 69,100,M,Other Race,Spanish/Hispanic,1,Elective,Home or Self Care,2022,NEO039,Male reproductive system cancers - prostate,MRS003,PROSTATECTOMY,484,OTHER MALE REPRODUCTIVE SYSTEM AND RELATED PROCEDURES,12,DISEASES AND DISORDERS OF THE MALE REPRODUCTIVE SYSTEM,2,Moderate,Minor,Surgical,Medicaid,,,,,N,52536.45,30212.87
New York City,Manhattan,7002001,001438,Bellevue Hospital Center,50 to 69,114,M,Other Race,Spanish/Hispanic,1,Elective,Home w/ Home Health Services,2022,NEO039,Male reproductive system cancers - prostate,MRS004,PROSTATE AND SEMINAL VESICLE PROCEDURES (EXCLUDING PROSTATECTOMY),484,OTHER MALE REPRODUCTIVE SYSTEM AND RELATED PROCEDURES,12,DISEASES AND DISORDERS OF THE MALE REPRODUCTIVE SYSTEM,2,Moderate,Minor,Surgical,Medicaid,,,,,N,63016.59,36239.83
Finger Lakes,Monroe,2701005,000413,Strong Memorial Hospital,50 to 69,146,M,Black/African American,Not Span/Hispanic,2,Elective,Home or Self Care,2022,GEN012,Hyperplasia of prostate,MRS003,PROSTATECTOMY,484,OTHER MALE REPRODUCTIVE SYSTEM AND RELATED PROCEDURES,12,DISEASES AND DISORDERS OF THE MALE REPRODUCTIVE SYSTEM,2,Moderate,Minor,Surgical,Medicare,,,,,N,42929.74,20679.89
New York City,Manhattan,7002053,001463,NYU Langone Hospitals,70 or Older,100,M,Black/African American,Not Span/Hispanic,1,Elective,Home or Self Care,2022,NEO039,Male reproductive system cancers - prostate,MRS003,PROSTATECTOMY,484,OTHER MALE REPRODUCTIVE SYSTEM AND RELATED PROCEDURES,12,DISEASES AND DISORDERS OF THE MALE REPRODUCTIVE SYSTEM,2,Moderate,Minor,Surgical,Medicare,,,,,N,176799.59,27326.51
New York City,Manhattan,7002053,001463,NYU Langone Hospitals,50 to 69,108,M,White,Not Span/Hispanic,1,Elective,Home or Self Care,2022,GEN012,Hyperplasia of prostate,MRS004,PROSTATE AND SEMINAL VESICLE PROCEDURES (EXCLUDING PROSTATECTOMY),484,OTHER MALE REPRODUCTIVE SYSTEM AND RELATED PROCEDURES,12,DISEASES AND DISORDERS OF THE MALE REPRODUCTIVE SYSTEM,1,Minor,Minor,Surgical,Private Health Insurance,,,,,N,156779.87,24363.59
New York City,Manhattan,7002001,001438,Bellevue Hospital Center,50 to 69,113,M,Other Race,Unknown,1,Elective,Home w/ Home Health Services,2022,GEN012,Hyperplasia of prostate,MRS003,PROSTATECTOMY,484,OTHER MALE REPRODUCTIVE SYSTEM AND RELATED PROCEDURES,12,DISEASES AND DISORDERS OF THE MALE REPRODUCTIVE SYSTEM,1,Minor,Minor,Surgical,Medicaid,,,,,N,72853.59,41896.93
New York City,Manhattan,7002001,001438,Bellevue Hospital Center,50 to 69,113,M,Other Race,Spanish/Hispanic,1,Elective,Home or Self Care,2022,NEO039,Male reproductive system cancers - prostate,MRS003,PROSTATECTOMY,484,OTHER MALE REPRODUCTIVE SYSTEM AND RELATED PROCEDURES,12,DISEASES AND DISORDERS OF THE MALE REPRODUCTIVE SYSTEM,2,Moderate,Minor,Surgical,Medicaid,,,,,N,60555.58,34824.55
New York City,Manhattan,7002001,001438,Bellevue Hospital Center,50 to 69,113,M,Other Race,Not Span/Hispanic,1,Elective,Home w/ Home Health Services,2022,GEN012,Hyperplasia of prostate,MRS003,PROSTATECTOMY,484,OTHER MALE REPRODUCTIVE SYSTEM AND RELATED PROCEDURES,12,DISEASES AND DISORDERS OF THE MALE REPRODUCTIVE SYSTEM,1,Minor,Minor,Surgical,Medicaid,,,,,N,61910.31,35603.63
New York City,Manhattan,7002054,001464,New York-Presbyterian Hospital - Columbia Presbyterian Center,50 to 69,100,M,White,Not Span/Hispanic,3,Elective,Home or Self Care,2022,NEO039,Male reproductive system cancers - prostate,MRS003,PROSTATECTOMY,484,OTHER MALE REPRODUCTIVE SYSTEM AND RELATED PROCEDURES,12,DISEASES AND DISORDERS OF THE MALE REPRODUCTIVE SYSTEM,3,Major,Minor,Surgical,Private Health Insurance,,,,,N,92228.60,26484.36
New York City,Manhattan,7002054,001464,New York-Presbyterian Hospital - Columbia Presbyterian Center,70 or Older,100,M,White,Not Span/Hispanic,1,Elective,Home or Self Care,2022,NEO039,Male reproductive system cancers - prostate,MRS003,PROSTATECTOMY,484,OTHER MALE REPRODUCTIVE SYSTEM AND RELATED PROCEDURES,12,DISEASES AND DISORDERS OF THE MALE REPRODUCTIVE SYSTEM,2,Moderate,Minor,Surgical,Private Health Insurance,Blue Cross/Blue Shield,,,,N,66955.65,19638.68
New York City,Manhattan,7002054,001464,New York-Presbyterian Hospital - Columbia Presbyterian Center,50 to 69,104,M,Other Race,Unknown,1,Elective,Home or Self Care,2022,NEO039,Male reproductive system cancers - prostate,MRS003,PROSTATECTOMY,484,OTHER MALE REPRODUCTIVE SYSTEM AND RELATED PROCEDURES,12,DISEASES AND DISORDERS OF THE MALE REPRODUCTIVE SYSTEM,2,Moderate,Minor,Surgical,Medicaid,,,,,N,76062.67,23132.35
New York City,Manhattan,7002053,001463,NYU Langone Hospitals,50 to 69,112,M,Other Race,Not Span/Hispanic,1,Elective,Home or Self Care,2022,NEO039,Male reproductive system cancers - prostate,MRS003,PROSTATECTOMY,484,OTHER MALE REPRODUCTIVE SYSTEM AND RELATED PROCEDURES,12,DISEASES AND DISORDERS OF THE MALE REPRODUCTIVE SYSTEM,3,Major,Minor,Surgical,Private Health Insurance,,,,,N,159801.75,24678.68
New York City,Manhattan,7002053,001463,NYU Langone Hospitals,50 to 69,104,M,Other Race,Spanish/Hispanic,1,Elective,Home or Self Care,2022,NEO039,Male reproductive system cancers - prostate,MRS003,PROSTATECTOMY,484,OTHER MALE REPRODUCTIVE SYSTEM AND RELATED PROCEDURES,12,DISEASES AND DISORDERS OF THE MALE REPRODUCTIVE SYSTEM,2,Moderate,Moderate,Surgical,Private Health Insurance,,,,,N,144232.32,22386.12
New York City,Manhattan,7002001,001438,Bellevue Hospital Center,70 or Older,104,M,Black/African American,Not Span/Hispanic,1,Elective,Home w/ Home Health Services,2022,NEO039,Male reproductive system cancers - prostate,MRS003,PROSTATECTOMY,484,OTHER MALE REPRODUCTIVE SYSTEM AND RELATED PROCEDURES,12,DISEASES AND DISORDERS OF THE MALE REPRODUCTIVE SYSTEM,2,Moderate,Minor,Surgical,Medicare,Medicaid,,,,N,64536.99,37114.19
Finger Lakes,Monroe,2701005,000413,Strong Memorial Hospital,70 or Older,146,M,Other Race,Spanish/Hispanic,1,Elective,Home or Self Care,2022,GEN012,Hyperplasia of prostate,MRS004,PROSTATE AND SEMINAL VESICLE PROCEDURES (EXCLUDING PROSTATECTOMY),484,OTHER MALE REPRODUCTIVE SYSTEM AND RELATED PROCEDURES,12,DISEASES AND DISORDERS OF THE MALE REPRODUCTIVE SYSTEM,2,Moderate,Minor,Surgical,Medicare,Medicaid,,,,N,35440.84,17337.24
Finger Lakes,Monroe,2701005,000413,Strong Memorial Hospital,50 to 69,148,M,White,Not Span/Hispanic,1,Elective,Home or Self Care,2022,GEN012,Hyperplasia of prostate,MRS003,PROSTATECTOMY,484,OTHER MALE REPRODUCTIVE SYSTEM AND RELATED PROCEDURES,12,DISEASES AND DISORDERS OF THE MALE REPRODUCTIVE SYSTEM,1,Minor,Minor,Surgical,Medicare,,,,,N,38111.39,18140.16
New York City,Manhattan,7002054,001464,New York-Presbyterian Hospital - Columbia Presbyterian Center,50 to 69,104,M,Other Race,Spanish/Hispanic,4,Elective,Home or Self Care,2022,NEO039,Male reproductive system cancers - prostate,MRS003,PROSTATECTOMY,484,OTHER MALE REPRODUCTIVE SYSTEM AND RELATED PROCEDURES,12,DISEASES AND DISORDERS OF THE MALE REPRODUCTIVE SYSTEM,3,Major,Moderate,Surgical,Medicare,Medicaid,,,,N,96614.28,25944.02
New York City,Manhattan,7002053,001463,NYU Langone Hospitals,70 or Older,113,M,White,Not Span/Hispanic,1,Elective,Home or Self Care,2022,GEN012,Hyperplasia of prostate,MRS004,PROSTATE AND SEMINAL VESICLE PROCEDURES (EXCLUDING PROSTATECTOMY),484,OTHER MALE REPRODUCTIVE SYSTEM AND RELATED PROCEDURES,12,DISEASES AND DISORDERS OF THE MALE REPRODUCTIVE SYSTEM,2,Moderate,Minor,Surgical,Medicare,Private Health Insurance,Blue Cross/Blue Shield,,,N,137317.55,21662.00
New York City,Manhattan,7002053,001463,NYU Langone Hospitals,70 or Older,,M,White,Spanish/Hispanic,1,Elective,Home or Self Care,2022,NEO039,Male reproductive system cancers - prostate,MRS003,PROSTATECTOMY,484,OTHER MALE REPRODUCTIVE SYSTEM AND RELATED PROCEDURES,12,DISEASES AND DISORDERS OF THE MALE REPRODUCTIVE SYSTEM,2,Moderate,Minor,Surgical,Medicare,,,,,N,151407.87,23207.49
New York City,Manhattan,7002053,001463,NYU Langone Hospitals,50 to 69,100,M,Black/African American,Not Span/Hispanic,1,Elective,Home or Self Care,2022,NEO039,Male reproductive system cancers - prostate,MRS003,PROSTATECTOMY,484,OTHER MALE REPRODUCTIVE SYSTEM AND RELATED PROCEDURES,12,DISEASES AND DISORDERS OF THE MALE REPRODUCTIVE SYSTEM,2,Moderate,Minor,Surgical,Blue Cross/Blue Shield,,,,,N,163454.20,24982.54
New York City,Manhattan,7002001,001438,Bellevue Hospital Center,70 or Older,113,M,Other Race,Unknown,7,Urgent,Court/Law Enforcement,2022,NEO039,Male reproductive system cancers - prostate,MRS003,PROSTATECTOMY,484,OTHER MALE REPRODUCTIVE SYSTEM AND RELATED PROCEDURES,12,DISEASES AND DISORDERS OF THE MALE REPRODUCTIVE SYSTEM,3,Major,Moderate,Surgical,Medicare,Medicaid,,,,N,108516.07,62405.86
New York City,Manhattan,7002054,001464,New York-Presbyterian Hospital - Columbia Presbyterian Center,50 to 69,104,M,Black/African American,Not Span/Hispanic,1,Elective,Home or Self Care,2022,NEO039,Male reproductive system cancers - prostate,MRS003,PROSTATECTOMY,484,OTHER MALE REPRODUCTIVE SYSTEM AND RELATED PROCEDURES,12,DISEASES AND DISORDERS OF THE MALE REPRODUCTIVE SYSTEM,2,Moderate,Minor,Surgical,Private Health Insurance,,,,,N,68490.30,21368.25
New York City,Manhattan,7002054,001464,New York-Presbyterian Hospital - Columbia Presbyterian Center,50 to 69,100,M,Black/African American,Not Span/Hispanic,1,Elective,Home w/ Home Health Services,2022,NEO039,Male reproductive system cancers - prostate,MRS003,PROSTATECTOMY,484,OTHER MALE REPRODUCTIVE SYSTEM AND RELATED PROCEDURES,12,DISEASES AND DISORDERS OF THE MALE REPRODUCTIVE SYSTEM,3,Major,Moderate,Surgical,Medicaid,,,,,N,61584.07,18637.52
New York City,Manhattan,7002054,001464,New York-Presbyterian Hospital - Columbia Presbyterian Center,50 to 69,105,M,White,Not Span/Hispanic,1,Elective,Home w/ Home Health Services,2022,NEO039,Male reproductive system cancers - prostate,MRS003,PROSTATECTOMY,484,OTHER MALE REPRODUCTIVE SYSTEM AND RELATED PROCEDURES,12,DISEASES AND DISORDERS OF THE MALE REPRODUCTIVE SYSTEM,2,Moderate,Minor,Surgical,Private Health Insurance,,,,,N,66078.62,20446.30
New York City,Manhattan,7002053,001463,NYU Langone Hospitals,70 or Older,100,M,White,Not Span/Hispanic,1,Elective,Home or Self Care,2022,NEO073,Benign neoplasms,MRS004,PROSTATE AND SEMINAL VESICLE PROCEDURES (EXCLUDING PROSTATECTOMY),484,OTHER MALE REPRODUCTIVE SYSTEM AND RELATED PROCEDURES,12,DISEASES AND DISORDERS OF THE MALE REPRODUCTIVE SYSTEM,2,Moderate,Minor,Surgical,Medicare,,,,,N,176305.70,27299.72
New York City,Manhattan,7002054,001464,New York-Presbyterian Hospital - Columbia Presbyterian Center,50 to 69,100,M,Other Race,Spanish/Hispanic,1,Elective,Home or Self Care,2022,NEO039,Male reproductive system cancers - prostate,MRS003,PROSTATECTOMY,484,OTHER MALE REPRODUCTIVE SYSTEM AND RELATED PROCEDURES,12,DISEASES AND DISORDERS OF THE MALE REPRODUCTIVE SYSTEM,2,Moderate,Minor,Surgical,Medicaid,,,,,N,58516.71,18070.63
New York City,Manhattan,7002054,001464,New York-Presbyterian Hospital - Columbia Presbyterian Center,50 to 69,114,M,Other Race,Spanish/Hispanic,1,Elective,Home or Self Care,2022,NEO039,Male reproductive system cancers - prostate,MRS003,PROSTATECTOMY,484,OTHER MALE REPRODUCTIVE SYSTEM AND RELATED PROCEDURES,12,DISEASES AND DISORDERS OF THE MALE REPRODUCTIVE SYSTEM,3,Major,Moderate,Surgical,Medicare,,,,,N,60024.45,17675.91
Hudson Valley,Dutchess,1302001,000181,Vassar Brothers Medical Center,50 to 69,126,M,Other Race,Not Span/Hispanic,12,Emergency,Home or Self Care,2022,GEN016,Other specified male genital disorders,LYM001,LYMPH NODE BIOPSY,484,OTHER MALE REPRODUCTIVE SYSTEM AND RELATED PROCEDURES,12,DISEASES AND DISORDERS OF THE MALE REPRODUCTIVE SYSTEM,3,Major,Major,Surgical,Medicaid,,,,,Y,72718.94,24197.33
New York City,Manhattan,7002001,001438,Bellevue Hospital Center,70 or Older,112,M,Other Race,Spanish/Hispanic,1,Elective,Home or Self Care,2022,GEN012,Hyperplasia of prostate,MRS003,PROSTATECTOMY,484,OTHER MALE REPRODUCTIVE SYSTEM AND RELATED PROCEDURES,12,DISEASES AND DISORDERS OF THE MALE REPRODUCTIVE SYSTEM,1,Minor,Minor,Surgical,Medicare,,,,,N,55897.24,32145.61
New York City,Manhattan,7002054,001464,New York-Presbyterian Hospital - Columbia Presbyterian Center,50 to 69,111,M,Other Race,Not Span/Hispanic,1,Elective,Home or Self Care,2022,NEO039,Male reproductive system cancers - prostate,MRS003,PROSTATECTOMY,484,OTHER MALE REPRODUCTIVE SYSTEM AND RELATED PROCEDURES,12,DISEASES AND DISORDERS OF THE MALE REPRODUCTIVE SYSTEM,2,Moderate,Minor,Surgical,Medicaid,,,,,N,70039.26,21213.44
Finger Lakes,Monroe,2701005,000413,Strong Memorial Hospital,50 to 69,142,M,White,Unknown,1,Elective,Home or Self Care,2022,NEO039,Male reproductive system cancers - prostate,MRS003,PROSTATECTOMY,484,OTHER MALE REPRODUCTIVE SYSTEM AND RELATED PROCEDURES,12,DISEASES AND DISORDERS OF THE MALE REPRODUCTIVE SYSTEM,3,Major,Minor,Surgical,Private Health Insurance,,,,,N,47032.50,21740.28
Long Island,Nassau,2951001,000541,North Shore University Hospital,70 or Older,114,M,White,Not Span/Hispanic,2,Elective,Home w/ Home Health Services,2022,GEN012,Hyperplasia of prostate,MRS003,PROSTATECTOMY,484,OTHER MALE REPRODUCTIVE SYSTEM AND RELATED PROCEDURES,12,DISEASES AND DISORDERS OF THE MALE REPRODUCTIVE SYSTEM,2,Moderate,Moderate,Surgical,Medicare,Blue Cross/Blue Shield,,,,N,80887.53,14988.69
Finger Lakes,Monroe,2701005,000413,Strong Memorial Hospital,70 or Older,145,M,White,Not Span/Hispanic,1,Elective,Home or Self Care,2022,GEN012,Hyperplasia of prostate,MRS004,PROSTATE AND SEMINAL VESICLE PROCEDURES (EXCLUDING PROSTATECTOMY),484,OTHER MALE REPRODUCTIVE SYSTEM AND RELATED PROCEDURES,12,DISEASES AND DISORDERS OF THE MALE REPRODUCTIVE SYSTEM,3,Major,Major,Surgical,Medicare,,,,,N,38248.34,18355.96
New York City,Manhattan,7002054,001464,New York-Presbyterian Hospital - Columbia Presbyterian Center,50 to 69,100,M,White,Spanish/Hispanic,1,Elective,Home or Self Care,2022,NEO039,Male reproductive system cancers - prostate,MRS003,PROSTATECTOMY,484,OTHER MALE REPRODUCTIVE SYSTEM AND RELATED PROCEDURES,12,DISEASES AND DISORDERS OF THE MALE REPRODUCTIVE SYSTEM,2,Moderate,Minor,Surgical,Medicare,,,,,N,62132.59,18686.33
New York City,Manhattan,7002054,001464,New York-Presbyterian Hospital - Columbia Presbyterian Center,50 to 69,104,M,Other Race,Spanish/Hispanic,6,Elective,Home w/ Home Health Services,2022,NEO039,Male reproductive system cancers - prostate,MRS003,PROSTATECTOMY,484,OTHER MALE REPRODUCTIVE SYSTEM AND RELATED PROCEDURES,12,DISEASES AND DISORDERS OF THE MALE REPRODUCTIVE SYSTEM,2,Moderate,Minor,Surgical,Medicaid,,,,,N,125810.46,33282.20
New York City,Manhattan,7002001,001438,Bellevue Hospital Center,50 to 69,100,M,Other Race,Spanish/Hispanic,1,Elective,Home or Self Care,2022,NEO039,Male reproductive system cancers - prostate,MRS003,PROSTATECTOMY,484,OTHER MALE REPRODUCTIVE SYSTEM AND RELATED PROCEDURES,12,DISEASES AND DISORDERS OF THE MALE REPRODUCTIVE SYSTEM,2,Moderate,Minor,Surgical,Private Health Insurance,,,,,N,62898.00,36171.63
Finger Lakes,Monroe,2701005,000413,Strong Memorial Hospital,50 to 69,146,M,White,Not Span/Hispanic,1,Elective,Home or Self Care,2022,GEN012,Hyperplasia of prostate,MRS004,PROSTATE AND SEMINAL VESICLE PROCEDURES (EXCLUDING PROSTATECTOMY),484,OTHER MALE REPRODUCTIVE SYSTEM AND RELATED PROCEDURES,12,DISEASES AND DISORDERS OF THE MALE REPRODUCTIVE SYSTEM,1,Minor,Minor,Surgical,Private Health Insurance,,,,,N,37460.77,17714.48
New York City,Manhattan,7002054,001464,New York-Presbyterian Hospital - Columbia Presbyterian Center,50 to 69,100,M,White,Not Span/Hispanic,1,Elective,Home or Self Care,2022,NEO039,Male reproductive system cancers - prostate,MRS003,PROSTATECTOMY,484,OTHER MALE REPRODUCTIVE SYSTEM AND RELATED PROCEDURES,12,DISEASES AND DISORDERS OF THE MALE REPRODUCTIVE SYSTEM,2,Moderate,Minor,Surgical,Private Health Insurance,,,,,N,68142.83,20871.09
New York City,Manhattan,7002054,001464,New York-Presbyterian Hospital - Columbia Presbyterian Center,30 to 49,100,M,Black/African American,Unknown,1,Elective,Home or Self Care,2022,NEO039,Male reproductive system cancers - prostate,MRS003,PROSTATECTOMY,484,OTHER MALE REPRODUCTIVE SYSTEM AND RELATED PROCEDURES,12,DISEASES AND DISORDERS OF THE MALE REPRODUCTIVE SYSTEM,2,Moderate,Minor,Surgical,Private Health Insurance,,,,,N,70270.89,20994.29
New York City,Manhattan,7002001,001438,Bellevue Hospital Center,50 to 69,113,M,Other Race,Unknown,2,Elective,Home or Self Care,2022,NEO039,Male reproductive system cancers - prostate,MRS003,PROSTATECTOMY,484,OTHER MALE REPRODUCTIVE SYSTEM AND RELATED PROCEDURES,12,DISEASES AND DISORDERS OF THE MALE REPRODUCTIVE SYSTEM,3,Major,Minor,Surgical,Medicare,,,,,N,75052.28,43161.37
Finger Lakes,Monroe,2701005,000413,Strong Memorial Hospital,70 or Older,146,M,White,Not Span/Hispanic,1,Elective,Home or Self Care,2022,GEN012,Hyperplasia of prostate,MRS004,PROSTATE AND SEMINAL VESICLE PROCEDURES (EXCLUDING PROSTATECTOMY),484,OTHER MALE REPRODUCTIVE SYSTEM AND RELATED PROCEDURES,12,DISEASES AND DISORDERS OF THE MALE REPRODUCTIVE SYSTEM,1,Minor,Minor,Surgical,Blue Cross/Blue Shield,Medicare,,,,N,33377.27,15896.04
Long Island,Nassau,2951001,000541,North Shore University Hospital,50 to 69,115,M,White,Not Span/Hispanic,1,Elective,Home or Self Care,2022,GEN012,Hyperplasia of prostate,MRS004,PROSTATE AND SEMINAL VESICLE PROCEDURES (EXCLUDING PROSTATECTOMY),484,OTHER MALE REPRODUCTIVE SYSTEM AND RELATED PROCEDURES,12,DISEASES AND DISORDERS OF THE MALE REPRODUCTIVE SYSTEM,2,Moderate,Minor,Surgical,Blue Cross/Blue Shield,Medicare,,,,N,57843.56,10880.05
Long Island,Nassau,2951001,000541,North Shore University Hospital,70 or Older,117,M,White,Not Span/Hispanic,1,Elective,Home or Self Care,2022,NEO073,Benign neoplasms,MRS004,PROSTATE AND SEMINAL VESICLE PROCEDURES (EXCLUDING PROSTATECTOMY),484,OTHER MALE REPRODUCTIVE SYSTEM AND RELATED PROCEDURES,12,DISEASES AND DISORDERS OF THE MALE REPRODUCTIVE SYSTEM,1,Minor,Minor,Surgical,Medicare,Medicaid,,,,N,65703.89,12245.18
Long Island,Nassau,2951001,000541,North Shore University Hospital,50 to 69,110,M,Other Race,Not Span/Hispanic,4,Emergency,Home or Self Care,2022,GEN012,Hyperplasia of prostate,GNR004,ENDOSCOPIC CONTROL OF BLEEDING,484,OTHER MALE REPRODUCTIVE SYSTEM AND RELATED PROCEDURES,12,DISEASES AND DISORDERS OF THE MALE REPRODUCTIVE SYSTEM,2,Moderate,Minor,Surgical,Private Health Insurance,,,,,Y,73049.01,12163.43
Long Island,Nassau,2951001,000541,North Shore University Hospital,70 or Older,115,M,Other Race,Spanish/Hispanic,3,Elective,Home w/ Home Health Services,2022,GEN012,Hyperplasia of prostate,MRS004,PROSTATE AND SEMINAL VESICLE PROCEDURES (EXCLUDING PROSTATECTOMY),484,OTHER MALE REPRODUCTIVE SYSTEM AND RELATED PROCEDURES,12,DISEASES AND DISORDERS OF THE MALE REPRODUCTIVE SYSTEM,1,Minor,Minor,Surgical,Medicare,Medicare,,,,N,107592.93,19967.70
Hudson Valley,Dutchess,1302001,000181,Vassar Brothers Medical Center,50 to 69,125,M,White,Not Span/Hispanic,1,Elective,Home or Self Care,2022,NEO039,Male reproductive system cancers - prostate,MRS003,PROSTATECTOMY,484,OTHER MALE REPRODUCTIVE SYSTEM AND RELATED PROCEDURES,12,DISEASES AND DISORDERS OF THE MALE REPRODUCTIVE SYSTEM,2,Moderate,Minor,Surgical,Blue Cross/Blue Shield,,,,,N,35331.25,14486.24