Hospital Service Area,Hospital County,Operating Certificate Number,Permanent Facility Id,Facility Name,Age Group,Zip Code - 3 digits,Gender,Race,Ethnicity,Length of Stay,Type of Admission,Patient Disposition,Discharge Year,CCS Diagnosis Code,CCS Diagnosis Description,CCS Procedure Code,CCS Procedure Description,APR DRG Code,APR DRG Description,APR MDC Code,APR MDC Description,APR Severity of Illness Code,APR Severity of Illness Description,APR Risk of Mortality,APR Medical Surgical Description,Payment Typology 1,Payment Typology 2,Payment Typology 3,Birth Weight,Abortion Edit Indicator,Emergency Department Indicator,Total Charges,Total Costs
New York City,Manhattan,7002054,001464,New York-Presbyterian Hospital - Columbia Presbyterian Center,50 to 69,100,M,Black/African American,Not Span/Hispanic,27,Emergency,Expired,2022,NEO039,Male reproductive system cancers - prostate,ADM014,REGIONAL ANESTHESIA,500,"MALIGNANCY, MALE REPRODUCTIVE SYSTEM",12,DISEASES AND DISORDERS OF THE MALE REPRODUCTIVE SYSTEM,3,Major,Major,Medical,Private Health Insurance,,,,,Y,357036.85,82493.34
New York City,Manhattan,7002053,001463,NYU Langone Hospitals,50 to 69,100,M,White,Not Span/Hispanic,4,Emergency,Home or Self Care,2022,NEO039,Male reproductive system cancers - prostate,URN003,URETER AND OTHER URINARY TRACT DILATION,500,"MALIGNANCY, MALE REPRODUCTIVE SYSTEM",12,DISEASES AND DISORDERS OF THE MALE REPRODUCTIVE SYSTEM,2,Moderate,Major,Medical,Medicare,Medicare,,,,Y,174825.52,34894.24
New York City,Manhattan,7002053,001463,NYU Langone Hospitals,50 to 69,105,M,Black/African American,Not Span/Hispanic,9,Elective,Home w/ Home Health Services,2022,NEO039,Male reproductive system cancers - prostate,MRS004,PROSTATE AND SEMINAL VESICLE PROCEDURES (EXCLUDING PROSTATECTOMY),500,"MALIGNANCY, MALE REPRODUCTIVE SYSTEM",12,DISEASES AND DISORDERS OF THE MALE REPRODUCTIVE SYSTEM,3,Major,Major,Medical,Medicare,Medicare,,,,N,212770.79,52915.79
New York City,Manhattan,7002054,001464,New York-Presbyterian Hospital - Columbia Presbyterian Center,70 or Older,104,M,Other Race,Spanish/Hispanic,2,Emergency,Home or Self Care,2022,NEO039,Male reproductive system cancers - prostate,,,500,"MALIGNANCY, MALE REPRODUCTIVE SYSTEM",12,DISEASES AND DISORDERS OF THE MALE REPRODUCTIVE SYSTEM,4,Extreme,Major,Medical,Medicare,Medicaid,,,,Y,34254.76,7501.03
New York City,Manhattan,7002054,001464,New York-Presbyterian Hospital - Columbia Presbyterian Center,70 or Older,112,M,Other Race,Unknown,2,Emergency,Skilled Nursing Home,2022,NEO042,Male reproductive system cancers - all other types,,,500,"MALIGNANCY, MALE REPRODUCTIVE SYSTEM",12,DISEASES AND DISORDERS OF THE MALE REPRODUCTIVE SYSTEM,2,Moderate,Moderate,Medical,Medicare,Private Health Insurance,,,,Y,41529.13,8905.55
Finger Lakes,Monroe,2701005,000413,Strong Memorial Hospital,70 or Older,144,M,White,Not Span/Hispanic,5,Emergency,Home w/ Home Health Services,2022,NEO039,Male reproductive system cancers - prostate,,,500,"MALIGNANCY, MALE REPRODUCTIVE SYSTEM",12,DISEASES AND DISORDERS OF THE MALE REPRODUCTIVE SYSTEM,3,Major,Major,Medical,Medicare,,,,,N,33283.42,17697.15
New York City,Manhattan,7002054,001464,New York-Presbyterian Hospital - Columbia Presbyterian Center,70 or Older,OOS,M,Other Race,Unknown,2,Elective,Home or Self Care,2022,NEO039,Male reproductive system cancers - prostate,,,500,"MALIGNANCY, MALE REPRODUCTIVE SYSTEM",12,DISEASES AND DISORDERS OF THE MALE REPRODUCTIVE SYSTEM,2,Moderate,Moderate,Medical,Medicare,Blue Cross/Blue Shield,,,,N,22863.14,4862.60
New York City,Manhattan,7002001,001438,Bellevue Hospital Center,70 or Older,112,M,Other Race,Spanish/Hispanic,6,Emergency,Home or Self Care,2022,NEO039,Male reproductive system cancers - prostate,ADM021,"ADMINISTRATION OF THERAPEUTIC SUBSTANCES, NEC",500,"MALIGNANCY, MALE REPRODUCTIVE SYSTEM",12,DISEASES AND DISORDERS OF THE MALE REPRODUCTIVE SYSTEM,2,Moderate,Moderate,Medical,Medicare,Medicaid,,,,Y,47970.49,27587.06
New York City,Manhattan,7002001,001438,Bellevue Hospital Center,18 to 29,104,M,Other Race,Spanish/Hispanic,50,Urgent,Home w/ Home Health Services,2022,NEO040,Male reproductive system cancers - testis,ADM012,CHEMOTHERAPY,500,"MALIGNANCY, MALE REPRODUCTIVE SYSTEM",12,DISEASES AND DISORDERS OF THE MALE REPRODUCTIVE SYSTEM,4,Extreme,Extreme,Medical,Medicaid,,,,,N,510579.14,293625.89
New York City,Manhattan,7002001,001438,Bellevue Hospital Center,50 to 69,116,M,Other Race,Unknown,5,Emergency,Home or Self Care,2022,NEO039,Male reproductive system cancers - prostate,MAM008,CARDIAC MONITORING,500,"MALIGNANCY, MALE REPRODUCTIVE SYSTEM",12,DISEASES AND DISORDERS OF THE MALE REPRODUCTIVE SYSTEM,2,Moderate,Moderate,Medical,Medicaid,,,,,Y,40449.90,23262.09
Hudson Valley,Dutchess,1302001,000181,Vassar Brothers Medical Center,70 or Older,125,M,White,Not Span/Hispanic,2,Emergency,Home or Self Care,2022,NEO039,Male reproductive system cancers - prostate,,,500,"MALIGNANCY, MALE REPRODUCTIVE SYSTEM",12,DISEASES AND DISORDERS OF THE MALE REPRODUCTIVE SYSTEM,2,Moderate,Moderate,Medical,Medicare,Private Health Insurance,,,,N,24604.84,5013.18
New York City,Manhattan,7002001,001438,Bellevue Hospital Center,50 to 69,100,M,Black/African American,Unknown,4,Emergency,Left Against Medical Advice,2022,NEO039,Male reproductive system cancers - prostate,ADM021,"ADMINISTRATION OF THERAPEUTIC SUBSTANCES, NEC",500,"MALIGNANCY, MALE REPRODUCTIVE SYSTEM",12,DISEASES AND DISORDERS OF THE MALE REPRODUCTIVE SYSTEM,2,Moderate,Moderate,Medical,Medicaid,,,,,Y,36348.04,20903.18
Hudson Valley,Dutchess,1302001,000181,Vassar Brothers Medical Center,70 or Older,126,M,White,Not Span/Hispanic,10,Emergency,Skilled Nursing Home,2022,NEO039,Male reproductive system cancers - prostate,URN005,NEPHROSTOMY AND URETEROSTOMY PROCEDURES (INCLUDING STENTS),500,"MALIGNANCY, MALE REPRODUCTIVE SYSTEM",12,DISEASES AND DISORDERS OF THE MALE REPRODUCTIVE SYSTEM,3,Major,Major,Medical,Medicare,,,,,Y,61109.69,19882.68
New York City,Manhattan,7002053,001463,NYU Langone Hospitals,50 to 69,100,M,White,Not Span/Hispanic,3,Emergency,Skilled Nursing Home,2022,NEO039,Male reproductive system cancers - prostate,ADM001,TRANSFUSION OF BLOOD AND BLOOD PRODUCTS,500,"MALIGNANCY, MALE REPRODUCTIVE SYSTEM",12,DISEASES AND DISORDERS OF THE MALE REPRODUCTIVE SYSTEM,3,Major,Major,Medical,Medicare,Medicaid,,,,Y,69464.33,18670.21
New York City,Manhattan,7002053,001463,NYU Langone Hospitals,70 or Older,100,M,Other Race,Not Span/Hispanic,5,Emergency,Skilled Nursing Home,2022,NEO039,Male reproductive system cancers - prostate,,,500,"MALIGNANCY, MALE REPRODUCTIVE SYSTEM",12,DISEASES AND DISORDERS OF THE MALE REPRODUCTIVE SYSTEM,3,Major,Major,Medical,Medicare,Medicare,,,,Y,103292.87,28629.35
New York City,Manhattan,7002053,001463,NYU Langone Hospitals,70 or Older,100,M,Other Race,Not Span/Hispanic,4,Emergency,Skilled Nursing Home,2022,NEO039,Male reproductive system cancers - prostate,,,500,"MALIGNANCY, MALE REPRODUCTIVE SYSTEM",12,DISEASES AND DISORDERS OF THE MALE REPRODUCTIVE SYSTEM,3,Major,Major,Medical,Medicare,Private Health Insurance,,,,Y,65718.48,21338.31
Capital/Adirond,Warren,5601000,001005,Glens Falls Hospital,70 or Older,128,M,White,Not Span/Hispanic,8,Emergency,Home w/ Home Health Services,2022,NEO039,Male reproductive system cancers - prostate,,,500,"MALIGNANCY, MALE REPRODUCTIVE SYSTEM",12,DISEASES AND DISORDERS OF THE MALE REPRODUCTIVE SYSTEM,3,Major,Major,Medical,Medicare,Blue Cross/Blue Shield,,,,Y,46359.55,24559.03
Long Island,Nassau,2951001,000541,North Shore University Hospital,70 or Older,115,M,White,Not Span/Hispanic,14,Emergency,Home w/ Home Health Services,2022,NEO039,Male reproductive system cancers - prostate,LYM007,BONE MARROW BIOPSY,500,"MALIGNANCY, MALE REPRODUCTIVE SYSTEM",12,DISEASES AND DISORDERS OF THE MALE REPRODUCTIVE SYSTEM,3,Major,Moderate,Medical,Medicare,Private Health Insurance,,,,Y,260143.84,43166.10
Long Island,Nassau,2951001,000541,North Shore University Hospital,70 or Older,115,M,Other Race,Spanish/Hispanic,4,Emergency,Home or Self Care,2022,NEO039,Male reproductive system cancers - prostate,RES002,"LUNG, PLEURA, OR DIAPHRAGM BIOPSY (NON-ENDOSCOPIC)",500,"MALIGNANCY, MALE REPRODUCTIVE SYSTEM",12,DISEASES AND DISORDERS OF THE MALE REPRODUCTIVE SYSTEM,2,Moderate,Moderate,Medical,Medicare,Medicare,,,,Y,86973.31,12469.02
New York City,Manhattan,7002053,001463,NYU Langone Hospitals,50 to 69,103,M,Other Race,Spanish/Hispanic,1,Elective,Home or Self Care,2022,NEO039,Male reproductive system cancers - prostate,,,500,"MALIGNANCY, MALE REPRODUCTIVE SYSTEM",12,DISEASES AND DISORDERS OF THE MALE REPRODUCTIVE SYSTEM,2,Moderate,Moderate,Medical,Private Health Insurance,,,,,N,15817.67,5309.62
New York City,Manhattan,7002053,001463,NYU Langone Hospitals,70 or Older,112,M,Black/African American,Not Span/Hispanic,3,Emergency,Home w/ Home Health Services,2022,NEO039,Male reproductive system cancers - prostate,,,500,"MALIGNANCY, MALE REPRODUCTIVE SYSTEM",12,DISEASES AND DISORDERS OF THE MALE REPRODUCTIVE SYSTEM,3,Major,Major,Medical,Medicare,Medicaid,,,,Y,55683.85,16848.19
Finger Lakes,Monroe,2701005,000413,Strong Memorial Hospital,50 to 69,146,M,Black/African American,Not Span/Hispanic,16,Emergency,Skilled Nursing Home,2022,NEO039,Male reproductive system cancers - prostate,ADM019,POTENTIAL COVID-19 THERAPIES,500,"MALIGNANCY, MALE REPRODUCTIVE SYSTEM",12,DISEASES AND DISORDERS OF THE MALE REPRODUCTIVE SYSTEM,3,Major,Major,Medical,Medicare,Medicaid,,,,Y,67454.13,32440.07
Long Island,Nassau,2951001,000541,North Shore University Hospital,70 or Older,115,M,White,Not Span/Hispanic,11,Emergency,Skilled Nursing Home,2022,NEO039,Male reproductive system cancers - prostate,ESA001,HEMODIALYSIS,500,"MALIGNANCY, MALE REPRODUCTIVE SYSTEM",12,DISEASES AND DISORDERS OF THE MALE REPRODUCTIVE SYSTEM,3,Major,Extreme,Medical,Medicare,Private Health Insurance,,,,Y,181921.04,31554.93
New York City,Manhattan,7002054,001464,New York-Presbyterian Hospital - Columbia Presbyterian Center,70 or Older,OOS,M,Black/African American,Not Span/Hispanic,5,Emergency,Skilled Nursing Home,2022,NEO039,Male reproductive system cancers - prostate,,,500,"MALIGNANCY, MALE REPRODUCTIVE SYSTEM",12,DISEASES AND DISORDERS OF THE MALE REPRODUCTIVE SYSTEM,4,Extreme,Major,Medical,Medicare,Private Health Insurance,,,,Y,74875.31,16059.06
New York City,Manhattan,7002054,001464,New York-Presbyterian Hospital - Columbia Presbyterian Center,70 or Older,OOS,M,Black/African American,Not Span/Hispanic,1,Urgent,Expired,2022,NEO039,Male reproductive system cancers - prostate,,,500,"MALIGNANCY, MALE REPRODUCTIVE SYSTEM",12,DISEASES AND DISORDERS OF THE MALE REPRODUCTIVE SYSTEM,3,Major,Major,Medical,Medicare,,,,,N,11663.00,2530.41
Hudson Valley,Dutchess,1302001,000181,Vassar Brothers Medical Center,70 or Older,126,M,Other Race,Not Span/Hispanic,7,Emergency,Skilled Nursing Home,2022,NEO039,Male reproductive system cancers - prostate,,,500,"MALIGNANCY, MALE REPRODUCTIVE SYSTEM",12,DISEASES AND DISORDERS OF THE MALE REPRODUCTIVE SYSTEM,3,Major,Major,Medical,Medicare,Federal/State/Local/VA,,,,Y,37588.39,11842.55
Hudson Valley,Dutchess,1302001,000181,Vassar Brothers Medical Center,50 to 69,126,M,White,Not Span/Hispanic,4,Emergency,Home or Self Care,2022,NEO039,Male reproductive system cancers - prostate,ADM001,TRANSFUSION OF BLOOD AND BLOOD PRODUCTS,500,"MALIGNANCY, MALE REPRODUCTIVE SYSTEM",12,DISEASES AND DISORDERS OF THE MALE REPRODUCTIVE SYSTEM,3,Major,Major,Medical,Medicare,,,,,Y,27659.91,9279.71
New York City,Manhattan,7002001,001438,Bellevue Hospital Center,70 or Older,100,M,Black/African American,Unknown,10,Emergency,Home or Self Care,2022,NEO039,Male reproductive system cancers - prostate,URN003,URETER AND OTHER URINARY TRACT DILATION,500,"MALIGNANCY, MALE REPRODUCTIVE SYSTEM",12,DISEASES AND DISORDERS OF THE MALE REPRODUCTIVE SYSTEM,3,Major,Major,Medical,Medicare,Medicaid,,,,Y,100992.26,58079.03
New York City,Manhattan,7002054,001464,New York-Presbyterian Hospital - Columbia Presbyterian Center,70 or Older,112,M,White,Not Span/Hispanic,7,Emergency,Expired,2022,NEO039,Male reproductive system cancers - prostate,ADM014,REGIONAL ANESTHESIA,500,"MALIGNANCY, MALE REPRODUCTIVE SYSTEM",12,DISEASES AND DISORDERS OF THE MALE REPRODUCTIVE SYSTEM,4,Extreme,Major,Medical,Medicare,Private Health Insurance,,,,Y,117785.31,26151.86
New York City,Manhattan,7002054,001464,New York-Presbyterian Hospital - Columbia Presbyterian Center,50 to 69,104,M,White,Spanish/Hispanic,5,Emergency,Home or Self Care,2022,NEO039,Male reproductive system cancers - prostate,CAR024,VENOUS AND ARTERIAL CATHETER PLACEMENT,500,"MALIGNANCY, MALE REPRODUCTIVE SYSTEM",12,DISEASES AND DISORDERS OF THE MALE REPRODUCTIVE SYSTEM,1,Minor,Minor,Medical,Medicaid,,,,,Y,70479.78,15611.06
New York City,Manhattan,7002001,001438,Bellevue Hospital Center,50 to 69,112,M,Black/African American,Unknown,1,Elective,Home or Self Care,2022,NEO039,Male reproductive system cancers - prostate,URN004,REMOVAL OF CALCULI AND OTHER MATTER FROM URINARY TRACT,500,"MALIGNANCY, MALE REPRODUCTIVE SYSTEM",12,DISEASES AND DISORDERS OF THE MALE REPRODUCTIVE SYSTEM,2,Moderate,Moderate,Medical,Medicaid,,,,,N,20347.68,11701.63
Finger Lakes,Monroe,2701005,000413,Strong Memorial Hospital,50 to 69,146,M,Other Race,Spanish/Hispanic,25,Emergency,Home w/ Home Health Services,2022,NEO039,Male reproductive system cancers - prostate,MST002,BONE AND JOINT BIOPSY,500,"MALIGNANCY, MALE REPRODUCTIVE SYSTEM",12,DISEASES AND DISORDERS OF THE MALE REPRODUCTIVE SYSTEM,3,Major,Major,Medical,Medicare,Medicaid,,,,Y,72542.65,36315.14
Capital/Adirond,Warren,5601000,001005,Glens Falls Hospital,70 or Older,128,M,White,Not Span/Hispanic,2,Emergency,Hospice - Home,2022,NEO039,Male reproductive system cancers - prostate,GIS006,PARACENTESIS,500,"MALIGNANCY, MALE REPRODUCTIVE SYSTEM",12,DISEASES AND DISORDERS OF THE MALE REPRODUCTIVE SYSTEM,3,Major,Major,Medical,Medicare,Federal/State/Local/VA,,,,Y,16020.76,4441.72
Finger Lakes,Monroe,2701005,000413,Strong Memorial Hospital,70 or Older,144,M,White,Not Span/Hispanic,12,Emergency,Hospice - Medical Facility,2022,NEO039,Male reproductive system cancers - prostate,URN001,CYSTOSCOPY AND URETEROSCOPY (INCLUDING BIOPSY),500,"MALIGNANCY, MALE REPRODUCTIVE SYSTEM",12,DISEASES AND DISORDERS OF THE MALE REPRODUCTIVE SYSTEM,2,Moderate,Major,Medical,Medicare,,,,,Y,57267.10,27347.67
New York City,Manhattan,7002001,001438,Bellevue Hospital Center,50 to 69,104,M,Black/African American,Unknown,7,Emergency,Home or Self Care,2022,NEO039,Male reproductive system cancers - prostate,MST002,BONE AND JOINT BIOPSY,500,"MALIGNANCY, MALE REPRODUCTIVE SYSTEM",12,DISEASES AND DISORDERS OF THE MALE REPRODUCTIVE SYSTEM,2,Moderate,Moderate,Medical,Medicaid,,,,,Y,65742.95,37807.72
New York City,Manhattan,7002053,001463,NYU Langone Hospitals,70 or Older,104,M,Black/African American,Not Span/Hispanic,6,Emergency,Hospice - Home,2022,NEO039,Male reproductive system cancers - prostate,ADM001,TRANSFUSION OF BLOOD AND BLOOD PRODUCTS,500,"MALIGNANCY, MALE REPRODUCTIVE SYSTEM",12,DISEASES AND DISORDERS OF THE MALE REPRODUCTIVE SYSTEM,4,Extreme,Extreme,Medical,Medicare,,,,,Y,95481.59,31380.69
Hudson Valley,Dutchess,1302001,000181,Vassar Brothers Medical Center,50 to 69,124,M,White,Not Span/Hispanic,1,Emergency,Left Against Medical Advice,2022,NEO039,Male reproductive system cancers - prostate,URN006,BLADDER CATHETERIZATION AND DRAINAGE,500,"MALIGNANCY, MALE REPRODUCTIVE SYSTEM",12,DISEASES AND DISORDERS OF THE MALE REPRODUCTIVE SYSTEM,2,Moderate,Moderate,Medical,"Managed Care, Unspecified",,,,,Y,12698.11,3238.32
New York City,Manhattan,7002054,001464,New York-Presbyterian Hospital - Columbia Presbyterian Center,70 or Older,100,M,Other Race,Spanish/Hispanic,7,Emergency,Home or Self Care,2022,NEO039,Male reproductive system cancers - prostate,RES003,THORACENTESIS (DIAGNOSTIC),500,"MALIGNANCY, MALE REPRODUCTIVE SYSTEM",12,DISEASES AND DISORDERS OF THE MALE REPRODUCTIVE SYSTEM,3,Major,Extreme,Medical,Medicare,Private Health Insurance,,,,Y,121539.50,25445.27
Finger Lakes,Monroe,2701005,000413,Strong Memorial Hospital,70 or Older,144,M,White,Not Span/Hispanic,8,Emergency,Hospice - Home,2022,NEO039,Male reproductive system cancers - prostate,URN006,BLADDER CATHETERIZATION AND DRAINAGE,500,"MALIGNANCY, MALE REPRODUCTIVE SYSTEM",12,DISEASES AND DISORDERS OF THE MALE REPRODUCTIVE SYSTEM,1,Minor,Minor,Medical,Medicare,,,,,Y,20067.21,10804.03
New York City,Manhattan,7002053,001463,NYU Langone Hospitals,50 to 69,112,M,Black/African American,Not Span/Hispanic,8,Emergency,Home w/ Home Health Services,2022,NEO039,Male reproductive system cancers - prostate,ADM001,TRANSFUSION OF BLOOD AND BLOOD PRODUCTS,500,"MALIGNANCY, MALE REPRODUCTIVE SYSTEM",12,DISEASES AND DISORDERS OF THE MALE REPRODUCTIVE SYSTEM,3,Major,Major,Medical,Medicaid,,,,,Y,222428.22,58212.25
Long Island,Nassau,2951001,000541,North Shore University Hospital,30 to 49,114,M,White,Not Span/Hispanic,1,Emergency,Home or Self Care,2022,NEO040,Male reproductive system cancers - testis,,,500,"MALIGNANCY, MALE REPRODUCTIVE SYSTEM",12,DISEASES AND DISORDERS OF THE MALE REPRODUCTIVE SYSTEM,1,Minor,Minor,Medical,Private Health Insurance,Blue Cross/Blue Shield,,,,Y,31587.37,4377.39
New York City,Manhattan,7002053,001463,NYU Langone Hospitals,70 or Older,100,M,White,Not Span/Hispanic,1,Elective,Home or Self Care,2022,NEO039,Male reproductive system cancers - prostate,ADM012,CHEMOTHERAPY,500,"MALIGNANCY, MALE REPRODUCTIVE SYSTEM",12,DISEASES AND DISORDERS OF THE MALE REPRODUCTIVE SYSTEM,3,Major,Major,Medical,Medicare,,,,,N,8937.41,4613.78
Hudson Valley,Dutchess,1302001,000181,Vassar Brothers Medical Center,70 or Older,126,M,White,Not Span/Hispanic,21,Emergency,Skilled Nursing Home,2022,NEO039,Male reproductive system cancers - prostate,GNR009,"RETROPERITONEAL PROCEDURES, NEC",500,"MALIGNANCY, MALE REPRODUCTIVE SYSTEM",12,DISEASES AND DISORDERS OF THE MALE REPRODUCTIVE SYSTEM,3,Major,Major,Medical,Medicare,Blue Cross/Blue Shield,,,,Y,150900.50,66679.06
New York City,Manhattan,7002053,001463,NYU Langone Hospitals,50 to 69,100,M,Other Race,Not Span/Hispanic,1,Elective,Home or Self Care,2022,NEO039,Male reproductive system cancers - prostate,ADM012,CHEMOTHERAPY,500,"MALIGNANCY, MALE REPRODUCTIVE SYSTEM",12,DISEASES AND DISORDERS OF THE MALE REPRODUCTIVE SYSTEM,2,Moderate,Major,Medical,Medicare,Medicaid,,,,N,24118.86,8499.11
New York City,Manhattan,7002054,001464,New York-Presbyterian Hospital - Columbia Presbyterian Center,70 or Older,100,M,Other Race,Spanish/Hispanic,3,Emergency,Expired,2022,NEO039,Male reproductive system cancers - prostate,RES005,CHEST TUBE PLACEMENT AND THERAPEUTIC THORACENTESIS,500,"MALIGNANCY, MALE REPRODUCTIVE SYSTEM",12,DISEASES AND DISORDERS OF THE MALE REPRODUCTIVE SYSTEM,4,Extreme,Extreme,Medical,Medicare,Medicaid,,,,Y,97494.33,27232.20
Long Island,Nassau,2951001,000541,North Shore University Hospital,70 or Older,110,M,White,Not Span/Hispanic,9,Emergency,Expired,2022,NEO039,Male reproductive system cancers - prostate,RES007,AIRWAY INTUBATION,500,"MALIGNANCY, MALE REPRODUCTIVE SYSTEM",12,DISEASES AND DISORDERS OF THE MALE REPRODUCTIVE SYSTEM,4,Extreme,Extreme,Medical,Medicare,Medicare,,,,Y,138270.55,22276.13
New York City,Manhattan,7002053,001463,NYU Langone Hospitals,18 to 29,109,M,White,Not Span/Hispanic,5,Emergency,Home or Self Care,2022,NEO040,Male reproductive system cancers - testis,ADM012,CHEMOTHERAPY,500,"MALIGNANCY, MALE REPRODUCTIVE SYSTEM",12,DISEASES AND DISORDERS OF THE MALE REPRODUCTIVE SYSTEM,3,Major,Major,Medical,Medicaid,,,,,Y,118436.80,33589.91
Long Island,Nassau,2951001,000541,North Shore University Hospital,70 or Older,118,M,White,Not Span/Hispanic,2,Emergency,Home or Self Care,2022,NEO039,Male reproductive system cancers - prostate,GIS006,PARACENTESIS,500,"MALIGNANCY, MALE REPRODUCTIVE SYSTEM",12,DISEASES AND DISORDERS OF THE MALE REPRODUCTIVE SYSTEM,3,Major,Moderate,Medical,Medicare,Private Health Insurance,,,,Y,48732.03,7294.45
New York City,Manhattan,7002001,001438,Bellevue Hospital Center,50 to 69,112,M,White,Unknown,7,Emergency,Home or Self Care,2022,NEO039,Male reproductive system cancers - prostate,IMG007,COMPUTERIZED TOMOGRAPHY (CT) WITHOUT CONTRAST,500,"MALIGNANCY, MALE REPRODUCTIVE SYSTEM",12,DISEASES AND DISORDERS OF THE MALE REPRODUCTIVE SYSTEM,3,Major,Major,Medical,Medicaid,,,,,Y,57530.23,33084.71
Finger Lakes,Monroe,2701005,000413,Strong Memorial Hospital,50 to 69,146,M,Black/African American,Not Span/Hispanic,11,Emergency,Home or Self Care,2022,NEO039,Male reproductive system cancers - prostate,IMG006,COMPUTERIZED TOMOGRAPHY (CT) WITH CONTRAST,500,"MALIGNANCY, MALE REPRODUCTIVE SYSTEM",12,DISEASES AND DISORDERS OF THE MALE REPRODUCTIVE SYSTEM,3,Major,Major,Medical,Medicaid,,,,,Y,62672.03,20491.05
New York City,Manhattan,7002054,001464,New York-Presbyterian Hospital - Columbia Presbyterian Center,70 or Older,100,M,White,Unknown,27,Emergency,Expired,2022,NEO039,Male reproductive system cancers - prostate,ESA004,NON-INVASIVE VENTILATION,500,"MALIGNANCY, MALE REPRODUCTIVE SYSTEM",12,DISEASES AND DISORDERS OF THE MALE REPRODUCTIVE SYSTEM,4,Extreme,Extreme,Medical,Medicare,Medicaid,,,,Y,684521.21,214144.03
New York City,Manhattan,7002053,001463,NYU Langone Hospitals,70 or Older,100,M,White,Not Span/Hispanic,1,Elective,Home or Self Care,2022,NEO039,Male reproductive system cancers - prostate,MRS004,PROSTATE AND SEMINAL VESICLE PROCEDURES (EXCLUDING PROSTATECTOMY),500,"MALIGNANCY, MALE REPRODUCTIVE SYSTEM",12,DISEASES AND DISORDERS OF THE MALE REPRODUCTIVE SYSTEM,1,Minor,Minor,Medical,Medicare,,,,,N,68465.48,11383.47
Capital/Adirond,Warren,5601000,001005,Glens Falls Hospital,70 or Older,128,M,White,Not Span/Hispanic,3,Emergency,Home or Self Care,2022,NEO039,Male reproductive system cancers - prostate,GNR006,"CHEST WALL PROCEDURES, NEC",500,"MALIGNANCY, MALE REPRODUCTIVE SYSTEM",12,DISEASES AND DISORDERS OF THE MALE REPRODUCTIVE SYSTEM,3,Major,Major,Medical,Blue Cross/Blue Shield,Medicare,,,,Y,21385.73,6792.59
Long Island,Nassau,2951001,000541,North Shore University Hospital,50 to 69,114,M,Black/African American,Not Span/Hispanic,2,Elective,Home or Self Care,2022,NEO039,Male reproductive system cancers - prostate,RES004,BRONCHOSCOPY (THERAPEUTIC),500,"MALIGNANCY, MALE REPRODUCTIVE SYSTEM",12,DISEASES AND DISORDERS OF THE MALE REPRODUCTIVE SYSTEM,4,Extreme,Extreme,Medical,Medicare,Medicare,Medicaid,,,N,79646.02,14446.11
Hudson Valley,Dutchess,1302001,000181,Vassar Brothers Medical Center,50 to 69,OOS,M,Other Race,Unknown,1,Urgent,Home or Self Care,2022,NEO039,Male reproductive system cancers - prostate,,,500,"MALIGNANCY, MALE REPRODUCTIVE SYSTEM",12,DISEASES AND DISORDERS OF THE MALE REPRODUCTIVE SYSTEM,2,Moderate,Minor,Medical,"Managed Care, Unspecified",,,,,N,4187.10,1585.16
Finger Lakes,Monroe,2701005,000413,Strong Memorial Hospital,50 to 69,138,M,Other Race,Unknown,1,Elective,Home or Self Care,2022,NEO039,Male reproductive system cancers - prostate,MRS004,PROSTATE AND SEMINAL VESICLE PROCEDURES (EXCLUDING PROSTATECTOMY),500,"MALIGNANCY, MALE REPRODUCTIVE SYSTEM",12,DISEASES AND DISORDERS OF THE MALE REPRODUCTIVE SYSTEM,2,Moderate,Moderate,Medical,Medicare,Medicaid,,,,N,16266.14,6538.01
