Hospital Service Area,Hospital County,Operating Certificate Number,Permanent Facility Id,Facility Name,Age Group,Zip Code - 3 digits,Gender,Race,Ethnicity,Length of Stay,Type of Admission,Patient Disposition,Discharge Year,CCS Diagnosis Code,CCS Diagnosis Description,CCS Procedure Code,CCS Procedure Description,APR DRG Code,APR DRG Description,APR MDC Code,APR MDC Description,APR Severity of Illness Code,APR Severity of Illness Description,APR Risk of Mortality,APR Medical Surgical Description,Payment Typology 1,Payment Typology 2,Payment Typology 3,Birth Weight,Abortion Edit Indicator,Emergency Department Indicator,Total Charges,Total Costs
New York City,Manhattan,7002054,001464,New York-Presbyterian Hospital - Columbia Presbyterian Center,50 to 69,OOS,F,White,Not Span/Hispanic,1,Elective,Home or Self Care,2022,NEO035,Female reproductive system cancers - endometrium,FRS001,HYSTERECTOMY,512,UTERINE AND ADNEXA PROCEDURES FOR NON-OVARIAN AND NON-ADNEXAL MALIGNANCY,13,DISEASES AND DISORDERS OF THE FEMALE REPRODUCTIVE SYSTEM,2,Moderate,Minor,Surgical,Private Health Insurance,,,,,N,48762.28,14304.13
New York City,Manhattan,7002054,001464,New York-Presbyterian Hospital - Columbia Presbyterian Center,70 or Older,105,F,Other Race,Unknown,1,Elective,Home or Self Care,2022,NEO035,Female reproductive system cancers - endometrium,FRS001,HYSTERECTOMY,512,UTERINE AND ADNEXA PROCEDURES FOR NON-OVARIAN AND NON-ADNEXAL MALIGNANCY,13,DISEASES AND DISORDERS OF THE FEMALE REPRODUCTIVE SYSTEM,2,Moderate,Minor,Surgical,Medicare,Private Health Insurance,,,,N,63368.52,18653.59
New York City,Manhattan,7002053,001463,NYU Langone Hospitals,70 or Older,104,F,Other Race,Spanish/Hispanic,3,Elective,Home or Self Care,2022,NEO038,Female reproductive system cancers - all other types,FRS002,OOPHORECTOMY,512,UTERINE AND ADNEXA PROCEDURES FOR NON-OVARIAN AND NON-ADNEXAL MALIGNANCY,13,DISEASES AND DISORDERS OF THE FEMALE REPRODUCTIVE SYSTEM,3,Major,Major,Surgical,Medicare,,,,,N,156299.17,26058.55
New York City,Manhattan,7002001,001438,Bellevue Hospital Center,70 or Older,112,F,Black/African American,Unknown,10,Elective,Skilled Nursing Home,2022,NEO035,Female reproductive system cancers - endometrium,FRS001,HYSTERECTOMY,512,UTERINE AND ADNEXA PROCEDURES FOR NON-OVARIAN AND NON-ADNEXAL MALIGNANCY,13,DISEASES AND DISORDERS OF THE FEMALE REPRODUCTIVE SYSTEM,4,Extreme,Extreme,Surgical,Medicare,,,,,N,220722.37,126933.90
New York City,Manhattan,7002001,001438,Bellevue Hospital Center,50 to 69,112,F,Black/African American,Unknown,6,Elective,Home or Self Care,2022,NEO035,Female reproductive system cancers - endometrium,FRS001,HYSTERECTOMY,512,UTERINE AND ADNEXA PROCEDURES FOR NON-OVARIAN AND NON-ADNEXAL MALIGNANCY,13,DISEASES AND DISORDERS OF THE FEMALE REPRODUCTIVE SYSTEM,2,Moderate,Minor,Surgical,Medicaid,,,,,N,75465.87,43399.21
New York City,Manhattan,7002001,001438,Bellevue Hospital Center,70 or Older,112,F,Black/African American,Unknown,2,Elective,Home or Self Care,2022,NEO031,Female reproductive system cancers - uterus,FRS001,HYSTERECTOMY,512,UTERINE AND ADNEXA PROCEDURES FOR NON-OVARIAN AND NON-ADNEXAL MALIGNANCY,13,DISEASES AND DISORDERS OF THE FEMALE REPRODUCTIVE SYSTEM,1,Minor,Moderate,Surgical,Medicare,,,,,N,58428.26,33601.16
New York City,Manhattan,7002054,001464,New York-Presbyterian Hospital - Columbia Presbyterian Center,70 or Older,112,F,White,Not Span/Hispanic,1,Elective,Home or Self Care,2022,NEO035,Female reproductive system cancers - endometrium,FRS002,OOPHORECTOMY,512,UTERINE AND ADNEXA PROCEDURES FOR NON-OVARIAN AND NON-ADNEXAL MALIGNANCY,13,DISEASES AND DISORDERS OF THE FEMALE REPRODUCTIVE SYSTEM,2,Moderate,Minor,Surgical,Medicare,Private Health Insurance,,,,N,62633.08,18495.24
New York City,Manhattan,7002053,001463,NYU Langone Hospitals,50 to 69,112,F,Other Race,Not Span/Hispanic,2,Elective,Home or Self Care,2022,NEO035,Female reproductive system cancers - endometrium,FRS001,HYSTERECTOMY,512,UTERINE AND ADNEXA PROCEDURES FOR NON-OVARIAN AND NON-ADNEXAL MALIGNANCY,13,DISEASES AND DISORDERS OF THE FEMALE REPRODUCTIVE SYSTEM,1,Minor,Minor,Surgical,Private Health Insurance,,,,,N,99333.91,17105.18
New York City,Manhattan,7002054,001464,New York-Presbyterian Hospital - Columbia Presbyterian Center,50 to 69,112,F,Other Race,Unknown,3,Elective,Home or Self Care,2022,NEO035,Female reproductive system cancers - endometrium,FRS001,HYSTERECTOMY,512,UTERINE AND ADNEXA PROCEDURES FOR NON-OVARIAN AND NON-ADNEXAL MALIGNANCY,13,DISEASES AND DISORDERS OF THE FEMALE REPRODUCTIVE SYSTEM,2,Moderate,Minor,Surgical,Medicare,Medicaid,,,,N,86178.02,23573.14
New York City,Manhattan,7002054,001464,New York-Presbyterian Hospital - Columbia Presbyterian Center,50 to 69,104,F,Other Race,Spanish/Hispanic,1,Elective,Home or Self Care,2022,NEO035,Female reproductive system cancers - endometrium,FRS001,HYSTERECTOMY,512,UTERINE AND ADNEXA PROCEDURES FOR NON-OVARIAN AND NON-ADNEXAL MALIGNANCY,13,DISEASES AND DISORDERS OF THE FEMALE REPRODUCTIVE SYSTEM,2,Moderate,Minor,Surgical,Medicare,Medicaid,,,,N,60341.08,17487.32
New York City,Manhattan,7002054,001464,New York-Presbyterian Hospital - Columbia Presbyterian Center,30 to 49,103,F,Other Race,Unknown,1,Elective,Home or Self Care,2022,NEO035,Female reproductive system cancers - endometrium,FRS002,OOPHORECTOMY,512,UTERINE AND ADNEXA PROCEDURES FOR NON-OVARIAN AND NON-ADNEXAL MALIGNANCY,13,DISEASES AND DISORDERS OF THE FEMALE REPRODUCTIVE SYSTEM,2,Moderate,Moderate,Surgical,Private Health Insurance,,,,,N,62058.43,17306.96
New York City,Manhattan,7002001,001438,Bellevue Hospital Center,50 to 69,112,F,White,Spanish/Hispanic,1,Elective,Home or Self Care,2022,NEO035,Female reproductive system cancers - endometrium,FRS001,HYSTERECTOMY,512,UTERINE AND ADNEXA PROCEDURES FOR NON-OVARIAN AND NON-ADNEXAL MALIGNANCY,13,DISEASES AND DISORDERS OF THE FEMALE REPRODUCTIVE SYSTEM,1,Minor,Minor,Surgical,Medicare,Medicaid,,,,N,39932.25,22964.40
New York City,Manhattan,7002001,001438,Bellevue Hospital Center,50 to 69,100,F,Other Race,Spanish/Hispanic,1,Elective,Home or Self Care,2022,NEO035,Female reproductive system cancers - endometrium,FRS001,HYSTERECTOMY,512,UTERINE AND ADNEXA PROCEDURES FOR NON-OVARIAN AND NON-ADNEXAL MALIGNANCY,13,DISEASES AND DISORDERS OF THE FEMALE REPRODUCTIVE SYSTEM,2,Moderate,Minor,Surgical,Private Health Insurance,,,,,N,47683.25,27421.87
New York City,Manhattan,7002001,001438,Bellevue Hospital Center,50 to 69,112,F,Black/African American,Unknown,1,Elective,Home or Self Care,2022,NEO031,Female reproductive system cancers - uterus,FRS003,SALPINGECTOMY,512,UTERINE AND ADNEXA PROCEDURES FOR NON-OVARIAN AND NON-ADNEXAL MALIGNANCY,13,DISEASES AND DISORDERS OF THE FEMALE REPRODUCTIVE SYSTEM,2,Moderate,Minor,Surgical,Medicaid,,,,,N,54292.96,31223.01
New York City,Manhattan,7002054,001464,New York-Presbyterian Hospital - Columbia Presbyterian Center,30 to 49,100,F,Other Race,Not Span/Hispanic,6,Elective,Home w/ Home Health Services,2022,NEO035,Female reproductive system cancers - endometrium,FRS001,HYSTERECTOMY,512,UTERINE AND ADNEXA PROCEDURES FOR NON-OVARIAN AND NON-ADNEXAL MALIGNANCY,13,DISEASES AND DISORDERS OF THE FEMALE REPRODUCTIVE SYSTEM,2,Moderate,Moderate,Surgical,Medicaid,,,,,N,135475.19,35113.12
New York City,Manhattan,7002054,001464,New York-Presbyterian Hospital - Columbia Presbyterian Center,50 to 69,104,F,Other Race,Unknown,3,Elective,Home or Self Care,2022,NEO035,Female reproductive system cancers - endometrium,FRS001,HYSTERECTOMY,512,UTERINE AND ADNEXA PROCEDURES FOR NON-OVARIAN AND NON-ADNEXAL MALIGNANCY,13,DISEASES AND DISORDERS OF THE FEMALE REPRODUCTIVE SYSTEM,2,Moderate,Minor,Surgical,Medicare,,,,,N,85702.03,23556.90
New York City,Manhattan,7002001,001438,Bellevue Hospital Center,50 to 69,112,F,Black/African American,Not Span/Hispanic,1,Elective,Home or Self Care,2022,NEO035,Female reproductive system cancers - endometrium,FRS001,HYSTERECTOMY,512,UTERINE AND ADNEXA PROCEDURES FOR NON-OVARIAN AND NON-ADNEXAL MALIGNANCY,13,DISEASES AND DISORDERS OF THE FEMALE REPRODUCTIVE SYSTEM,2,Moderate,Minor,Surgical,Medicaid,,,,,N,56704.85,32610.05
Hudson Valley,Dutchess,1302001,000181,Vassar Brothers Medical Center,70 or Older,126,F,White,Not Span/Hispanic,5,Elective,Home or Self Care,2022,NEO035,Female reproductive system cancers - endometrium,FRS015,"FEMALE REPRODUCTIVE SYSTEM PROCEDURES, NEC",512,UTERINE AND ADNEXA PROCEDURES FOR NON-OVARIAN AND NON-ADNEXAL MALIGNANCY,13,DISEASES AND DISORDERS OF THE FEMALE REPRODUCTIVE SYSTEM,1,Minor,Minor,Surgical,Medicare,,,,,N,29712.50,11509.04
Hudson Valley,Dutchess,1302001,000181,Vassar Brothers Medical Center,50 to 69,125,F,White,Not Span/Hispanic,5,Elective,Home or Self Care,2022,NEO035,Female reproductive system cancers - endometrium,FRS001,HYSTERECTOMY,512,UTERINE AND ADNEXA PROCEDURES FOR NON-OVARIAN AND NON-ADNEXAL MALIGNANCY,13,DISEASES AND DISORDERS OF THE FEMALE REPRODUCTIVE SYSTEM,1,Minor,Minor,Surgical,Medicare,Blue Cross/Blue Shield,,,,N,45282.37,16464.81
New York City,Manhattan,7002054,001464,New York-Presbyterian Hospital - Columbia Presbyterian Center,70 or Older,104,F,White,Spanish/Hispanic,6,Elective,Skilled Nursing Home,2022,NEO035,Female reproductive system cancers - endometrium,FRS001,HYSTERECTOMY,512,UTERINE AND ADNEXA PROCEDURES FOR NON-OVARIAN AND NON-ADNEXAL MALIGNANCY,13,DISEASES AND DISORDERS OF THE FEMALE REPRODUCTIVE SYSTEM,2,Moderate,Moderate,Surgical,Private Health Insurance,,,,,N,129002.86,32709.06
New York City,Manhattan,7002054,001464,New York-Presbyterian Hospital - Columbia Presbyterian Center,50 to 69,104,F,Other Race,Spanish/Hispanic,1,Elective,Home or Self Care,2022,NEO035,Female reproductive system cancers - endometrium,FRS001,HYSTERECTOMY,512,UTERINE AND ADNEXA PROCEDURES FOR NON-OVARIAN AND NON-ADNEXAL MALIGNANCY,13,DISEASES AND DISORDERS OF THE FEMALE REPRODUCTIVE SYSTEM,2,Moderate,Moderate,Surgical,Medicare,,,,,N,59904.21,
New York City,Manhattan,7002054,001464,New York-Presbyterian Hospital - Columbia Presbyterian Center,50 to 69,104,F,White,Not Span/Hispanic,20,Elective,Medicare Cert Long Term Care Hospital,2022,NEO035,Female reproductive system cancers - endometrium,FRS001,HYSTERECTOMY,512,UTERINE AND ADNEXA PROCEDURES FOR NON-OVARIAN AND NON-ADNEXAL MALIGNANCY,13,DISEASES AND DISORDERS OF THE FEMALE REPRODUCTIVE SYSTEM,3,Major,Major,Surgical,Medicaid,,,,,N,313064.65,75588.70
Long Island,Nassau,2951001,000541,North Shore University Hospital,50 to 69,115,F,Black/African American,Not Span/Hispanic,2,Elective,Home or Self Care,2022,NEO035,Female reproductive system cancers - endometrium,FRS001,HYSTERECTOMY,512,UTERINE AND ADNEXA PROCEDURES FOR NON-OVARIAN AND NON-ADNEXAL MALIGNANCY,13,DISEASES AND DISORDERS OF THE FEMALE REPRODUCTIVE SYSTEM,2,Moderate,Minor,Surgical,Blue Cross/Blue Shield,,,,,N,103200.62,18404.33
New York City,Manhattan,7002001,001438,Bellevue Hospital Center,70 or Older,112,F,Black/African American,Unknown,2,Elective,Home or Self Care,2022,NEO035,Female reproductive system cancers - endometrium,FRS001,HYSTERECTOMY,512,UTERINE AND ADNEXA PROCEDURES FOR NON-OVARIAN AND NON-ADNEXAL MALIGNANCY,13,DISEASES AND DISORDERS OF THE FEMALE REPRODUCTIVE SYSTEM,1,Minor,Minor,Surgical,Medicare,,,,,N,65503.46,37669.99
Hudson Valley,Dutchess,1302001,000181,Vassar Brothers Medical Center,50 to 69,125,F,White,Not Span/Hispanic,5,Elective,Home or Self Care,2022,NEO031,Female reproductive system cancers - uterus,FRS001,HYSTERECTOMY,512,UTERINE AND ADNEXA PROCEDURES FOR NON-OVARIAN AND NON-ADNEXAL MALIGNANCY,13,DISEASES AND DISORDERS OF THE FEMALE REPRODUCTIVE SYSTEM,2,Moderate,Minor,Surgical,Blue Cross/Blue Shield,Medicare,,,,N,47694.21,17890.27
Hudson Valley,Dutchess,1302001,000181,Vassar Brothers Medical Center,70 or Older,125,F,White,Not Span/Hispanic,7,Elective,Home w/ Home Health Services,2022,NEO035,Female reproductive system cancers - endometrium,FRS001,HYSTERECTOMY,512,UTERINE AND ADNEXA PROCEDURES FOR NON-OVARIAN AND NON-ADNEXAL MALIGNANCY,13,DISEASES AND DISORDERS OF THE FEMALE REPRODUCTIVE SYSTEM,4,Extreme,Extreme,Surgical,Medicare,Blue Cross/Blue Shield,,,,N,145994.06,48084.26
Hudson Valley,Dutchess,1302001,000181,Vassar Brothers Medical Center,70 or Older,124,F,White,Not Span/Hispanic,5,Elective,Home or Self Care,2022,NEO035,Female reproductive system cancers - endometrium,FRS001,HYSTERECTOMY,512,UTERINE AND ADNEXA PROCEDURES FOR NON-OVARIAN AND NON-ADNEXAL MALIGNANCY,13,DISEASES AND DISORDERS OF THE FEMALE REPRODUCTIVE SYSTEM,1,Minor,Minor,Surgical,Medicare,Miscellaneous/Other,,,,N,54009.01,16841.46
Hudson Valley,Dutchess,1302001,000181,Vassar Brothers Medical Center,70 or Older,125,F,White,Not Span/Hispanic,3,Elective,Home or Self Care,2022,NEO031,Female reproductive system cancers - uterus,FRS001,HYSTERECTOMY,512,UTERINE AND ADNEXA PROCEDURES FOR NON-OVARIAN AND NON-ADNEXAL MALIGNANCY,13,DISEASES AND DISORDERS OF THE FEMALE REPRODUCTIVE SYSTEM,1,Minor,Minor,Surgical,Medicare,,,,,N,35480.98,12292.13
Hudson Valley,Dutchess,1302001,000181,Vassar Brothers Medical Center,50 to 69,124,F,White,Not Span/Hispanic,1,Elective,Home or Self Care,2022,NEO035,Female reproductive system cancers - endometrium,FRS001,HYSTERECTOMY,512,UTERINE AND ADNEXA PROCEDURES FOR NON-OVARIAN AND NON-ADNEXAL MALIGNANCY,13,DISEASES AND DISORDERS OF THE FEMALE REPRODUCTIVE SYSTEM,1,Minor,Minor,Surgical,Medicaid,,,,,N,22742.02,9750.64
Hudson Valley,Dutchess,1302001,000181,Vassar Brothers Medical Center,70 or Older,125,F,White,Not Span/Hispanic,4,Elective,Home or Self Care,2022,NEO031,Female reproductive system cancers - uterus,FRS001,HYSTERECTOMY,512,UTERINE AND ADNEXA PROCEDURES FOR NON-OVARIAN AND NON-ADNEXAL MALIGNANCY,13,DISEASES AND DISORDERS OF THE FEMALE REPRODUCTIVE SYSTEM,1,Minor,Moderate,Surgical,Medicare,Miscellaneous/Other,,,,N,34571.96,12081.01
New York City,Manhattan,7002054,001464,New York-Presbyterian Hospital - Columbia Presbyterian Center,50 to 69,101,F,Black/African American,Not Span/Hispanic,5,Elective,Home or Self Care,2022,NEO035,Female reproductive system cancers - endometrium,FRS002,OOPHORECTOMY,512,UTERINE AND ADNEXA PROCEDURES FOR NON-OVARIAN AND NON-ADNEXAL MALIGNANCY,13,DISEASES AND DISORDERS OF THE FEMALE REPRODUCTIVE SYSTEM,2,Moderate,Moderate,Surgical,Medicaid,,,,,N,112907.28,28672.75
New York City,Manhattan,7002054,001464,New York-Presbyterian Hospital - Columbia Presbyterian Center,70 or Older,112,F,Other Race,Not Span/Hispanic,1,Elective,Home or Self Care,2022,NEO031,Female reproductive system cancers - uterus,FRS001,HYSTERECTOMY,512,UTERINE AND ADNEXA PROCEDURES FOR NON-OVARIAN AND NON-ADNEXAL MALIGNANCY,13,DISEASES AND DISORDERS OF THE FEMALE REPRODUCTIVE SYSTEM,2,Moderate,Moderate,Surgical,Medicare,,,,,N,63604.48,19241.05
New York City,Manhattan,7002054,001464,New York-Presbyterian Hospital - Columbia Presbyterian Center,50 to 69,104,F,Black/African American,Not Span/Hispanic,4,Elective,Home or Self Care,2022,NEO035,Female reproductive system cancers - endometrium,FRS001,HYSTERECTOMY,512,UTERINE AND ADNEXA PROCEDURES FOR NON-OVARIAN AND NON-ADNEXAL MALIGNANCY,13,DISEASES AND DISORDERS OF THE FEMALE REPRODUCTIVE SYSTEM,3,Major,Moderate,Surgical,Private Health Insurance,,,,,N,99472.51,26833.72
New York City,Manhattan,7002054,001464,New York-Presbyterian Hospital - Columbia Presbyterian Center,70 or Older,104,F,Black/African American,Spanish/Hispanic,1,Elective,Home or Self Care,2022,NEO035,Female reproductive system cancers - endometrium,LYM002,LYMPH NODE EXCISION (THERAPEUTIC),512,UTERINE AND ADNEXA PROCEDURES FOR NON-OVARIAN AND NON-ADNEXAL MALIGNANCY,13,DISEASES AND DISORDERS OF THE FEMALE REPRODUCTIVE SYSTEM,2,Moderate,Minor,Surgical,Medicare,Medicaid,,,,N,63289.17,18830.97
Hudson Valley,Dutchess,1302001,000181,Vassar Brothers Medical Center,70 or Older,125,F,White,Not Span/Hispanic,2,Elective,Home w/ Home Health Services,2022,NEO035,Female reproductive system cancers - endometrium,FRS001,HYSTERECTOMY,512,UTERINE AND ADNEXA PROCEDURES FOR NON-OVARIAN AND NON-ADNEXAL MALIGNANCY,13,DISEASES AND DISORDERS OF THE FEMALE REPRODUCTIVE SYSTEM,2,Moderate,Minor,Surgical,Medicare,Medicaid,,,,N,35176.85,12550.79
Hudson Valley,Dutchess,1302001,000181,Vassar Brothers Medical Center,50 to 69,,F,Other Race,Spanish/Hispanic,1,Elective,Home or Self Care,2022,NEO031,Female reproductive system cancers - uterus,FRS001,HYSTERECTOMY,512,UTERINE AND ADNEXA PROCEDURES FOR NON-OVARIAN AND NON-ADNEXAL MALIGNANCY,13,DISEASES AND DISORDERS OF THE FEMALE REPRODUCTIVE SYSTEM,2,Moderate,Minor,Surgical,Medicare,Blue Cross/Blue Shield,,,,N,34745.98,11329.72
Hudson Valley,Dutchess,1302001,000181,Vassar Brothers Medical Center,50 to 69,126,F,White,Not Span/Hispanic,1,Elective,Home or Self Care,2022,NEO035,Female reproductive system cancers - endometrium,FRS001,HYSTERECTOMY,512,UTERINE AND ADNEXA PROCEDURES FOR NON-OVARIAN AND NON-ADNEXAL MALIGNANCY,13,DISEASES AND DISORDERS OF THE FEMALE REPRODUCTIVE SYSTEM,1,Minor,Minor,Surgical,"Managed Care, Unspecified",,,,,N,20095.24,7868.67
New York City,Manhattan,7002054,001464,New York-Presbyterian Hospital - Columbia Presbyterian Center,30 to 49,104,F,Black/African American,Not Span/Hispanic,9,Elective,Home w/ Home Health Services,2022,NEO032,Female reproductive system cancers - cervix,FRS002,OOPHORECTOMY,512,UTERINE AND ADNEXA PROCEDURES FOR NON-OVARIAN AND NON-ADNEXAL MALIGNANCY,13,DISEASES AND DISORDERS OF THE FEMALE REPRODUCTIVE SYSTEM,2,Moderate,Moderate,Surgical,Medicaid,,,,,N,241116.82,59218.81
New York City,Manhattan,7002053,001463,NYU Langone Hospitals,50 to 69,112,F,Black/African American,Not Span/Hispanic,1,Elective,Home or Self Care,2022,NEO035,Female reproductive system cancers - endometrium,FRS001,HYSTERECTOMY,512,UTERINE AND ADNEXA PROCEDURES FOR NON-OVARIAN AND NON-ADNEXAL MALIGNANCY,13,DISEASES AND DISORDERS OF THE FEMALE REPRODUCTIVE SYSTEM,3,Major,Moderate,Surgical,Medicare,Blue Cross/Blue Shield,,,,N,133993.96,22685.80
New York City,Manhattan,7002053,001463,NYU Langone Hospitals,70 or Older,109,F,White,Not Span/Hispanic,1,Elective,Home or Self Care,2022,NEO032,Female reproductive system cancers - cervix,FRS015,"FEMALE REPRODUCTIVE SYSTEM PROCEDURES, NEC",512,UTERINE AND ADNEXA PROCEDURES FOR NON-OVARIAN AND NON-ADNEXAL MALIGNANCY,13,DISEASES AND DISORDERS OF THE FEMALE REPRODUCTIVE SYSTEM,1,Minor,Minor,Surgical,Medicare,Medicare,,,,N,97384.37,15567.76
New York City,Manhattan,7002053,001463,NYU Langone Hospitals,50 to 69,104,F,Black/African American,Spanish/Hispanic,3,Elective,Home or Self Care,2022,NEO032,Female reproductive system cancers - cervix,FRS001,HYSTERECTOMY,512,UTERINE AND ADNEXA PROCEDURES FOR NON-OVARIAN AND NON-ADNEXAL MALIGNANCY,13,DISEASES AND DISORDERS OF THE FEMALE REPRODUCTIVE SYSTEM,2,Moderate,Moderate,Surgical,Private Health Insurance,,,,,N,155552.73,27552.50
New York City,Manhattan,7002001,001438,Bellevue Hospital Center,70 or Older,103,F,Other Race,Unknown,57,Emergency,Home w/ Home Health Services,2022,NEO035,Female reproductive system cancers - endometrium,FRS002,OOPHORECTOMY,512,UTERINE AND ADNEXA PROCEDURES FOR NON-OVARIAN AND NON-ADNEXAL MALIGNANCY,13,DISEASES AND DISORDERS OF THE FEMALE REPRODUCTIVE SYSTEM,4,Extreme,Extreme,Surgical,Medicaid,,,,,Y,516872.23,297244.95
New York City,Manhattan,7002053,001463,NYU Langone Hospitals,50 to 69,112,F,Black/African American,Not Span/Hispanic,6,Elective,Home or Self Care,2022,NEO031,Female reproductive system cancers - uterus,GIS015,OMENTECTOMY OR PERITONEUM RESECTION,512,UTERINE AND ADNEXA PROCEDURES FOR NON-OVARIAN AND NON-ADNEXAL MALIGNANCY,13,DISEASES AND DISORDERS OF THE FEMALE REPRODUCTIVE SYSTEM,2,Moderate,Moderate,Surgical,Medicaid,,,,,N,150293.21,32134.86
New York City,Manhattan,7002053,001463,NYU Langone Hospitals,30 to 49,112,F,Other Race,Not Span/Hispanic,1,Elective,Home or Self Care,2022,NEO035,Female reproductive system cancers - endometrium,FRS001,HYSTERECTOMY,512,UTERINE AND ADNEXA PROCEDURES FOR NON-OVARIAN AND NON-ADNEXAL MALIGNANCY,13,DISEASES AND DISORDERS OF THE FEMALE REPRODUCTIVE SYSTEM,1,Minor,Minor,Surgical,Medicaid,,,,,N,91555.05,14111.44
New York City,Manhattan,7002054,001464,New York-Presbyterian Hospital - Columbia Presbyterian Center,30 to 49,104,F,Black/African American,Not Span/Hispanic,2,Elective,Home or Self Care,2022,NEO035,Female reproductive system cancers - endometrium,FRS001,HYSTERECTOMY,512,UTERINE AND ADNEXA PROCEDURES FOR NON-OVARIAN AND NON-ADNEXAL MALIGNANCY,13,DISEASES AND DISORDERS OF THE FEMALE REPRODUCTIVE SYSTEM,2,Moderate,Minor,Surgical,Private Health Insurance,,,,,N,82936.62,23082.80
New York City,Manhattan,7002053,001463,NYU Langone Hospitals,30 to 49,,F,White,Spanish/Hispanic,1,Elective,Home or Self Care,2022,NEO032,Female reproductive system cancers - cervix,FRS001,HYSTERECTOMY,512,UTERINE AND ADNEXA PROCEDURES FOR NON-OVARIAN AND NON-ADNEXAL MALIGNANCY,13,DISEASES AND DISORDERS OF THE FEMALE REPRODUCTIVE SYSTEM,1,Minor,Minor,Surgical,Private Health Insurance,,,,,N,118157.27,17887.06
New York City,Manhattan,7002054,001464,New York-Presbyterian Hospital - Columbia Presbyterian Center,30 to 49,113,F,Black/African American,Not Span/Hispanic,4,Elective,Home or Self Care,2022,NEO032,Female reproductive system cancers - cervix,URN003,URETER AND OTHER URINARY TRACT DILATION,512,UTERINE AND ADNEXA PROCEDURES FOR NON-OVARIAN AND NON-ADNEXAL MALIGNANCY,13,DISEASES AND DISORDERS OF THE FEMALE REPRODUCTIVE SYSTEM,2,Moderate,Minor,Surgical,Medicaid,,,,,N,122146.57,35104.36
Hudson Valley,Dutchess,1302001,000181,Vassar Brothers Medical Center,50 to 69,124,F,White,Not Span/Hispanic,1,Elective,Home or Self Care,2022,NEO035,Female reproductive system cancers - endometrium,FRS001,HYSTERECTOMY,512,UTERINE AND ADNEXA PROCEDURES FOR NON-OVARIAN AND NON-ADNEXAL MALIGNANCY,13,DISEASES AND DISORDERS OF THE FEMALE REPRODUCTIVE SYSTEM,2,Moderate,Minor,Surgical,Blue Cross/Blue Shield,,,,,N,33010.41,11730.88
Hudson Valley,Dutchess,1302001,000181,Vassar Brothers Medical Center,50 to 69,124,F,White,Not Span/Hispanic,1,Elective,Home or Self Care,2022,NEO035,Female reproductive system cancers - endometrium,FRS001,HYSTERECTOMY,512,UTERINE AND ADNEXA PROCEDURES FOR NON-OVARIAN AND NON-ADNEXAL MALIGNANCY,13,DISEASES AND DISORDERS OF THE FEMALE REPRODUCTIVE SYSTEM,1,Minor,Minor,Surgical,"Managed Care, Unspecified",,,,,N,14568.67,3538.32
Hudson Valley,Dutchess,1302001,000181,Vassar Brothers Medical Center,50 to 69,125,F,White,Not Span/Hispanic,3,Elective,Home or Self Care,2022,NEO035,Female reproductive system cancers - endometrium,FRS001,HYSTERECTOMY,512,UTERINE AND ADNEXA PROCEDURES FOR NON-OVARIAN AND NON-ADNEXAL MALIGNANCY,13,DISEASES AND DISORDERS OF THE FEMALE REPRODUCTIVE SYSTEM,1,Minor,Minor,Surgical,Medicare,Medicaid,,,,N,35712.64,12235.43
Hudson Valley,Dutchess,1302001,000181,Vassar Brothers Medical Center,50 to 69,125,F,White,Not Span/Hispanic,1,Elective,Home or Self Care,2022,NEO031,Female reproductive system cancers - uterus,FRS001,HYSTERECTOMY,512,UTERINE AND ADNEXA PROCEDURES FOR NON-OVARIAN AND NON-ADNEXAL MALIGNANCY,13,DISEASES AND DISORDERS OF THE FEMALE REPRODUCTIVE SYSTEM,2,Moderate,Moderate,Surgical,Medicare,Blue Cross/Blue Shield,,,,N,36371.53,12270.57
New York City,Manhattan,7002054,001464,New York-Presbyterian Hospital - Columbia Presbyterian Center,30 to 49,100,F,Other Race,Not Span/Hispanic,5,Elective,Home or Self Care,2022,NEO031,Female reproductive system cancers - uterus,FRS001,HYSTERECTOMY,512,UTERINE AND ADNEXA PROCEDURES FOR NON-OVARIAN AND NON-ADNEXAL MALIGNANCY,13,DISEASES AND DISORDERS OF THE FEMALE REPRODUCTIVE SYSTEM,2,Moderate,Moderate,Surgical,Private Health Insurance,,,,,N,104294.33,26840.48