Hospital Service Area,Hospital County,Operating Certificate Number,Permanent Facility Id,Facility Name,Age Group,Zip Code - 3 digits,Gender,Race,Ethnicity,Length of Stay,Type of Admission,Patient Disposition,Discharge Year,CCS Diagnosis Code,CCS Diagnosis Description,CCS Procedure Code,CCS Procedure Description,APR DRG Code,APR DRG Description,APR MDC Code,APR MDC Description,APR Severity of Illness Code,APR Severity of Illness Description,APR Risk of Mortality,APR Medical Surgical Description,Payment Typology 1,Payment Typology 2,Payment Typology 3,Birth Weight,Abortion Edit Indicator,Emergency Department Indicator,Total Charges,Total Costs
New York City,Manhattan,7002053,001463,NYU Langone Hospitals,30 to 49,112,F,Black/African American,Not Span/Hispanic,2,Elective,Home or Self Care,2022,NEO073,Benign neoplasms,FRS001,HYSTERECTOMY,519,UTERINE AND ADNEXA PROCEDURES FOR LEIOMYOMA,13,DISEASES AND DISORDERS OF THE FEMALE REPRODUCTIVE SYSTEM,1,Minor,Minor,Surgical,Private Health Insurance,,,,,N,100789.83,17959.35
New York City,Manhattan,7002001,001438,Bellevue Hospital Center,30 to 49,100,F,Other Race,Not Span/Hispanic,2,Elective,Home or Self Care,2022,NEO073,Benign neoplasms,FRS001,HYSTERECTOMY,519,UTERINE AND ADNEXA PROCEDURES FOR LEIOMYOMA,13,DISEASES AND DISORDERS OF THE FEMALE REPRODUCTIVE SYSTEM,2,Moderate,Minor,Surgical,Private Health Insurance,,,,,N,65315.12,37561.68
New York City,Manhattan,7002054,001464,New York-Presbyterian Hospital - Columbia Presbyterian Center,30 to 49,112,F,White,Not Span/Hispanic,2,Elective,Home or Self Care,2022,NEO073,Benign neoplasms,FRS010,FEMALE UPPER GENITAL TRACT EXCISION,519,UTERINE AND ADNEXA PROCEDURES FOR LEIOMYOMA,13,DISEASES AND DISORDERS OF THE FEMALE REPRODUCTIVE SYSTEM,2,Moderate,Moderate,Surgical,Blue Cross/Blue Shield,,,,,N,81568.93,24591.90
New York City,Manhattan,7002054,001464,New York-Presbyterian Hospital - Columbia Presbyterian Center,30 to 49,100,F,Other Race,Not Span/Hispanic,2,Elective,Home or Self Care,2022,NEO073,Benign neoplasms,FRS010,FEMALE UPPER GENITAL TRACT EXCISION,519,UTERINE AND ADNEXA PROCEDURES FOR LEIOMYOMA,13,DISEASES AND DISORDERS OF THE FEMALE REPRODUCTIVE SYSTEM,1,Minor,Minor,Surgical,Medicaid,,,,,N,65325.69,18945.02
New York City,Manhattan,7002053,001463,NYU Langone Hospitals,30 to 49,112,F,Black/African American,Spanish/Hispanic,1,Elective,Home or Self Care,2022,NEO073,Benign neoplasms,FRS010,FEMALE UPPER GENITAL TRACT EXCISION,519,UTERINE AND ADNEXA PROCEDURES FOR LEIOMYOMA,13,DISEASES AND DISORDERS OF THE FEMALE REPRODUCTIVE SYSTEM,2,Moderate,Minor,Surgical,Medicaid,,,,,N,94470.17,14302.69
New York City,Manhattan,7002053,001463,NYU Langone Hospitals,30 to 49,104,F,Black/African American,Not Span/Hispanic,1,Elective,Home or Self Care,2022,NEO073,Benign neoplasms,FRS010,FEMALE UPPER GENITAL TRACT EXCISION,519,UTERINE AND ADNEXA PROCEDURES FOR LEIOMYOMA,13,DISEASES AND DISORDERS OF THE FEMALE REPRODUCTIVE SYSTEM,1,Minor,Minor,Surgical,Private Health Insurance,,,,,N,144207.85,19956.60
New York City,Manhattan,7002053,001463,NYU Langone Hospitals,30 to 49,105,F,White,Not Span/Hispanic,1,Elective,Home or Self Care,2022,NEO073,Benign neoplasms,FRS001,HYSTERECTOMY,519,UTERINE AND ADNEXA PROCEDURES FOR LEIOMYOMA,13,DISEASES AND DISORDERS OF THE FEMALE REPRODUCTIVE SYSTEM,1,Minor,Minor,Surgical,Private Health Insurance,,,,,N,66192.39,10940.81
New York City,Manhattan,7002001,001438,Bellevue Hospital Center,30 to 49,100,F,Black/African American,Unknown,2,Elective,Home or Self Care,2022,NEO073,Benign neoplasms,FRS001,HYSTERECTOMY,519,UTERINE AND ADNEXA PROCEDURES FOR LEIOMYOMA,13,DISEASES AND DISORDERS OF THE FEMALE REPRODUCTIVE SYSTEM,2,Moderate,Minor,Surgical,Medicaid,,,,,N,45016.12,25888.05
New York City,Manhattan,7002001,001438,Bellevue Hospital Center,50 to 69,104,F,Multi-racial,Spanish/Hispanic,1,Elective,Home or Self Care,2022,NEO073,Benign neoplasms,FRS001,HYSTERECTOMY,519,UTERINE AND ADNEXA PROCEDURES FOR LEIOMYOMA,13,DISEASES AND DISORDERS OF THE FEMALE REPRODUCTIVE SYSTEM,1,Minor,Minor,Surgical,Private Health Insurance,,,,,N,55903.50,32149.21
Finger Lakes,Monroe,2701005,000413,Strong Memorial Hospital,30 to 49,146,F,White,Not Span/Hispanic,1,Elective,Home or Self Care,2022,NEO073,Benign neoplasms,FRS010,FEMALE UPPER GENITAL TRACT EXCISION,519,UTERINE AND ADNEXA PROCEDURES FOR LEIOMYOMA,13,DISEASES AND DISORDERS OF THE FEMALE REPRODUCTIVE SYSTEM,1,Minor,Minor,Surgical,Blue Cross/Blue Shield,,,,,N,21918.89,10896.95
New York City,Manhattan,7002001,001438,Bellevue Hospital Center,30 to 49,111,F,Other Race,Unknown,1,Elective,Home or Self Care,2022,NEO073,Benign neoplasms,FRS001,HYSTERECTOMY,519,UTERINE AND ADNEXA PROCEDURES FOR LEIOMYOMA,13,DISEASES AND DISORDERS OF THE FEMALE REPRODUCTIVE SYSTEM,1,Minor,Minor,Surgical,Private Health Insurance,,,,,N,31446.39,18084.32
New York City,Manhattan,7002001,001438,Bellevue Hospital Center,30 to 49,111,F,Other Race,Spanish/Hispanic,1,Elective,Home or Self Care,2022,NEO073,Benign neoplasms,FRS001,HYSTERECTOMY,519,UTERINE AND ADNEXA PROCEDURES FOR LEIOMYOMA,13,DISEASES AND DISORDERS OF THE FEMALE REPRODUCTIVE SYSTEM,1,Minor,Minor,Surgical,Private Health Insurance,,,,,N,37467.41,21546.91
New York City,Manhattan,7002001,001438,Bellevue Hospital Center,50 to 69,112,F,Other Race,Unknown,2,Emergency,Home or Self Care,2022,NEO073,Benign neoplasms,FRS001,HYSTERECTOMY,519,UTERINE AND ADNEXA PROCEDURES FOR LEIOMYOMA,13,DISEASES AND DISORDERS OF THE FEMALE REPRODUCTIVE SYSTEM,2,Moderate,Minor,Surgical,Private Health Insurance,,,,,N,43638.06,25095.55
New York City,Manhattan,7002001,001438,Bellevue Hospital Center,30 to 49,112,F,Black/African American,Unknown,1,Elective,Home or Self Care,2022,NEO073,Benign neoplasms,FRS010,FEMALE UPPER GENITAL TRACT EXCISION,519,UTERINE AND ADNEXA PROCEDURES FOR LEIOMYOMA,13,DISEASES AND DISORDERS OF THE FEMALE REPRODUCTIVE SYSTEM,1,Minor,Minor,Surgical,Medicaid,,,,,N,35992.68,20698.81
New York City,Manhattan,7002053,001463,NYU Langone Hospitals,30 to 49,100,F,Black/African American,Not Span/Hispanic,2,Elective,Home or Self Care,2022,NEO073,Benign neoplasms,FRS010,FEMALE UPPER GENITAL TRACT EXCISION,519,UTERINE AND ADNEXA PROCEDURES FOR LEIOMYOMA,13,DISEASES AND DISORDERS OF THE FEMALE REPRODUCTIVE SYSTEM,1,Minor,Minor,Surgical,Medicaid,,,,,N,97908.14,18124.88
New York City,Manhattan,7002053,001463,NYU Langone Hospitals,30 to 49,100,F,Black/African American,Not Span/Hispanic,1,Elective,Home or Self Care,2022,NEO073,Benign neoplasms,FRS010,FEMALE UPPER GENITAL TRACT EXCISION,519,UTERINE AND ADNEXA PROCEDURES FOR LEIOMYOMA,13,DISEASES AND DISORDERS OF THE FEMALE REPRODUCTIVE SYSTEM,1,Minor,Minor,Surgical,Private Health Insurance,,,,,N,101291.94,15626.74
New York City,Manhattan,7002053,001463,NYU Langone Hospitals,30 to 49,109,F,Black/African American,Not Span/Hispanic,1,Elective,Home w/ Home Health Services,2022,NEO073,Benign neoplasms,FRS010,FEMALE UPPER GENITAL TRACT EXCISION,519,UTERINE AND ADNEXA PROCEDURES FOR LEIOMYOMA,13,DISEASES AND DISORDERS OF THE FEMALE REPRODUCTIVE SYSTEM,2,Moderate,Minor,Surgical,Private Health Insurance,,,,,N,61577.12,10194.35
New York City,Manhattan,7002001,001438,Bellevue Hospital Center,30 to 49,100,F,Black/African American,Not Span/Hispanic,2,Elective,Home or Self Care,2022,NEO073,Benign neoplasms,FRS001,HYSTERECTOMY,519,UTERINE AND ADNEXA PROCEDURES FOR LEIOMYOMA,13,DISEASES AND DISORDERS OF THE FEMALE REPRODUCTIVE SYSTEM,1,Minor,Minor,Surgical,Medicaid,,,,,N,71911.90,41355.38
New York City,Manhattan,7002054,001464,New York-Presbyterian Hospital - Columbia Presbyterian Center,50 to 69,100,F,Other Race,Spanish/Hispanic,3,Elective,Home or Self Care,2022,NEO073,Benign neoplasms,FRS001,HYSTERECTOMY,519,UTERINE AND ADNEXA PROCEDURES FOR LEIOMYOMA,13,DISEASES AND DISORDERS OF THE FEMALE REPRODUCTIVE SYSTEM,2,Moderate,Minor,Surgical,Medicaid,,,,,N,91415.37,24533.10
New York City,Manhattan,7002054,001464,New York-Presbyterian Hospital - Columbia Presbyterian Center,30 to 49,100,F,Other Race,Not Span/Hispanic,1,Elective,Home or Self Care,2022,NEO073,Benign neoplasms,FRS010,FEMALE UPPER GENITAL TRACT EXCISION,519,UTERINE AND ADNEXA PROCEDURES FOR LEIOMYOMA,13,DISEASES AND DISORDERS OF THE FEMALE REPRODUCTIVE SYSTEM,1,Minor,Minor,Surgical,Medicaid,,,,,N,47074.76,13712.89
New York City,Manhattan,7002053,001463,NYU Langone Hospitals,50 to 69,OOS,F,Multi-racial,Not Span/Hispanic,1,Elective,Home or Self Care,2022,NEO073,Benign neoplasms,FRS001,HYSTERECTOMY,519,UTERINE AND ADNEXA PROCEDURES FOR LEIOMYOMA,13,DISEASES AND DISORDERS OF THE FEMALE REPRODUCTIVE SYSTEM,2,Moderate,Minor,Surgical,Private Health Insurance,,,,,N,60637.72,10377.68
New York City,Manhattan,7002053,001463,NYU Langone Hospitals,50 to 69,112,F,White,Not Span/Hispanic,1,Elective,Home or Self Care,2022,NEO073,Benign neoplasms,FRS001,HYSTERECTOMY,519,UTERINE AND ADNEXA PROCEDURES FOR LEIOMYOMA,13,DISEASES AND DISORDERS OF THE FEMALE REPRODUCTIVE SYSTEM,1,Minor,Minor,Surgical,Medicare,Private Health Insurance,,,,N,87317.49,13976.51
New York City,Manhattan,7002053,001463,NYU Langone Hospitals,30 to 49,100,F,Black/African American,Spanish/Hispanic,4,Elective,Home or Self Care,2022,NEO073,Benign neoplasms,FRS001,HYSTERECTOMY,519,UTERINE AND ADNEXA PROCEDURES FOR LEIOMYOMA,13,DISEASES AND DISORDERS OF THE FEMALE REPRODUCTIVE SYSTEM,2,Moderate,Minor,Surgical,Private Health Insurance,,,,,N,134552.00,26223.09
Finger Lakes,Monroe,2701005,000413,Strong Memorial Hospital,30 to 49,146,F,Black/African American,Not Span/Hispanic,1,Elective,Home or Self Care,2022,NEO073,Benign neoplasms,FRS001,HYSTERECTOMY,519,UTERINE AND ADNEXA PROCEDURES FOR LEIOMYOMA,13,DISEASES AND DISORDERS OF THE FEMALE REPRODUCTIVE SYSTEM,1,Minor,Minor,Surgical,Medicaid,,,,,N,26141.80,12750.34
Finger Lakes,Monroe,2701005,000413,Strong Memorial Hospital,30 to 49,146,F,Black/African American,Not Span/Hispanic,1,Elective,Home or Self Care,2022,NEO073,Benign neoplasms,FRS001,HYSTERECTOMY,519,UTERINE AND ADNEXA PROCEDURES FOR LEIOMYOMA,13,DISEASES AND DISORDERS OF THE FEMALE REPRODUCTIVE SYSTEM,1,Minor,Minor,Surgical,Blue Cross/Blue Shield,,,,,N,20590.08,9769.21
Finger Lakes,Monroe,2701005,000413,Strong Memorial Hospital,50 to 69,146,F,White,Not Span/Hispanic,2,Elective,Home or Self Care,2022,NEO073,Benign neoplasms,FRS001,HYSTERECTOMY,519,UTERINE AND ADNEXA PROCEDURES FOR LEIOMYOMA,13,DISEASES AND DISORDERS OF THE FEMALE REPRODUCTIVE SYSTEM,1,Minor,Minor,Surgical,Private Health Insurance,,,,,N,34061.76,17048.22
Finger Lakes,Monroe,2701005,000413,Strong Memorial Hospital,50 to 69,145,F,White,Not Span/Hispanic,1,Elective,Home or Self Care,2022,NEO073,Benign neoplasms,FRS001,HYSTERECTOMY,519,UTERINE AND ADNEXA PROCEDURES FOR LEIOMYOMA,13,DISEASES AND DISORDERS OF THE FEMALE REPRODUCTIVE SYSTEM,1,Minor,Minor,Surgical,Blue Cross/Blue Shield,,,,,N,24319.35,12062.08
Finger Lakes,Monroe,2701005,000413,Strong Memorial Hospital,30 to 49,145,F,Other Race,Spanish/Hispanic,1,Elective,Home or Self Care,2022,NEO073,Benign neoplasms,FRS001,HYSTERECTOMY,519,UTERINE AND ADNEXA PROCEDURES FOR LEIOMYOMA,13,DISEASES AND DISORDERS OF THE FEMALE REPRODUCTIVE SYSTEM,1,Minor,Minor,Surgical,Blue Cross/Blue Shield,,,,,N,22173.97,10929.87
Finger Lakes,Monroe,2701005,000413,Strong Memorial Hospital,30 to 49,145,F,Black/African American,Not Span/Hispanic,3,Elective,Home or Self Care,2022,NEO073,Benign neoplasms,FRS001,HYSTERECTOMY,519,UTERINE AND ADNEXA PROCEDURES FOR LEIOMYOMA,13,DISEASES AND DISORDERS OF THE FEMALE REPRODUCTIVE SYSTEM,1,Minor,Minor,Surgical,Blue Cross/Blue Shield,,,,,N,49335.20,24732.77
New York City,Manhattan,7002054,001464,New York-Presbyterian Hospital - Columbia Presbyterian Center,30 to 49,104,F,Black/African American,Not Span/Hispanic,1,Emergency,Home or Self Care,2022,NEO073,Benign neoplasms,FRS010,FEMALE UPPER GENITAL TRACT EXCISION,519,UTERINE AND ADNEXA PROCEDURES FOR LEIOMYOMA,13,DISEASES AND DISORDERS OF THE FEMALE REPRODUCTIVE SYSTEM,1,Minor,Moderate,Surgical,Medicaid,,,,,Y,40259.60,10968.08
New York City,Manhattan,7002001,001438,Bellevue Hospital Center,30 to 49,112,F,Other Race,Spanish/Hispanic,2,Elective,Home or Self Care,2022,NEO073,Benign neoplasms,URN003,URETER AND OTHER URINARY TRACT DILATION,519,UTERINE AND ADNEXA PROCEDURES FOR LEIOMYOMA,13,DISEASES AND DISORDERS OF THE FEMALE REPRODUCTIVE SYSTEM,1,Minor,Minor,Surgical,Self-Pay,,,,,N,64678.80,37195.74
New York City,Manhattan,7002053,001463,NYU Langone Hospitals,30 to 49,112,F,Multi-racial,Not Span/Hispanic,1,Elective,Home or Self Care,2022,NEO073,Benign neoplasms,FRS010,FEMALE UPPER GENITAL TRACT EXCISION,519,UTERINE AND ADNEXA PROCEDURES FOR LEIOMYOMA,13,DISEASES AND DISORDERS OF THE FEMALE REPRODUCTIVE SYSTEM,2,Moderate,Minor,Surgical,Private Health Insurance,,,,,N,66741.12,10361.13
New York City,Manhattan,7002001,001438,Bellevue Hospital Center,50 to 69,100,F,Black/African American,Unknown,2,Elective,Home or Self Care,2022,NEO073,Benign neoplasms,FRS001,HYSTERECTOMY,519,UTERINE AND ADNEXA PROCEDURES FOR LEIOMYOMA,13,DISEASES AND DISORDERS OF THE FEMALE REPRODUCTIVE SYSTEM,1,Minor,Minor,Surgical,Medicaid,,,,,N,37867.01,21776.71
New York City,Manhattan,7002054,001464,New York-Presbyterian Hospital - Columbia Presbyterian Center,50 to 69,107,F,Other Race,Unknown,2,Elective,Home or Self Care,2022,NEO073,Benign neoplasms,FRS002,OOPHORECTOMY,519,UTERINE AND ADNEXA PROCEDURES FOR LEIOMYOMA,13,DISEASES AND DISORDERS OF THE FEMALE REPRODUCTIVE SYSTEM,2,Moderate,Minor,Surgical,Private Health Insurance,,,,,N,62896.67,17550.97
New York City,Manhattan,7002054,001464,New York-Presbyterian Hospital - Columbia Presbyterian Center,50 to 69,,F,Black/African American,Unknown,2,Elective,Home or Self Care,2022,NEO073,Benign neoplasms,FRS001,HYSTERECTOMY,519,UTERINE AND ADNEXA PROCEDURES FOR LEIOMYOMA,13,DISEASES AND DISORDERS OF THE FEMALE REPRODUCTIVE SYSTEM,2,Moderate,Moderate,Surgical,Private Health Insurance,,,,,N,63969.48,18321.95
New York City,Manhattan,7002054,001464,New York-Presbyterian Hospital - Columbia Presbyterian Center,30 to 49,112,F,Other Race,Not Span/Hispanic,2,Elective,Home or Self Care,2022,NEO073,Benign neoplasms,FRS001,HYSTERECTOMY,519,UTERINE AND ADNEXA PROCEDURES FOR LEIOMYOMA,13,DISEASES AND DISORDERS OF THE FEMALE REPRODUCTIVE SYSTEM,1,Minor,Minor,Surgical,Medicaid,,,,,N,58186.71,16141.97
New York City,Manhattan,7002054,001464,New York-Presbyterian Hospital - Columbia Presbyterian Center,50 to 69,115,F,Other Race,Not Span/Hispanic,2,Elective,Home or Self Care,2022,NEO073,Benign neoplasms,FRS002,OOPHORECTOMY,519,UTERINE AND ADNEXA PROCEDURES FOR LEIOMYOMA,13,DISEASES AND DISORDERS OF THE FEMALE REPRODUCTIVE SYSTEM,2,Moderate,Minor,Surgical,Private Health Insurance,,,,,N,69562.24,20098.60
Long Island,Nassau,2951001,000541,North Shore University Hospital,30 to 49,113,F,White,Spanish/Hispanic,2,Elective,Home or Self Care,2022,NEO073,Benign neoplasms,FRS010,FEMALE UPPER GENITAL TRACT EXCISION,519,UTERINE AND ADNEXA PROCEDURES FOR LEIOMYOMA,13,DISEASES AND DISORDERS OF THE FEMALE REPRODUCTIVE SYSTEM,1,Minor,Minor,Surgical,Private Health Insurance,,,,,N,56503.52,10601.39
Long Island,Nassau,2951001,000541,North Shore University Hospital,30 to 49,114,F,White,Spanish/Hispanic,2,Elective,Home or Self Care,2022,NEO073,Benign neoplasms,FRS010,FEMALE UPPER GENITAL TRACT EXCISION,519,UTERINE AND ADNEXA PROCEDURES FOR LEIOMYOMA,13,DISEASES AND DISORDERS OF THE FEMALE REPRODUCTIVE SYSTEM,1,Minor,Minor,Surgical,Medicaid,Medicaid,,,,N,55921.97,10219.45
Long Island,Nassau,2951001,000541,North Shore University Hospital,30 to 49,111,F,White,Not Span/Hispanic,2,Elective,Home or Self Care,2022,NEO073,Benign neoplasms,FRS010,FEMALE UPPER GENITAL TRACT EXCISION,519,UTERINE AND ADNEXA PROCEDURES FOR LEIOMYOMA,13,DISEASES AND DISORDERS OF THE FEMALE REPRODUCTIVE SYSTEM,1,Minor,Minor,Surgical,Private Health Insurance,,,,,N,60749.96,11056.78
Long Island,Nassau,2951001,000541,North Shore University Hospital,30 to 49,114,F,Black/African American,Not Span/Hispanic,2,Elective,Home or Self Care,2022,NEO073,Benign neoplasms,FRS010,FEMALE UPPER GENITAL TRACT EXCISION,519,UTERINE AND ADNEXA PROCEDURES FOR LEIOMYOMA,13,DISEASES AND DISORDERS OF THE FEMALE REPRODUCTIVE SYSTEM,1,Minor,Minor,Surgical,Blue Cross/Blue Shield,,,,,N,68420.24,12860.87
Long Island,Nassau,2951001,000541,North Shore University Hospital,30 to 49,117,F,Black/African American,Not Span/Hispanic,3,Elective,Home or Self Care,2022,NEO073,Benign neoplasms,FRS010,FEMALE UPPER GENITAL TRACT EXCISION,519,UTERINE AND ADNEXA PROCEDURES FOR LEIOMYOMA,13,DISEASES AND DISORDERS OF THE FEMALE REPRODUCTIVE SYSTEM,1,Minor,Minor,Surgical,Blue Cross/Blue Shield,,,,,N,66436.28,12212.99
Long Island,Nassau,2951001,000541,North Shore University Hospital,30 to 49,112,F,Other Race,Not Span/Hispanic,2,Elective,Home or Self Care,2022,NEO073,Benign neoplasms,FRS010,FEMALE UPPER GENITAL TRACT EXCISION,519,UTERINE AND ADNEXA PROCEDURES FOR LEIOMYOMA,13,DISEASES AND DISORDERS OF THE FEMALE REPRODUCTIVE SYSTEM,1,Minor,Minor,Surgical,Medicaid,Medicaid,,,,N,57384.98,10343.78
Long Island,Nassau,2951001,000541,North Shore University Hospital,30 to 49,115,F,Black/African American,Not Span/Hispanic,2,Elective,Home or Self Care,2022,NEO073,Benign neoplasms,FRS010,FEMALE UPPER GENITAL TRACT EXCISION,519,UTERINE AND ADNEXA PROCEDURES FOR LEIOMYOMA,13,DISEASES AND DISORDERS OF THE FEMALE REPRODUCTIVE SYSTEM,1,Minor,Minor,Surgical,Blue Cross/Blue Shield,,,,,N,54774.92,10039.09
New York City,Manhattan,7002001,001438,Bellevue Hospital Center,30 to 49,100,F,Other Race,Unknown,1,Elective,Home or Self Care,2022,NEO073,Benign neoplasms,FRS001,HYSTERECTOMY,519,UTERINE AND ADNEXA PROCEDURES FOR LEIOMYOMA,13,DISEASES AND DISORDERS OF THE FEMALE REPRODUCTIVE SYSTEM,2,Moderate,Minor,Surgical,Private Health Insurance,,,,,N,34909.18,20075.71
New York City,Manhattan,7002001,001438,Bellevue Hospital Center,30 to 49,114,F,Other Race,Spanish/Hispanic,1,Elective,Home or Self Care,2022,NEO073,Benign neoplasms,FRS001,HYSTERECTOMY,519,UTERINE AND ADNEXA PROCEDURES FOR LEIOMYOMA,13,DISEASES AND DISORDERS OF THE FEMALE REPRODUCTIVE SYSTEM,1,Minor,Minor,Surgical,Medicaid,,,,,N,58830.35,33832.39
New York City,Manhattan,7002054,001464,New York-Presbyterian Hospital - Columbia Presbyterian Center,50 to 69,104,F,Black/African American,Not Span/Hispanic,3,Elective,Home or Self Care,2022,NEO073,Benign neoplasms,FRS001,HYSTERECTOMY,519,UTERINE AND ADNEXA PROCEDURES FOR LEIOMYOMA,13,DISEASES AND DISORDERS OF THE FEMALE REPRODUCTIVE SYSTEM,2,Moderate,Minor,Surgical,Blue Cross/Blue Shield,,,,,N,112443.63,32947.49
New York City,Manhattan,7002053,001463,NYU Langone Hospitals,30 to 49,100,F,White,Not Span/Hispanic,1,Elective,Home or Self Care,2022,NEO073,Benign neoplasms,FRS010,FEMALE UPPER GENITAL TRACT EXCISION,519,UTERINE AND ADNEXA PROCEDURES FOR LEIOMYOMA,13,DISEASES AND DISORDERS OF THE FEMALE REPRODUCTIVE SYSTEM,2,Moderate,Minor,Surgical,Private Health Insurance,,,,,N,104026.22,16259.71
New York City,Manhattan,7002053,001463,NYU Langone Hospitals,30 to 49,112,F,Black/African American,Not Span/Hispanic,1,Elective,Home or Self Care,2022,NEO073,Benign neoplasms,FRS010,FEMALE UPPER GENITAL TRACT EXCISION,519,UTERINE AND ADNEXA PROCEDURES FOR LEIOMYOMA,13,DISEASES AND DISORDERS OF THE FEMALE REPRODUCTIVE SYSTEM,1,Minor,Minor,Surgical,Private Health Insurance,,,,,N,81243.65,13030.93
Hudson Valley,Dutchess,1302001,000181,Vassar Brothers Medical Center,30 to 49,,F,White,Spanish/Hispanic,2,Elective,Home or Self Care,2022,NEO073,Benign neoplasms,FRS010,FEMALE UPPER GENITAL TRACT EXCISION,519,UTERINE AND ADNEXA PROCEDURES FOR LEIOMYOMA,13,DISEASES AND DISORDERS OF THE FEMALE REPRODUCTIVE SYSTEM,2,Moderate,Minor,Surgical,Self-Pay,,,,,N,25651.87,10482.52
Capital/Adirond,Warren,5601000,001005,Glens Falls Hospital,30 to 49,128,F,White,Not Span/Hispanic,5,Elective,Home or Self Care,2022,NEO073,Benign neoplasms,FRS001,HYSTERECTOMY,519,UTERINE AND ADNEXA PROCEDURES FOR LEIOMYOMA,13,DISEASES AND DISORDERS OF THE FEMALE REPRODUCTIVE SYSTEM,1,Minor,Minor,Surgical,Medicaid,,,,,N,34560.67,13230.84
Hudson Valley,Dutchess,1302001,000181,Vassar Brothers Medical Center,30 to 49,126,F,White,Not Span/Hispanic,2,Elective,Home or Self Care,2022,NEO073,Benign neoplasms,FRS001,HYSTERECTOMY,519,UTERINE AND ADNEXA PROCEDURES FOR LEIOMYOMA,13,DISEASES AND DISORDERS OF THE FEMALE REPRODUCTIVE SYSTEM,2,Moderate,Moderate,Surgical,Blue Cross/Blue Shield,,,,,N,37517.55,14416.49
Hudson Valley,Dutchess,1302001,000181,Vassar Brothers Medical Center,30 to 49,OOS,F,Other Race,Spanish/Hispanic,2,Elective,Home or Self Care,2022,NEO073,Benign neoplasms,FRS001,HYSTERECTOMY,519,UTERINE AND ADNEXA PROCEDURES FOR LEIOMYOMA,13,DISEASES AND DISORDERS OF THE FEMALE REPRODUCTIVE SYSTEM,1,Minor,Minor,Surgical,Self-Pay,,,,,N,24487.08,10100.03
New York City,Manhattan,7002053,001463,NYU Langone Hospitals,30 to 49,112,F,Other Race,Unknown,1,Elective,Home or Self Care,2022,NEO073,Benign neoplasms,FRS001,HYSTERECTOMY,519,UTERINE AND ADNEXA PROCEDURES FOR LEIOMYOMA,13,DISEASES AND DISORDERS OF THE FEMALE REPRODUCTIVE SYSTEM,2,Moderate,Minor,Surgical,Private Health Insurance,,,,,N,107423.10,16549.97
New York City,Manhattan,7002053,001463,NYU Langone Hospitals,30 to 49,112,F,Black/African American,Not Span/Hispanic,3,Elective,Home or Self Care,2022,NEO073,Benign neoplasms,FRS010,FEMALE UPPER GENITAL TRACT EXCISION,519,UTERINE AND ADNEXA PROCEDURES FOR LEIOMYOMA,13,DISEASES AND DISORDERS OF THE FEMALE REPRODUCTIVE SYSTEM,3,Major,Moderate,Surgical,Blue Cross/Blue Shield,,,,,N,158273.80,26300.32
New York City,Manhattan,7002054,001464,New York-Presbyterian Hospital - Columbia Presbyterian Center,30 to 49,117,F,Black/African American,Not Span/Hispanic,3,Elective,Home or Self Care,2022,NEO073,Benign neoplasms,FRS003,SALPINGECTOMY,519,UTERINE AND ADNEXA PROCEDURES FOR LEIOMYOMA,13,DISEASES AND DISORDERS OF THE FEMALE REPRODUCTIVE SYSTEM,1,Minor,Minor,Surgical,Blue Cross/Blue Shield,,,,,N,79765.73,21843.10
New York City,Manhattan,7002001,001438,Bellevue Hospital Center,30 to 49,113,F,Other Race,Spanish/Hispanic,2,Emergency,Home or Self Care,2022,NEO073,Benign neoplasms,FRS003,SALPINGECTOMY,519,UTERINE AND ADNEXA PROCEDURES FOR LEIOMYOMA,13,DISEASES AND DISORDERS OF THE FEMALE REPRODUCTIVE SYSTEM,3,Major,Moderate,Surgical,Medicaid,,,,,Y,49469.92,28449.36
New York City,Manhattan,7002001,001438,Bellevue Hospital Center,30 to 49,101,F,White,Unknown,1,Elective,Home or Self Care,2022,NEO073,Benign neoplasms,FRS001,HYSTERECTOMY,519,UTERINE AND ADNEXA PROCEDURES FOR LEIOMYOMA,13,DISEASES AND DISORDERS OF THE FEMALE REPRODUCTIVE SYSTEM,1,Minor,Minor,Surgical,Self-Pay,,,,,N,27332.62,15718.55
New York City,Manhattan,7002001,001438,Bellevue Hospital Center,50 to 69,113,F,Black/African American,Unknown,3,Elective,Home or Self Care,2022,NEO073,Benign neoplasms,FRS001,HYSTERECTOMY,519,UTERINE AND ADNEXA PROCEDURES FOR LEIOMYOMA,13,DISEASES AND DISORDERS OF THE FEMALE REPRODUCTIVE SYSTEM,2,Moderate,Minor,Surgical,Private Health Insurance,,,,,N,44636.95,25670.00
Finger Lakes,Monroe,2701005,000413,Strong Memorial Hospital,70 or Older,145,F,White,Not Span/Hispanic,1,Elective,Home or Self Care,2022,NEO073,Benign neoplasms,FRS001,HYSTERECTOMY,519,UTERINE AND ADNEXA PROCEDURES FOR LEIOMYOMA,13,DISEASES AND DISORDERS OF THE FEMALE REPRODUCTIVE SYSTEM,1,Minor,Moderate,Surgical,Medicare,,,,,N,33444.94,16523.94
Finger Lakes,Monroe,2701005,000413,Strong Memorial Hospital,30 to 49,144,F,White,Not Span/Hispanic,2,Elective,Home or Self Care,2022,NEO073,Benign neoplasms,FRS001,HYSTERECTOMY,519,UTERINE AND ADNEXA PROCEDURES FOR LEIOMYOMA,13,DISEASES AND DISORDERS OF THE FEMALE REPRODUCTIVE SYSTEM,1,Minor,Minor,Surgical,Blue Cross/Blue Shield,,,,,N,29125.06,14213.19