Hospital Service Area,Hospital County,Operating Certificate Number,Permanent Facility Id,Facility Name,Age Group,Zip Code - 3 digits,Gender,Race,Ethnicity,Length of Stay,Type of Admission,Patient Disposition,Discharge Year,CCS Diagnosis Code,CCS Diagnosis Description,CCS Procedure Code,CCS Procedure Description,APR DRG Code,APR DRG Description,APR MDC Code,APR MDC Description,APR Severity of Illness Code,APR Severity of Illness Description,APR Risk of Mortality,APR Medical Surgical Description,Payment Typology 1,Payment Typology 2,Payment Typology 3,Birth Weight,Abortion Edit Indicator,Emergency Department Indicator,Total Charges,Total Costs
New York City,Manhattan,7002001,001438,Bellevue Hospital Center,0 to 17,112,M,Other Race,Not Span/Hispanic,1,Newborn,Another Type Not Listed,2022,PNL006,Respiratory perinatal condition,CAR024,VENOUS AND ARTERIAL CATHETER PLACEMENT,580,"NEONATE, TRANSFERRED < 5 DAYS OLD, NOT BORN HERE",15,NEWBORNS AND OTHER NEONATES WITH CONDITIONS ORIGINATING IN THE PERINATAL PERIOD,4,Extreme,Major,Medical,Medicaid,,,03800,,N,20243.39,11641.65
Western NY,Cattaraugus,0401001,000066,Olean General Hospital,0 to 17,OOS,F,White,Not Span/Hispanic,1,Elective,Cancer Center or Children's Hospital,2022,PNL007,Hemolytic jaundice and perinatal jaundice,EST002,PHOTOTHERAPY,580,"NEONATE, TRANSFERRED < 5 DAYS OLD, NOT BORN HERE",15,NEWBORNS AND OTHER NEONATES WITH CONDITIONS ORIGINATING IN THE PERINATAL PERIOD,1,Minor,Minor,Medical,Blue Cross/Blue Shield,Medicaid,,03400,,N,1767.60,888.77
New York City,Manhattan,7002001,001438,Bellevue Hospital Center,0 to 17,104,M,Other Race,Unknown,1,Urgent,Short-term Hospital,2022,PNL006,Respiratory perinatal condition,ADM015,ADMINISTRATION OF ANTIBIOTICS,580,"NEONATE, TRANSFERRED < 5 DAYS OLD, NOT BORN HERE",15,NEWBORNS AND OTHER NEONATES WITH CONDITIONS ORIGINATING IN THE PERINATAL PERIOD,4,Extreme,Major,Medical,Medicaid,,,03600,,N,10346.94,5950.36
Hudson Valley,Dutchess,1302001,000181,Vassar Brothers Medical Center,0 to 17,126,F,White,Not Span/Hispanic,1,Emergency,Short-term Hospital,2022,PNL005,Respiratory distress syndrome,GIS017,GASTROSTOMY,580,"NEONATE, TRANSFERRED < 5 DAYS OLD, NOT BORN HERE",15,NEWBORNS AND OTHER NEONATES WITH CONDITIONS ORIGINATING IN THE PERINATAL PERIOD,2,Moderate,Minor,Medical,Blue Cross/Blue Shield,,,02800,,N,6570.25,2505.14
Finger Lakes,Monroe,2701005,000413,Strong Memorial Hospital,0 to 17,144,M,White,Not Span/Hispanic,2,Urgent,Short-term Hospital,2022,PNL013,Other specified and unspecified perinatal conditions,ESA004,NON-INVASIVE VENTILATION,580,"NEONATE, TRANSFERRED < 5 DAYS OLD, NOT BORN HERE",15,NEWBORNS AND OTHER NEONATES WITH CONDITIONS ORIGINATING IN THE PERINATAL PERIOD,3,Major,Moderate,Medical,Private Health Insurance,,,02300,,N,20283.75,6034.39
New York City,Manhattan,7002001,001438,Bellevue Hospital Center,0 to 17,112,F,Other Race,Unknown,1,Urgent,Short-term Hospital,2022,PNL005,Respiratory distress syndrome,ADM021,"ADMINISTRATION OF THERAPEUTIC SUBSTANCES, NEC",580,"NEONATE, TRANSFERRED < 5 DAYS OLD, NOT BORN HERE",15,NEWBORNS AND OTHER NEONATES WITH CONDITIONS ORIGINATING IN THE PERINATAL PERIOD,2,Moderate,Minor,Medical,Medicaid,,,03500,,N,12604.23,7248.49
Long Island,Nassau,2951001,000541,North Shore University Hospital,0 to 17,111,M,Other Race,Not Span/Hispanic,4,Urgent,Short-term Hospital,2022,PNL013,Other specified and unspecified perinatal conditions,ESA004,NON-INVASIVE VENTILATION,580,"NEONATE, TRANSFERRED < 5 DAYS OLD, NOT BORN HERE",15,NEWBORNS AND OTHER NEONATES WITH CONDITIONS ORIGINATING IN THE PERINATAL PERIOD,3,Major,Major,Medical,Blue Cross/Blue Shield,,,03000,,N,95563.15,13178.91
New York City,Manhattan,7002001,001438,Bellevue Hospital Center,0 to 17,104,F,Other Race,Unknown,1,Urgent,Short-term Hospital,2022,PNL004,Neonatal cerebral disorders,ESA003,MECHANICAL VENTILATION,580,"NEONATE, TRANSFERRED < 5 DAYS OLD, NOT BORN HERE",15,NEWBORNS AND OTHER NEONATES WITH CONDITIONS ORIGINATING IN THE PERINATAL PERIOD,4,Extreme,Major,Medical,Medicaid,,,02800,,N,30030.96,17270.32
New York City,Manhattan,7002001,001438,Bellevue Hospital Center,0 to 17,113,F,Other Race,Spanish/Hispanic,1,Urgent,Short-term Hospital,2022,PNL006,Respiratory perinatal condition,ESA003,MECHANICAL VENTILATION,580,"NEONATE, TRANSFERRED < 5 DAYS OLD, NOT BORN HERE",15,NEWBORNS AND OTHER NEONATES WITH CONDITIONS ORIGINATING IN THE PERINATAL PERIOD,3,Major,Moderate,Medical,Medicaid,,,02600,,N,15711.01,9035.15
