Hospital Service Area,Hospital County,Operating Certificate Number,Permanent Facility Id,Facility Name,Age Group,Zip Code - 3 digits,Gender,Race,Ethnicity,Length of Stay,Type of Admission,Patient Disposition,Discharge Year,CCS Diagnosis Code,CCS Diagnosis Description,CCS Procedure Code,CCS Procedure Description,APR DRG Code,APR DRG Description,APR MDC Code,APR MDC Description,APR Severity of Illness Code,APR Severity of Illness Description,APR Risk of Mortality,APR Medical Surgical Description,Payment Typology 1,Payment Typology 2,Payment Typology 3,Birth Weight,Abortion Edit Indicator,Emergency Department Indicator,Total Charges,Total Costs
Finger Lakes,Monroe,2701005,000413,Strong Memorial Hospital,0 to 17,146,F,Black/African American,Not Span/Hispanic,1,Urgent,Expired,2022,NVS013,Coma; stupor; and brain damage,CAR024,VENOUS AND ARTERIAL CATHETER PLACEMENT,059,ANOXIC AND OTHER SEVERE BRAIN DAMAGE,01,DISEASES AND DISORDERS OF THE NERVOUS SYSTEM,3,Major,Major,Medical,Medicaid,,,02100,,N,11640.00,4352.76
Finger Lakes,Monroe,2701005,000413,Strong Memorial Hospital,0 to 17,146,M,Other Race,Spanish/Hispanic,44,Urgent,Home or Self Care,2022,NVS013,Coma; stupor; and brain damage,ESA003,MECHANICAL VENTILATION,059,ANOXIC AND OTHER SEVERE BRAIN DAMAGE,01,DISEASES AND DISORDERS OF THE NERVOUS SYSTEM,4,Extreme,Major,Medical,Medicaid,,,,,N,256536.91,120837.95
Long Island,Nassau,2951001,000541,North Shore University Hospital,70 or Older,113,M,White,Not Span/Hispanic,1,Emergency,Expired,2022,NVS013,Coma; stupor; and brain damage,ESA003,MECHANICAL VENTILATION,059,ANOXIC AND OTHER SEVERE BRAIN DAMAGE,01,DISEASES AND DISORDERS OF THE NERVOUS SYSTEM,4,Extreme,Extreme,Medical,Medicare,Blue Cross/Blue Shield,,,,Y,64012.41,8728.01
New York City,Manhattan,7002054,001464,New York-Presbyterian Hospital - Columbia Presbyterian Center,50 to 69,OOS,F,White,Not Span/Hispanic,6,Urgent,Home w/ Home Health Services,2022,NVS020,Other nervous system disorders (neither hereditary nor degenerative),MAM011,ELECTROENCEPHALOGRAM (EEG),059,ANOXIC AND OTHER SEVERE BRAIN DAMAGE,01,DISEASES AND DISORDERS OF THE NERVOUS SYSTEM,3,Major,Major,Medical,Medicare,Private Health Insurance,,,,N,91522.35,25281.42
Finger Lakes,Monroe,2701005,000413,Strong Memorial Hospital,30 to 49,145,M,White,Not Span/Hispanic,3,Emergency,Expired,2022,NVS013,Coma; stupor; and brain damage,CAR024,VENOUS AND ARTERIAL CATHETER PLACEMENT,059,ANOXIC AND OTHER SEVERE BRAIN DAMAGE,01,DISEASES AND DISORDERS OF THE NERVOUS SYSTEM,4,Extreme,Extreme,Medical,Miscellaneous/Other,Blue Cross/Blue Shield,,,,Y,53477.35,16166.40
New York City,Manhattan,7002054,001464,New York-Presbyterian Hospital - Columbia Presbyterian Center,70 or Older,115,F,White,Not Span/Hispanic,10,Urgent,Skilled Nursing Home,2022,NVS020,Other nervous system disorders (neither hereditary nor degenerative),MAM013,MONITORING OF PERIPHERAL NERVES,059,ANOXIC AND OTHER SEVERE BRAIN DAMAGE,01,DISEASES AND DISORDERS OF THE NERVOUS SYSTEM,3,Major,Major,Medical,Medicare,Private Health Insurance,,,,N,148834.30,31326.65
Hudson Valley,Dutchess,1302001,000181,Vassar Brothers Medical Center,50 to 69,125,F,White,Not Span/Hispanic,10,Emergency,Expired,2022,NVS013,Coma; stupor; and brain damage,ESA003,MECHANICAL VENTILATION,059,ANOXIC AND OTHER SEVERE BRAIN DAMAGE,01,DISEASES AND DISORDERS OF THE NERVOUS SYSTEM,4,Extreme,Extreme,Medical,"Managed Care, Unspecified",,,,,Y,158376.27,57282.03
Long Island,Nassau,2951001,000541,North Shore University Hospital,70 or Older,115,F,White,Not Span/Hispanic,120 +,Emergency,Home or Self Care,2022,END001,Thyroid disorders,ADM006,INFUSION OF VASOPRESSOR,059,ANOXIC AND OTHER SEVERE BRAIN DAMAGE,01,DISEASES AND DISORDERS OF THE NERVOUS SYSTEM,4,Extreme,Extreme,Medical,Medicare,Private Health Insurance,,,,Y,2335243.32,410536.85
New York City,Manhattan,7002001,001438,Bellevue Hospital Center,0 to 17,100,M,Other Race,Unknown,23,Emergency,Short-term Hospital,2022,NVS013,Coma; stupor; and brain damage,ESA003,MECHANICAL VENTILATION,059,ANOXIC AND OTHER SEVERE BRAIN DAMAGE,01,DISEASES AND DISORDERS OF THE NERVOUS SYSTEM,4,Extreme,Extreme,Medical,Medicaid,,,,,Y,380346.04,218730.92
New York City,Manhattan,7002001,001438,Bellevue Hospital Center,50 to 69,113,M,Other Race,Spanish/Hispanic,7,Urgent,Inpatient Rehabilitation Facility,2022,NVS013,Coma; stupor; and brain damage,MAM011,ELECTROENCEPHALOGRAM (EEG),059,ANOXIC AND OTHER SEVERE BRAIN DAMAGE,01,DISEASES AND DISORDERS OF THE NERVOUS SYSTEM,1,Minor,Minor,Medical,Medicaid,,,,,N,55528.41,31933.50
New York City,Manhattan,7002054,001464,New York-Presbyterian Hospital - Columbia Presbyterian Center,30 to 49,112,M,Other Race,Unknown,13,Urgent,Medicare Cert Long Term Care Hospital,2022,NVS013,Coma; stupor; and brain damage,ESA003,MECHANICAL VENTILATION,059,ANOXIC AND OTHER SEVERE BRAIN DAMAGE,01,DISEASES AND DISORDERS OF THE NERVOUS SYSTEM,4,Extreme,Extreme,Medical,Medicaid,,,,,N,338339.52,112683.39
New York City,Manhattan,7002001,001438,Bellevue Hospital Center,50 to 69,100,M,Other Race,Unknown,2,Urgent,Short-term Hospital,2022,NVS013,Coma; stupor; and brain damage,MAM011,ELECTROENCEPHALOGRAM (EEG),059,ANOXIC AND OTHER SEVERE BRAIN DAMAGE,01,DISEASES AND DISORDERS OF THE NERVOUS SYSTEM,4,Extreme,Major,Medical,Medicaid,,,,,N,29190.19,16786.81
New York City,Manhattan,7002001,001438,Bellevue Hospital Center,30 to 49,,M,White,Not Span/Hispanic,12,Urgent,Expired,2022,NVS013,Coma; stupor; and brain damage,ESA003,MECHANICAL VENTILATION,059,ANOXIC AND OTHER SEVERE BRAIN DAMAGE,01,DISEASES AND DISORDERS OF THE NERVOUS SYSTEM,4,Extreme,Extreme,Medical,Medicaid,,,,,N,197303.26,113465.95
New York City,Manhattan,7002001,001438,Bellevue Hospital Center,50 to 69,113,M,Other Race,Spanish/Hispanic,7,Elective,Expired,2022,NVS013,Coma; stupor; and brain damage,ESA003,MECHANICAL VENTILATION,059,ANOXIC AND OTHER SEVERE BRAIN DAMAGE,01,DISEASES AND DISORDERS OF THE NERVOUS SYSTEM,4,Extreme,Extreme,Medical,Medicaid,,,,,N,96675.83,55596.72
New York City,Manhattan,7002001,001438,Bellevue Hospital Center,50 to 69,112,M,Other Race,Spanish/Hispanic,18,Urgent,Expired,2022,NVS013,Coma; stupor; and brain damage,ESA003,MECHANICAL VENTILATION,059,ANOXIC AND OTHER SEVERE BRAIN DAMAGE,01,DISEASES AND DISORDERS OF THE NERVOUS SYSTEM,4,Extreme,Extreme,Medical,Medicaid,,,,,N,304562.54,175149.04
Western NY,Cattaraugus,0401001,000066,Olean General Hospital,70 or Older,147,F,White,Not Span/Hispanic,3,Emergency,Short-term Hospital,2022,END001,Thyroid disorders,CAR024,VENOUS AND ARTERIAL CATHETER PLACEMENT,059,ANOXIC AND OTHER SEVERE BRAIN DAMAGE,01,DISEASES AND DISORDERS OF THE NERVOUS SYSTEM,4,Extreme,Extreme,Medical,Medicare,,,,,Y,20105.71,6945.61
New York City,Manhattan,7002001,001438,Bellevue Hospital Center,70 or Older,104,F,White,Spanish/Hispanic,2,Urgent,Short-term Hospital,2022,NVS013,Coma; stupor; and brain damage,ESA003,MECHANICAL VENTILATION,059,ANOXIC AND OTHER SEVERE BRAIN DAMAGE,01,DISEASES AND DISORDERS OF THE NERVOUS SYSTEM,4,Extreme,Extreme,Medical,Medicare,Private Health Insurance,Medicaid,,,N,29141.44,16758.78
New York City,Manhattan,7002001,001438,Bellevue Hospital Center,30 to 49,100,F,Other Race,Not Span/Hispanic,6,Emergency,Home or Self Care,2022,NVS020,Other nervous system disorders (neither hereditary nor degenerative),ADM021,"ADMINISTRATION OF THERAPEUTIC SUBSTANCES, NEC",059,ANOXIC AND OTHER SEVERE BRAIN DAMAGE,01,DISEASES AND DISORDERS OF THE NERVOUS SYSTEM,1,Minor,Minor,Medical,Medicaid,,,,,Y,60013.23,34512.65
Finger Lakes,Monroe,2701005,000413,Strong Memorial Hospital,0 to 17,145,F,White,Not Span/Hispanic,2,Emergency,Expired,2022,NVS013,Coma; stupor; and brain damage,CAR024,VENOUS AND ARTERIAL CATHETER PLACEMENT,059,ANOXIC AND OTHER SEVERE BRAIN DAMAGE,01,DISEASES AND DISORDERS OF THE NERVOUS SYSTEM,4,Extreme,Extreme,Medical,Private Health Insurance,Medicaid,,,,Y,32202.36,10847.68
Finger Lakes,Monroe,2701005,000413,Strong Memorial Hospital,50 to 69,148,M,White,Not Span/Hispanic,2,Emergency,Expired,2022,NVS013,Coma; stupor; and brain damage,,,059,ANOXIC AND OTHER SEVERE BRAIN DAMAGE,01,DISEASES AND DISORDERS OF THE NERVOUS SYSTEM,4,Extreme,Extreme,Medical,Medicaid,,,,,Y,45142.34,13410.88
Finger Lakes,Monroe,2701005,000413,Strong Memorial Hospital,70 or Older,146,F,White,Not Span/Hispanic,15,Emergency,Home or Self Care,2022,END001,Thyroid disorders,,,059,ANOXIC AND OTHER SEVERE BRAIN DAMAGE,01,DISEASES AND DISORDERS OF THE NERVOUS SYSTEM,4,Extreme,Extreme,Medical,Medicare,,,,,Y,53805.22,24686.23
Hudson Valley,Dutchess,1302001,000181,Vassar Brothers Medical Center,50 to 69,125,F,White,Not Span/Hispanic,7,Emergency,Skilled Nursing Home,2022,END001,Thyroid disorders,,,059,ANOXIC AND OTHER SEVERE BRAIN DAMAGE,01,DISEASES AND DISORDERS OF THE NERVOUS SYSTEM,3,Major,Extreme,Medical,Medicare,Medicaid,,,,Y,70691.96,19979.54
Hudson Valley,Dutchess,1302001,000181,Vassar Brothers Medical Center,70 or Older,126,F,White,Not Span/Hispanic,8,Emergency,Skilled Nursing Home,2022,END001,Thyroid disorders,PLC001,IMMOBILIZATION BY SPLINT OR OTHER EXTERNAL DEVICE,059,ANOXIC AND OTHER SEVERE BRAIN DAMAGE,01,DISEASES AND DISORDERS OF THE NERVOUS SYSTEM,3,Major,Major,Medical,Medicare,,,,,Y,46716.07,15397.00
New York City,Manhattan,7002001,001438,Bellevue Hospital Center,50 to 69,104,M,Black/African American,Unknown,5,Urgent,Expired,2022,NVS013,Coma; stupor; and brain damage,MAM010,OTHER CARDIOVASCULAR SYSTEM MEASUREMENT AND MONITORING,059,ANOXIC AND OTHER SEVERE BRAIN DAMAGE,01,DISEASES AND DISORDERS OF THE NERVOUS SYSTEM,4,Extreme,Extreme,Medical,Medicare,Medicaid,,,,N,70816.97,40725.71
New York City,Manhattan,7002001,001438,Bellevue Hospital Center,50 to 69,100,M,Black/African American,Not Span/Hispanic,6,Emergency,Home or Self Care,2022,NVS013,Coma; stupor; and brain damage,SUD001,SUBSTANCE USE DETOXIFICATION,059,ANOXIC AND OTHER SEVERE BRAIN DAMAGE,01,DISEASES AND DISORDERS OF THE NERVOUS SYSTEM,1,Minor,Minor,Medical,Medicaid,,,,,Y,49608.98,28529.33
Long Island,Nassau,2951001,000541,North Shore University Hospital,18 to 29,115,F,White,Not Span/Hispanic,1,Emergency,Home or Self Care,2022,NVS020,Other nervous system disorders (neither hereditary nor degenerative),,,059,ANOXIC AND OTHER SEVERE BRAIN DAMAGE,01,DISEASES AND DISORDERS OF THE NERVOUS SYSTEM,3,Major,Major,Medical,Private Health Insurance,,,,,Y,41181.33,5160.70
Finger Lakes,Monroe,2701005,000413,Strong Memorial Hospital,30 to 49,140,M,White,Not Span/Hispanic,1,Elective,Home or Self Care,2022,NVS020,Other nervous system disorders (neither hereditary nor degenerative),,,059,ANOXIC AND OTHER SEVERE BRAIN DAMAGE,01,DISEASES AND DISORDERS OF THE NERVOUS SYSTEM,1,Minor,Minor,Medical,Blue Cross/Blue Shield,,,,,N,1829.00,1153.00
Hudson Valley,Dutchess,1302001,000181,Vassar Brothers Medical Center,70 or Older,126,M,White,Not Span/Hispanic,3,Emergency,Home w/ Home Health Services,2022,END001,Thyroid disorders,,,059,ANOXIC AND OTHER SEVERE BRAIN DAMAGE,01,DISEASES AND DISORDERS OF THE NERVOUS SYSTEM,3,Major,Major,Medical,Medicare,Federal/State/Local/VA,,,,Y,23658.69,9035.23
New York City,Manhattan,7002001,001438,Bellevue Hospital Center,18 to 29,114,F,Other Race,Unknown,7,Urgent,Expired,2022,NVS013,Coma; stupor; and brain damage,ESA003,MECHANICAL VENTILATION,059,ANOXIC AND OTHER SEVERE BRAIN DAMAGE,01,DISEASES AND DISORDERS OF THE NERVOUS SYSTEM,4,Extreme,Extreme,Medical,Medicaid,,,,,N,125477.60,72160.16
