Hospital Service Area,Hospital County,Operating Certificate Number,Permanent Facility Id,Facility Name,Age Group,Zip Code - 3 digits,Gender,Race,Ethnicity,Length of Stay,Type of Admission,Patient Disposition,Discharge Year,CCS Diagnosis Code,CCS Diagnosis Description,CCS Procedure Code,CCS Procedure Description,APR DRG Code,APR DRG Description,APR MDC Code,APR MDC Description,APR Severity of Illness Code,APR Severity of Illness Description,APR Risk of Mortality,APR Medical Surgical Description,Payment Typology 1,Payment Typology 2,Payment Typology 3,Birth Weight,Abortion Edit Indicator,Emergency Department Indicator,Total Charges,Total Costs
New York City,Manhattan,7002001,001438,Bellevue Hospital Center,0 to 17,112,M,Other Race,Unknown,50,Newborn,Home or Self Care,2022,PNL001,Liveborn,CAR024,VENOUS AND ARTERIAL CATHETER PLACEMENT,607,NEONATE BIRTH WEIGHT 1250-1499 GRAMS WITH RESPIRATORY DISTRESS SYNDROME OR OTHER MAJOR RESPIRATORY CONDITION OR MAJOR ANOMALY,15,NEWBORNS AND OTHER NEONATES WITH CONDITIONS ORIGINATING IN THE PERINATAL PERIOD,4,Extreme,Major,Medical,Medicaid,,,01300,,N,461726.33,265531.42
New York City,Manhattan,7002054,001464,New York-Presbyterian Hospital - Columbia Presbyterian Center,0 to 17,100,M,White,Not Span/Hispanic,45,Newborn,Home or Self Care,2022,PNL001,Liveborn,ADM010,VACCINATIONS,607,NEONATE BIRTH WEIGHT 1250-1499 GRAMS WITH RESPIRATORY DISTRESS SYNDROME OR OTHER MAJOR RESPIRATORY CONDITION OR MAJOR ANOMALY,15,NEWBORNS AND OTHER NEONATES WITH CONDITIONS ORIGINATING IN THE PERINATAL PERIOD,3,Major,Moderate,Medical,Blue Cross/Blue Shield,,,01400,,N,1086731.30,226134.43
New York City,Manhattan,7002001,001438,Bellevue Hospital Center,0 to 17,100,F,Other Race,Spanish/Hispanic,34,Newborn,Home or Self Care,2022,PNL001,Liveborn,IMG008,ULTRASONOGRAPHY,607,NEONATE BIRTH WEIGHT 1250-1499 GRAMS WITH RESPIRATORY DISTRESS SYNDROME OR OTHER MAJOR RESPIRATORY CONDITION OR MAJOR ANOMALY,15,NEWBORNS AND OTHER NEONATES WITH CONDITIONS ORIGINATING IN THE PERINATAL PERIOD,2,Moderate,Minor,Medical,Medicaid,,,01300,,N,306741.76,176402.28
New York City,Manhattan,7002053,001463,NYU Langone Hospitals,0 to 17,112,F,Black/African American,Not Span/Hispanic,50,Newborn,Home or Self Care,2022,PNL001,Liveborn,ESA004,NON-INVASIVE VENTILATION,607,NEONATE BIRTH WEIGHT 1250-1499 GRAMS WITH RESPIRATORY DISTRESS SYNDROME OR OTHER MAJOR RESPIRATORY CONDITION OR MAJOR ANOMALY,15,NEWBORNS AND OTHER NEONATES WITH CONDITIONS ORIGINATING IN THE PERINATAL PERIOD,3,Major,Moderate,Medical,Medicaid,,,01300,,N,753937.35,271496.86
New York City,Manhattan,7002053,001463,NYU Langone Hospitals,0 to 17,112,F,White,Not Span/Hispanic,23,Newborn,Home or Self Care,2022,PNL001,Liveborn,ESA004,NON-INVASIVE VENTILATION,607,NEONATE BIRTH WEIGHT 1250-1499 GRAMS WITH RESPIRATORY DISTRESS SYNDROME OR OTHER MAJOR RESPIRATORY CONDITION OR MAJOR ANOMALY,15,NEWBORNS AND OTHER NEONATES WITH CONDITIONS ORIGINATING IN THE PERINATAL PERIOD,2,Moderate,Minor,Medical,Private Health Insurance,,,01400,,N,329959.29,113639.29
New York City,Manhattan,7002054,001464,New York-Presbyterian Hospital - Columbia Presbyterian Center,0 to 17,104,M,Other Race,Spanish/Hispanic,35,Newborn,Home or Self Care,2022,PNL001,Liveborn,ADM010,VACCINATIONS,607,NEONATE BIRTH WEIGHT 1250-1499 GRAMS WITH RESPIRATORY DISTRESS SYNDROME OR OTHER MAJOR RESPIRATORY CONDITION OR MAJOR ANOMALY,15,NEWBORNS AND OTHER NEONATES WITH CONDITIONS ORIGINATING IN THE PERINATAL PERIOD,1,Minor,Minor,Medical,Medicaid,,,01300,,N,836849.97,174147.97
Finger Lakes,Monroe,2701005,000413,Strong Memorial Hospital,0 to 17,144,M,Other Race,Spanish/Hispanic,48,Newborn,Home or Self Care,2022,PNL001,Liveborn,RES007,AIRWAY INTUBATION,607,NEONATE BIRTH WEIGHT 1250-1499 GRAMS WITH RESPIRATORY DISTRESS SYNDROME OR OTHER MAJOR RESPIRATORY CONDITION OR MAJOR ANOMALY,15,NEWBORNS AND OTHER NEONATES WITH CONDITIONS ORIGINATING IN THE PERINATAL PERIOD,3,Major,Moderate,Medical,Medicaid,,,01300,,N,376550.79,127812.12
Finger Lakes,Monroe,2701005,000413,Strong Memorial Hospital,0 to 17,146,M,White,Not Span/Hispanic,60,Newborn,Home or Self Care,2022,PNL001,Liveborn,ADM021,"ADMINISTRATION OF THERAPEUTIC SUBSTANCES, NEC",607,NEONATE BIRTH WEIGHT 1250-1499 GRAMS WITH RESPIRATORY DISTRESS SYNDROME OR OTHER MAJOR RESPIRATORY CONDITION OR MAJOR ANOMALY,15,NEWBORNS AND OTHER NEONATES WITH CONDITIONS ORIGINATING IN THE PERINATAL PERIOD,3,Major,Minor,Medical,Private Health Insurance,,,01400,,N,447100.47,145442.32
New York City,Manhattan,7002053,001463,NYU Langone Hospitals,0 to 17,112,F,Other Race,Spanish/Hispanic,59,Newborn,Home or Self Care,2022,PNL001,Liveborn,ESA004,NON-INVASIVE VENTILATION,607,NEONATE BIRTH WEIGHT 1250-1499 GRAMS WITH RESPIRATORY DISTRESS SYNDROME OR OTHER MAJOR RESPIRATORY CONDITION OR MAJOR ANOMALY,15,NEWBORNS AND OTHER NEONATES WITH CONDITIONS ORIGINATING IN THE PERINATAL PERIOD,2,Moderate,Moderate,Medical,Private Health Insurance,Medicaid,,01200,,N,847275.55,299473.19
Finger Lakes,Monroe,2701005,000413,Strong Memorial Hospital,0 to 17,144,F,White,Not Span/Hispanic,17,Newborn,Home or Self Care,2022,PNL001,Liveborn,CAR024,VENOUS AND ARTERIAL CATHETER PLACEMENT,607,NEONATE BIRTH WEIGHT 1250-1499 GRAMS WITH RESPIRATORY DISTRESS SYNDROME OR OTHER MAJOR RESPIRATORY CONDITION OR MAJOR ANOMALY,15,NEWBORNS AND OTHER NEONATES WITH CONDITIONS ORIGINATING IN THE PERINATAL PERIOD,3,Major,Moderate,Medical,Medicaid,,,01400,,N,106881.72,44651.48
Finger Lakes,Monroe,2701005,000413,Strong Memorial Hospital,0 to 17,145,M,White,Not Span/Hispanic,62,Newborn,Home or Self Care,2022,PNL001,Liveborn,ADM021,"ADMINISTRATION OF THERAPEUTIC SUBSTANCES, NEC",607,NEONATE BIRTH WEIGHT 1250-1499 GRAMS WITH RESPIRATORY DISTRESS SYNDROME OR OTHER MAJOR RESPIRATORY CONDITION OR MAJOR ANOMALY,15,NEWBORNS AND OTHER NEONATES WITH CONDITIONS ORIGINATING IN THE PERINATAL PERIOD,3,Major,Minor,Medical,Medicaid,,,01200,,N,377773.18,130873.36
New York City,Manhattan,7002054,001464,New York-Presbyterian Hospital - Columbia Presbyterian Center,0 to 17,104,M,Other Race,Spanish/Hispanic,40,Newborn,Home or Self Care,2022,PNL001,Liveborn,ESA004,NON-INVASIVE VENTILATION,607,NEONATE BIRTH WEIGHT 1250-1499 GRAMS WITH RESPIRATORY DISTRESS SYNDROME OR OTHER MAJOR RESPIRATORY CONDITION OR MAJOR ANOMALY,15,NEWBORNS AND OTHER NEONATES WITH CONDITIONS ORIGINATING IN THE PERINATAL PERIOD,3,Major,Major,Medical,Medicaid,,,01200,,N,974924.37,204604.44
New York City,Manhattan,7002054,001464,New York-Presbyterian Hospital - Columbia Presbyterian Center,0 to 17,109,M,White,Not Span/Hispanic,51,Newborn,Home or Self Care,2022,PNL001,Liveborn,ESA004,NON-INVASIVE VENTILATION,607,NEONATE BIRTH WEIGHT 1250-1499 GRAMS WITH RESPIRATORY DISTRESS SYNDROME OR OTHER MAJOR RESPIRATORY CONDITION OR MAJOR ANOMALY,15,NEWBORNS AND OTHER NEONATES WITH CONDITIONS ORIGINATING IN THE PERINATAL PERIOD,3,Major,Major,Medical,Medicaid,,,01300,,N,1349130.65,280916.27
Long Island,Nassau,2951001,000541,North Shore University Hospital,0 to 17,114,M,Other Race,Not Span/Hispanic,18,Newborn,Home or Self Care,2022,PNL001,Liveborn,ESA004,NON-INVASIVE VENTILATION,607,NEONATE BIRTH WEIGHT 1250-1499 GRAMS WITH RESPIRATORY DISTRESS SYNDROME OR OTHER MAJOR RESPIRATORY CONDITION OR MAJOR ANOMALY,15,NEWBORNS AND OTHER NEONATES WITH CONDITIONS ORIGINATING IN THE PERINATAL PERIOD,1,Minor,Minor,Medical,Blue Cross/Blue Shield,,,01300,,N,364638.29,51576.28
New York City,Manhattan,7002053,001463,NYU Langone Hospitals,0 to 17,OOS,F,Multi-racial,Not Span/Hispanic,30,Newborn,Home or Self Care,2022,PNL001,Liveborn,CAR024,VENOUS AND ARTERIAL CATHETER PLACEMENT,607,NEONATE BIRTH WEIGHT 1250-1499 GRAMS WITH RESPIRATORY DISTRESS SYNDROME OR OTHER MAJOR RESPIRATORY CONDITION OR MAJOR ANOMALY,15,NEWBORNS AND OTHER NEONATES WITH CONDITIONS ORIGINATING IN THE PERINATAL PERIOD,2,Moderate,Minor,Medical,Private Health Insurance,,,01300,,N,454296.52,154135.63
New York City,Manhattan,7002054,001464,New York-Presbyterian Hospital - Columbia Presbyterian Center,0 to 17,117,F,White,Not Span/Hispanic,10,Newborn,Short-term Hospital,2022,PNL001,Liveborn,ESA004,NON-INVASIVE VENTILATION,607,NEONATE BIRTH WEIGHT 1250-1499 GRAMS WITH RESPIRATORY DISTRESS SYNDROME OR OTHER MAJOR RESPIRATORY CONDITION OR MAJOR ANOMALY,15,NEWBORNS AND OTHER NEONATES WITH CONDITIONS ORIGINATING IN THE PERINATAL PERIOD,2,Moderate,Minor,Medical,Blue Cross/Blue Shield,,,01300,,N,265144.07,55333.01
Hudson Valley,Dutchess,1302001,000181,Vassar Brothers Medical Center,0 to 17,125,F,White,Unknown,54,Newborn,Home or Self Care,2022,PNL001,Liveborn,CAR024,VENOUS AND ARTERIAL CATHETER PLACEMENT,607,NEONATE BIRTH WEIGHT 1250-1499 GRAMS WITH RESPIRATORY DISTRESS SYNDROME OR OTHER MAJOR RESPIRATORY CONDITION OR MAJOR ANOMALY,15,NEWBORNS AND OTHER NEONATES WITH CONDITIONS ORIGINATING IN THE PERINATAL PERIOD,3,Major,Moderate,Medical,Blue Cross/Blue Shield,,,01200,,N,255871.39,111032.86
New York City,Manhattan,7002053,001463,NYU Langone Hospitals,0 to 17,112,M,White,Not Span/Hispanic,51,Newborn,Home or Self Care,2022,PNL001,Liveborn,ESA004,NON-INVASIVE VENTILATION,607,NEONATE BIRTH WEIGHT 1250-1499 GRAMS WITH RESPIRATORY DISTRESS SYNDROME OR OTHER MAJOR RESPIRATORY CONDITION OR MAJOR ANOMALY,15,NEWBORNS AND OTHER NEONATES WITH CONDITIONS ORIGINATING IN THE PERINATAL PERIOD,2,Moderate,Minor,Medical,Medicaid,,,01300,,N,754322.00,265522.01
New York City,Manhattan,7002054,001464,New York-Presbyterian Hospital - Columbia Presbyterian Center,0 to 17,100,F,White,Not Span/Hispanic,22,Newborn,Home or Self Care,2022,PNL001,Liveborn,ESA004,NON-INVASIVE VENTILATION,607,NEONATE BIRTH WEIGHT 1250-1499 GRAMS WITH RESPIRATORY DISTRESS SYNDROME OR OTHER MAJOR RESPIRATORY CONDITION OR MAJOR ANOMALY,15,NEWBORNS AND OTHER NEONATES WITH CONDITIONS ORIGINATING IN THE PERINATAL PERIOD,2,Moderate,Minor,Medical,Private Health Insurance,,,01300,,N,527399.19,109439.99
New York City,Manhattan,7002054,001464,New York-Presbyterian Hospital - Columbia Presbyterian Center,0 to 17,104,M,Other Race,Spanish/Hispanic,23,Newborn,Home or Self Care,2022,PNL001,Liveborn,ESA004,NON-INVASIVE VENTILATION,607,NEONATE BIRTH WEIGHT 1250-1499 GRAMS WITH RESPIRATORY DISTRESS SYNDROME OR OTHER MAJOR RESPIRATORY CONDITION OR MAJOR ANOMALY,15,NEWBORNS AND OTHER NEONATES WITH CONDITIONS ORIGINATING IN THE PERINATAL PERIOD,2,Moderate,Moderate,Medical,Medicaid,,,01400,,N,553228.35,114541.46
Finger Lakes,Monroe,2701005,000413,Strong Memorial Hospital,0 to 17,144,F,White,Not Span/Hispanic,59,Newborn,Home or Self Care,2022,PNL001,Liveborn,ADM021,"ADMINISTRATION OF THERAPEUTIC SUBSTANCES, NEC",607,NEONATE BIRTH WEIGHT 1250-1499 GRAMS WITH RESPIRATORY DISTRESS SYNDROME OR OTHER MAJOR RESPIRATORY CONDITION OR MAJOR ANOMALY,15,NEWBORNS AND OTHER NEONATES WITH CONDITIONS ORIGINATING IN THE PERINATAL PERIOD,3,Major,Moderate,Medical,Medicaid,,,01400,,N,381296.55,142069.25
Finger Lakes,Monroe,2701005,000413,Strong Memorial Hospital,0 to 17,146,F,Other Race,Not Span/Hispanic,31,Newborn,Home or Self Care,2022,PNL001,Liveborn,ADM021,"ADMINISTRATION OF THERAPEUTIC SUBSTANCES, NEC",607,NEONATE BIRTH WEIGHT 1250-1499 GRAMS WITH RESPIRATORY DISTRESS SYNDROME OR OTHER MAJOR RESPIRATORY CONDITION OR MAJOR ANOMALY,15,NEWBORNS AND OTHER NEONATES WITH CONDITIONS ORIGINATING IN THE PERINATAL PERIOD,2,Moderate,Minor,Medical,Medicaid,,,01400,,N,123779.79,60937.20
Finger Lakes,Monroe,2701005,000413,Strong Memorial Hospital,0 to 17,146,F,White,Not Span/Hispanic,54,Newborn,Home or Self Care,2022,PNL001,Liveborn,ADM021,"ADMINISTRATION OF THERAPEUTIC SUBSTANCES, NEC",607,NEONATE BIRTH WEIGHT 1250-1499 GRAMS WITH RESPIRATORY DISTRESS SYNDROME OR OTHER MAJOR RESPIRATORY CONDITION OR MAJOR ANOMALY,15,NEWBORNS AND OTHER NEONATES WITH CONDITIONS ORIGINATING IN THE PERINATAL PERIOD,2,Moderate,Minor,Medical,Blue Cross/Blue Shield,,,01200,,N,307798.55,133124.49
Finger Lakes,Monroe,2701005,000413,Strong Memorial Hospital,0 to 17,146,M,White,Not Span/Hispanic,32,Newborn,Home or Self Care,2022,PNL001,Liveborn,ADM021,"ADMINISTRATION OF THERAPEUTIC SUBSTANCES, NEC",607,NEONATE BIRTH WEIGHT 1250-1499 GRAMS WITH RESPIRATORY DISTRESS SYNDROME OR OTHER MAJOR RESPIRATORY CONDITION OR MAJOR ANOMALY,15,NEWBORNS AND OTHER NEONATES WITH CONDITIONS ORIGINATING IN THE PERINATAL PERIOD,1,Minor,Minor,Medical,Medicaid,,,01300,,N,170069.67,74189.76
Finger Lakes,Monroe,2701005,000413,Strong Memorial Hospital,0 to 17,146,M,Other Race,Not Span/Hispanic,35,Newborn,Home or Self Care,2022,PNL001,Liveborn,ADM021,"ADMINISTRATION OF THERAPEUTIC SUBSTANCES, NEC",607,NEONATE BIRTH WEIGHT 1250-1499 GRAMS WITH RESPIRATORY DISTRESS SYNDROME OR OTHER MAJOR RESPIRATORY CONDITION OR MAJOR ANOMALY,15,NEWBORNS AND OTHER NEONATES WITH CONDITIONS ORIGINATING IN THE PERINATAL PERIOD,2,Moderate,Minor,Medical,Medicaid,,,01300,,N,263224.35,85116.01
Finger Lakes,Monroe,2701005,000413,Strong Memorial Hospital,0 to 17,146,F,Black/African American,Unknown,36,Newborn,Home or Self Care,2022,PNL001,Liveborn,RES007,AIRWAY INTUBATION,607,NEONATE BIRTH WEIGHT 1250-1499 GRAMS WITH RESPIRATORY DISTRESS SYNDROME OR OTHER MAJOR RESPIRATORY CONDITION OR MAJOR ANOMALY,15,NEWBORNS AND OTHER NEONATES WITH CONDITIONS ORIGINATING IN THE PERINATAL PERIOD,3,Major,Minor,Medical,Medicaid,,,01200,,N,227831.16,88985.31
Finger Lakes,Monroe,2701005,000413,Strong Memorial Hospital,0 to 17,145,M,Black/African American,Not Span/Hispanic,33,Urgent,Home or Self Care,2022,PNL005,Respiratory distress syndrome,ADM017,ADMINISTRATION OF NUTRITIONAL AND ELECTROLYTIC SUBSTANCES,607,NEONATE BIRTH WEIGHT 1250-1499 GRAMS WITH RESPIRATORY DISTRESS SYNDROME OR OTHER MAJOR RESPIRATORY CONDITION OR MAJOR ANOMALY,15,NEWBORNS AND OTHER NEONATES WITH CONDITIONS ORIGINATING IN THE PERINATAL PERIOD,3,Major,Moderate,Medical,Medicaid,,,01200,,N,198689.08,74930.34
Finger Lakes,Monroe,2701005,000413,Strong Memorial Hospital,0 to 17,146,F,Black/African American,Not Span/Hispanic,27,Urgent,Home or Self Care,2022,PNL002,Short gestation; low birth weight; and fetal growth retardation,CAR024,VENOUS AND ARTERIAL CATHETER PLACEMENT,607,NEONATE BIRTH WEIGHT 1250-1499 GRAMS WITH RESPIRATORY DISTRESS SYNDROME OR OTHER MAJOR RESPIRATORY CONDITION OR MAJOR ANOMALY,15,NEWBORNS AND OTHER NEONATES WITH CONDITIONS ORIGINATING IN THE PERINATAL PERIOD,1,Minor,Minor,Medical,Medicaid,,,01400,,N,173681.27,70830.56
Long Island,Nassau,2951001,000541,North Shore University Hospital,0 to 17,113,F,Other Race,Spanish/Hispanic,18,Newborn,Home w/ Home Health Services,2022,PNL001,Liveborn,CAR024,VENOUS AND ARTERIAL CATHETER PLACEMENT,607,NEONATE BIRTH WEIGHT 1250-1499 GRAMS WITH RESPIRATORY DISTRESS SYNDROME OR OTHER MAJOR RESPIRATORY CONDITION OR MAJOR ANOMALY,15,NEWBORNS AND OTHER NEONATES WITH CONDITIONS ORIGINATING IN THE PERINATAL PERIOD,3,Major,Major,Medical,Medicaid,,,01300,,N,364148.62,51849.12
New York City,Manhattan,7002001,001438,Bellevue Hospital Center,0 to 17,112,M,Black/African American,Unknown,33,Newborn,Home or Self Care,2022,PNL001,Liveborn,ESA004,NON-INVASIVE VENTILATION,607,NEONATE BIRTH WEIGHT 1250-1499 GRAMS WITH RESPIRATORY DISTRESS SYNDROME OR OTHER MAJOR RESPIRATORY CONDITION OR MAJOR ANOMALY,15,NEWBORNS AND OTHER NEONATES WITH CONDITIONS ORIGINATING IN THE PERINATAL PERIOD,2,Moderate,Moderate,Medical,Medicaid,,,01400,,N,307930.39,177085.84
New York City,Manhattan,7002054,001464,New York-Presbyterian Hospital - Columbia Presbyterian Center,0 to 17,100,F,Other Race,Spanish/Hispanic,41,Newborn,Home or Self Care,2022,PNL001,Liveborn,ESA004,NON-INVASIVE VENTILATION,607,NEONATE BIRTH WEIGHT 1250-1499 GRAMS WITH RESPIRATORY DISTRESS SYNDROME OR OTHER MAJOR RESPIRATORY CONDITION OR MAJOR ANOMALY,15,NEWBORNS AND OTHER NEONATES WITH CONDITIONS ORIGINATING IN THE PERINATAL PERIOD,3,Major,Major,Medical,Medicaid,,,01200,,N,1050030.62,218170.70
New York City,Manhattan,7002001,001438,Bellevue Hospital Center,0 to 17,112,F,Black/African American,Unknown,30,Newborn,Home or Self Care,2022,PNL001,Liveborn,ESA004,NON-INVASIVE VENTILATION,607,NEONATE BIRTH WEIGHT 1250-1499 GRAMS WITH RESPIRATORY DISTRESS SYNDROME OR OTHER MAJOR RESPIRATORY CONDITION OR MAJOR ANOMALY,15,NEWBORNS AND OTHER NEONATES WITH CONDITIONS ORIGINATING IN THE PERINATAL PERIOD,2,Moderate,Moderate,Medical,Medicaid,,,01300,,N,234230.65,134702.30
Finger Lakes,Monroe,2701005,000413,Strong Memorial Hospital,0 to 17,144,F,White,Not Span/Hispanic,33,Newborn,Home or Self Care,2022,PNL001,Liveborn,RES007,AIRWAY INTUBATION,607,NEONATE BIRTH WEIGHT 1250-1499 GRAMS WITH RESPIRATORY DISTRESS SYNDROME OR OTHER MAJOR RESPIRATORY CONDITION OR MAJOR ANOMALY,15,NEWBORNS AND OTHER NEONATES WITH CONDITIONS ORIGINATING IN THE PERINATAL PERIOD,3,Major,Major,Medical,Blue Cross/Blue Shield,,,01400,,N,204531.39,78553.91
New York City,Manhattan,7002054,001464,New York-Presbyterian Hospital - Columbia Presbyterian Center,0 to 17,112,M,Other Race,Not Span/Hispanic,21,Newborn,Home or Self Care,2022,PNL001,Liveborn,ESA004,NON-INVASIVE VENTILATION,607,NEONATE BIRTH WEIGHT 1250-1499 GRAMS WITH RESPIRATORY DISTRESS SYNDROME OR OTHER MAJOR RESPIRATORY CONDITION OR MAJOR ANOMALY,15,NEWBORNS AND OTHER NEONATES WITH CONDITIONS ORIGINATING IN THE PERINATAL PERIOD,2,Moderate,Moderate,Medical,Private Health Insurance,,,01200,,N,510331.09,105021.61
Long Island,Nassau,2951001,000541,North Shore University Hospital,0 to 17,115,F,White,Spanish/Hispanic,39,Newborn,Home w/ Home Health Services,2022,PNL001,Liveborn,ADM017,ADMINISTRATION OF NUTRITIONAL AND ELECTROLYTIC SUBSTANCES,607,NEONATE BIRTH WEIGHT 1250-1499 GRAMS WITH RESPIRATORY DISTRESS SYNDROME OR OTHER MAJOR RESPIRATORY CONDITION OR MAJOR ANOMALY,15,NEWBORNS AND OTHER NEONATES WITH CONDITIONS ORIGINATING IN THE PERINATAL PERIOD,3,Major,Minor,Medical,Medicaid,Medicaid,,01300,,N,776952.27,108785.10
New York City,Manhattan,7002053,001463,NYU Langone Hospitals,0 to 17,112,F,Other Race,Not Span/Hispanic,64,Newborn,Home or Self Care,2022,PNL001,Liveborn,ADM017,ADMINISTRATION OF NUTRITIONAL AND ELECTROLYTIC SUBSTANCES,607,NEONATE BIRTH WEIGHT 1250-1499 GRAMS WITH RESPIRATORY DISTRESS SYNDROME OR OTHER MAJOR RESPIRATORY CONDITION OR MAJOR ANOMALY,15,NEWBORNS AND OTHER NEONATES WITH CONDITIONS ORIGINATING IN THE PERINATAL PERIOD,2,Moderate,Minor,Medical,Medicaid,,,01400,,N,969820.76,332899.32
New York City,Manhattan,7002054,001464,New York-Presbyterian Hospital - Columbia Presbyterian Center,0 to 17,,M,Multi-racial,Spanish/Hispanic,45,Newborn,Home or Self Care,2022,PNL001,Liveborn,CAR024,VENOUS AND ARTERIAL CATHETER PLACEMENT,607,NEONATE BIRTH WEIGHT 1250-1499 GRAMS WITH RESPIRATORY DISTRESS SYNDROME OR OTHER MAJOR RESPIRATORY CONDITION OR MAJOR ANOMALY,15,NEWBORNS AND OTHER NEONATES WITH CONDITIONS ORIGINATING IN THE PERINATAL PERIOD,3,Major,Moderate,Medical,Medicaid,,,01300,,N,1133564.04,236888.44
New York City,Manhattan,7002001,001438,Bellevue Hospital Center,0 to 17,112,F,Other Race,Unknown,28,Newborn,Home or Self Care,2022,PNL001,Liveborn,ESA004,NON-INVASIVE VENTILATION,607,NEONATE BIRTH WEIGHT 1250-1499 GRAMS WITH RESPIRATORY DISTRESS SYNDROME OR OTHER MAJOR RESPIRATORY CONDITION OR MAJOR ANOMALY,15,NEWBORNS AND OTHER NEONATES WITH CONDITIONS ORIGINATING IN THE PERINATAL PERIOD,2,Moderate,Moderate,Medical,Medicaid,,,01400,,N,177102.67,101848.91
Finger Lakes,Monroe,2701005,000413,Strong Memorial Hospital,0 to 17,145,M,White,Spanish/Hispanic,57,Newborn,Home or Self Care,2022,PNL001,Liveborn,CAR024,VENOUS AND ARTERIAL CATHETER PLACEMENT,607,NEONATE BIRTH WEIGHT 1250-1499 GRAMS WITH RESPIRATORY DISTRESS SYNDROME OR OTHER MAJOR RESPIRATORY CONDITION OR MAJOR ANOMALY,15,NEWBORNS AND OTHER NEONATES WITH CONDITIONS ORIGINATING IN THE PERINATAL PERIOD,1,Minor,Minor,Medical,Medicaid,,,01300,,N,353473.96,118754.29
Finger Lakes,Monroe,2701005,000413,Strong Memorial Hospital,0 to 17,146,F,Other Race,Spanish/Hispanic,32,Newborn,Home or Self Care,2022,PNL001,Liveborn,ESA004,NON-INVASIVE VENTILATION,607,NEONATE BIRTH WEIGHT 1250-1499 GRAMS WITH RESPIRATORY DISTRESS SYNDROME OR OTHER MAJOR RESPIRATORY CONDITION OR MAJOR ANOMALY,15,NEWBORNS AND OTHER NEONATES WITH CONDITIONS ORIGINATING IN THE PERINATAL PERIOD,1,Minor,Minor,Medical,Medicaid,,,01400,,N,192688.76,67047.85
New York City,Manhattan,7002054,001464,New York-Presbyterian Hospital - Columbia Presbyterian Center,0 to 17,105,F,Other Race,Spanish/Hispanic,26,Newborn,Home or Self Care,2022,PNL001,Liveborn,ESA004,NON-INVASIVE VENTILATION,607,NEONATE BIRTH WEIGHT 1250-1499 GRAMS WITH RESPIRATORY DISTRESS SYNDROME OR OTHER MAJOR RESPIRATORY CONDITION OR MAJOR ANOMALY,15,NEWBORNS AND OTHER NEONATES WITH CONDITIONS ORIGINATING IN THE PERINATAL PERIOD,2,Moderate,Moderate,Medical,Medicaid,,,01300,,N,647649.41,136619.98
New York City,Manhattan,7002054,001464,New York-Presbyterian Hospital - Columbia Presbyterian Center,0 to 17,111,M,White,Not Span/Hispanic,27,Newborn,Home or Self Care,2022,PNL001,Liveborn,ESA004,NON-INVASIVE VENTILATION,607,NEONATE BIRTH WEIGHT 1250-1499 GRAMS WITH RESPIRATORY DISTRESS SYNDROME OR OTHER MAJOR RESPIRATORY CONDITION OR MAJOR ANOMALY,15,NEWBORNS AND OTHER NEONATES WITH CONDITIONS ORIGINATING IN THE PERINATAL PERIOD,2,Moderate,Moderate,Medical,Private Health Insurance,,,01300,,N,658099.24,136572.58
New York City,Manhattan,7002054,001464,New York-Presbyterian Hospital - Columbia Presbyterian Center,0 to 17,112,F,White,Not Span/Hispanic,69,Newborn,Short-term Hospital,2022,PNL001,Liveborn,CAR024,VENOUS AND ARTERIAL CATHETER PLACEMENT,607,NEONATE BIRTH WEIGHT 1250-1499 GRAMS WITH RESPIRATORY DISTRESS SYNDROME OR OTHER MAJOR RESPIRATORY CONDITION OR MAJOR ANOMALY,15,NEWBORNS AND OTHER NEONATES WITH CONDITIONS ORIGINATING IN THE PERINATAL PERIOD,3,Major,Moderate,Medical,Private Health Insurance,,,01300,,N,1708744.65,355123.62
New York City,Manhattan,7002054,001464,New York-Presbyterian Hospital - Columbia Presbyterian Center,0 to 17,107,M,Other Race,Spanish/Hispanic,29,Newborn,Home or Self Care,2022,PNL001,Liveborn,ESA004,NON-INVASIVE VENTILATION,607,NEONATE BIRTH WEIGHT 1250-1499 GRAMS WITH RESPIRATORY DISTRESS SYNDROME OR OTHER MAJOR RESPIRATORY CONDITION OR MAJOR ANOMALY,15,NEWBORNS AND OTHER NEONATES WITH CONDITIONS ORIGINATING IN THE PERINATAL PERIOD,2,Moderate,Minor,Medical,Medicaid,,,01300,,N,714078.62,148225.28
New York City,Manhattan,7002054,001464,New York-Presbyterian Hospital - Columbia Presbyterian Center,0 to 17,113,M,White,Not Span/Hispanic,11,Newborn,Short-term Hospital,2022,PNL001,Liveborn,ESA004,NON-INVASIVE VENTILATION,607,NEONATE BIRTH WEIGHT 1250-1499 GRAMS WITH RESPIRATORY DISTRESS SYNDROME OR OTHER MAJOR RESPIRATORY CONDITION OR MAJOR ANOMALY,15,NEWBORNS AND OTHER NEONATES WITH CONDITIONS ORIGINATING IN THE PERINATAL PERIOD,3,Major,Minor,Medical,Medicaid,,,01300,,N,263029.40,56226.71
Long Island,Nassau,2951001,000541,North Shore University Hospital,0 to 17,117,F,White,Spanish/Hispanic,43,Newborn,Home or Self Care,2022,PNL001,Liveborn,ESA004,NON-INVASIVE VENTILATION,607,NEONATE BIRTH WEIGHT 1250-1499 GRAMS WITH RESPIRATORY DISTRESS SYNDROME OR OTHER MAJOR RESPIRATORY CONDITION OR MAJOR ANOMALY,15,NEWBORNS AND OTHER NEONATES WITH CONDITIONS ORIGINATING IN THE PERINATAL PERIOD,3,Major,Minor,Medical,Medicaid,Medicaid,,01300,,N,858473.25,120268.08
Long Island,Nassau,2951001,000541,North Shore University Hospital,0 to 17,111,M,Other Race,Not Span/Hispanic,62,Urgent,Home w/ Home Health Services,2022,PNL002,Short gestation; low birth weight; and fetal growth retardation,ESA003,MECHANICAL VENTILATION,607,NEONATE BIRTH WEIGHT 1250-1499 GRAMS WITH RESPIRATORY DISTRESS SYNDROME OR OTHER MAJOR RESPIRATORY CONDITION OR MAJOR ANOMALY,15,NEWBORNS AND OTHER NEONATES WITH CONDITIONS ORIGINATING IN THE PERINATAL PERIOD,4,Extreme,Major,Medical,Medicaid,,,01400,,N,1271029.69,178663.56