Hospital Service Area,Hospital County,Operating Certificate Number,Permanent Facility Id,Facility Name,Age Group,Zip Code - 3 digits,Gender,Race,Ethnicity,Length of Stay,Type of Admission,Patient Disposition,Discharge Year,CCS Diagnosis Code,CCS Diagnosis Description,CCS Procedure Code,CCS Procedure Description,APR DRG Code,APR DRG Description,APR MDC Code,APR MDC Description,APR Severity of Illness Code,APR Severity of Illness Description,APR Risk of Mortality,APR Medical Surgical Description,Payment Typology 1,Payment Typology 2,Payment Typology 3,Birth Weight,Abortion Edit Indicator,Emergency Department Indicator,Total Charges,Total Costs
New York City,Manhattan,7002054,001464,New York-Presbyterian Hospital - Columbia Presbyterian Center,0 to 17,100,M,White,Not Span/Hispanic,49,Newborn,Home or Self Care,2022,PNL001,Liveborn,MRS001,CIRCUMCISION,621,NEONATE BIRTH WEIGHT 2000-2499 GRAMS WITH MAJOR ANOMALY,15,NEWBORNS AND OTHER NEONATES WITH CONDITIONS ORIGINATING IN THE PERINATAL PERIOD,3,Major,Moderate,Medical,Private Health Insurance,,,02000,,N,1136392.45,236311.97
New York City,Manhattan,7002053,001463,NYU Langone Hospitals,0 to 17,108,F,Other Race,Not Span/Hispanic,38,Newborn,Home w/ Home Health Services,2022,PNL001,Liveborn,CAR013,HEART AND GREAT VESSEL BYPASS PROCEDURES,621,NEONATE BIRTH WEIGHT 2000-2499 GRAMS WITH MAJOR ANOMALY,15,NEWBORNS AND OTHER NEONATES WITH CONDITIONS ORIGINATING IN THE PERINATAL PERIOD,4,Extreme,Major,Medical,Medicaid,,,02200,,N,1051764.76,300996.92
New York City,Manhattan,7002053,001463,NYU Langone Hospitals,0 to 17,113,F,Other Race,Unknown,2,Newborn,Home or Self Care,2022,PNL001,Liveborn,ADM010,VACCINATIONS,621,NEONATE BIRTH WEIGHT 2000-2499 GRAMS WITH MAJOR ANOMALY,15,NEWBORNS AND OTHER NEONATES WITH CONDITIONS ORIGINATING IN THE PERINATAL PERIOD,1,Minor,Minor,Medical,Medicaid,,,02400,,N,29260.05,10195.90
Finger Lakes,Monroe,2701005,000413,Strong Memorial Hospital,0 to 17,148,F,White,Not Span/Hispanic,27,Newborn,Home or Self Care,2022,PNL001,Liveborn,ADM021,"ADMINISTRATION OF THERAPEUTIC SUBSTANCES, NEC",621,NEONATE BIRTH WEIGHT 2000-2499 GRAMS WITH MAJOR ANOMALY,15,NEWBORNS AND OTHER NEONATES WITH CONDITIONS ORIGINATING IN THE PERINATAL PERIOD,3,Major,Minor,Medical,Medicaid,,,02200,,N,196927.20,63491.84
New York City,Manhattan,7002053,001463,NYU Langone Hospitals,0 to 17,114,M,Other Race,Not Span/Hispanic,18,Newborn,Home or Self Care,2022,PNL001,Liveborn,ESA004,NON-INVASIVE VENTILATION,621,NEONATE BIRTH WEIGHT 2000-2499 GRAMS WITH MAJOR ANOMALY,15,NEWBORNS AND OTHER NEONATES WITH CONDITIONS ORIGINATING IN THE PERINATAL PERIOD,3,Major,Moderate,Medical,Blue Cross/Blue Shield,,,02200,,N,269406.53,93414.74
New York City,Manhattan,7002053,001463,NYU Langone Hospitals,0 to 17,112,F,Other Race,Not Span/Hispanic,11,Newborn,Expired,2022,PNL001,Liveborn,ADM021,"ADMINISTRATION OF THERAPEUTIC SUBSTANCES, NEC",621,NEONATE BIRTH WEIGHT 2000-2499 GRAMS WITH MAJOR ANOMALY,15,NEWBORNS AND OTHER NEONATES WITH CONDITIONS ORIGINATING IN THE PERINATAL PERIOD,4,Extreme,Extreme,Medical,Medicaid,,,02000,,N,480386.78,74660.85
New York City,Manhattan,7002001,001438,Bellevue Hospital Center,0 to 17,104,M,Other Race,Unknown,8,Urgent,Home or Self Care,2022,PNL004,Neonatal cerebral disorders,MAM011,ELECTROENCEPHALOGRAM (EEG),621,NEONATE BIRTH WEIGHT 2000-2499 GRAMS WITH MAJOR ANOMALY,15,NEWBORNS AND OTHER NEONATES WITH CONDITIONS ORIGINATING IN THE PERINATAL PERIOD,3,Major,Major,Medical,Medicaid,,,02200,,N,94295.77,54227.99
New York City,Manhattan,7002053,001463,NYU Langone Hospitals,0 to 17,112,F,Black/African American,Not Span/Hispanic,2,Newborn,Home or Self Care,2022,PNL001,Liveborn,ADM010,VACCINATIONS,621,NEONATE BIRTH WEIGHT 2000-2499 GRAMS WITH MAJOR ANOMALY,15,NEWBORNS AND OTHER NEONATES WITH CONDITIONS ORIGINATING IN THE PERINATAL PERIOD,1,Minor,Minor,Medical,Medicaid,,,02400,,N,27116.60,10008.51
New York City,Manhattan,7002054,001464,New York-Presbyterian Hospital - Columbia Presbyterian Center,0 to 17,100,M,Other Race,Not Span/Hispanic,9,Newborn,Home or Self Care,2022,PNL001,Liveborn,ESA003,MECHANICAL VENTILATION,621,NEONATE BIRTH WEIGHT 2000-2499 GRAMS WITH MAJOR ANOMALY,15,NEWBORNS AND OTHER NEONATES WITH CONDITIONS ORIGINATING IN THE PERINATAL PERIOD,3,Major,Major,Medical,Private Health Insurance,,,02300,,N,310947.29,68098.12
New York City,Manhattan,7002054,001464,New York-Presbyterian Hospital - Columbia Presbyterian Center,0 to 17,100,M,Other Race,Spanish/Hispanic,12,Newborn,Home or Self Care,2022,PNL001,Liveborn,EST002,PHOTOTHERAPY,621,NEONATE BIRTH WEIGHT 2000-2499 GRAMS WITH MAJOR ANOMALY,15,NEWBORNS AND OTHER NEONATES WITH CONDITIONS ORIGINATING IN THE PERINATAL PERIOD,3,Major,Moderate,Medical,Private Health Insurance,,,02300,,N,329627.57,68503.52
Finger Lakes,Monroe,2701005,000413,Strong Memorial Hospital,0 to 17,144,F,Multi-racial,Not Span/Hispanic,33,Urgent,Home or Self Care,2022,PNL005,Respiratory distress syndrome,ADM021,"ADMINISTRATION OF THERAPEUTIC SUBSTANCES, NEC",621,NEONATE BIRTH WEIGHT 2000-2499 GRAMS WITH MAJOR ANOMALY,15,NEWBORNS AND OTHER NEONATES WITH CONDITIONS ORIGINATING IN THE PERINATAL PERIOD,4,Extreme,Major,Medical,Medicaid,,,02200,,N,233633.58,80035.59
New York City,Manhattan,7002054,001464,New York-Presbyterian Hospital - Columbia Presbyterian Center,0 to 17,100,F,Black/African American,Not Span/Hispanic,2,Newborn,Home or Self Care,2022,PNL001,Liveborn,ADM010,VACCINATIONS,621,NEONATE BIRTH WEIGHT 2000-2499 GRAMS WITH MAJOR ANOMALY,15,NEWBORNS AND OTHER NEONATES WITH CONDITIONS ORIGINATING IN THE PERINATAL PERIOD,1,Minor,Minor,Medical,Medicaid,,,02100,,N,20586.78,2234.03
New York City,Manhattan,7002053,001463,NYU Langone Hospitals,0 to 17,112,M,Other Race,Unknown,27,Newborn,Home or Self Care,2022,PNL001,Liveborn,CAR013,HEART AND GREAT VESSEL BYPASS PROCEDURES,621,NEONATE BIRTH WEIGHT 2000-2499 GRAMS WITH MAJOR ANOMALY,15,NEWBORNS AND OTHER NEONATES WITH CONDITIONS ORIGINATING IN THE PERINATAL PERIOD,4,Extreme,Major,Medical,Medicaid,,,02300,,N,782346.14,172505.86
New York City,Manhattan,7002054,001464,New York-Presbyterian Hospital - Columbia Presbyterian Center,0 to 17,117,F,Other Race,Not Span/Hispanic,27,Newborn,Skilled Nursing Home,2022,PNL001,Liveborn,ESA004,NON-INVASIVE VENTILATION,621,NEONATE BIRTH WEIGHT 2000-2499 GRAMS WITH MAJOR ANOMALY,15,NEWBORNS AND OTHER NEONATES WITH CONDITIONS ORIGINATING IN THE PERINATAL PERIOD,3,Major,Extreme,Medical,Private Health Insurance,,,02200,,N,691383.30,143946.96
Long Island,Nassau,2951001,000541,North Shore University Hospital,0 to 17,110,M,White,Not Span/Hispanic,12,Newborn,Home or Self Care,2022,PNL001,Liveborn,MRS001,CIRCUMCISION,621,NEONATE BIRTH WEIGHT 2000-2499 GRAMS WITH MAJOR ANOMALY,15,NEWBORNS AND OTHER NEONATES WITH CONDITIONS ORIGINATING IN THE PERINATAL PERIOD,1,Minor,Minor,Medical,Blue Cross/Blue Shield,,,02000,,N,221740.16,30884.79
Long Island,Nassau,2951001,000541,North Shore University Hospital,0 to 17,110,M,White,Not Span/Hispanic,12,Newborn,Home or Self Care,2022,PNL001,Liveborn,ESA004,NON-INVASIVE VENTILATION,621,NEONATE BIRTH WEIGHT 2000-2499 GRAMS WITH MAJOR ANOMALY,15,NEWBORNS AND OTHER NEONATES WITH CONDITIONS ORIGINATING IN THE PERINATAL PERIOD,1,Minor,Minor,Medical,Blue Cross/Blue Shield,,,02300,,N,222087.23,30940.20
Long Island,Nassau,2951001,000541,North Shore University Hospital,0 to 17,113,F,Other Race,Not Span/Hispanic,2,Newborn,Home or Self Care,2022,PNL001,Liveborn,,,621,NEONATE BIRTH WEIGHT 2000-2499 GRAMS WITH MAJOR ANOMALY,15,NEWBORNS AND OTHER NEONATES WITH CONDITIONS ORIGINATING IN THE PERINATAL PERIOD,1,Minor,Minor,Medical,Private Health Insurance,,,02000,,N,31196.33,4614.11
Long Island,Nassau,2951001,000541,North Shore University Hospital,0 to 17,115,M,White,Not Span/Hispanic,1,Newborn,Home or Self Care,2022,PNL001,Liveborn,MRS001,CIRCUMCISION,621,NEONATE BIRTH WEIGHT 2000-2499 GRAMS WITH MAJOR ANOMALY,15,NEWBORNS AND OTHER NEONATES WITH CONDITIONS ORIGINATING IN THE PERINATAL PERIOD,3,Major,Major,Medical,Private Health Insurance,,,02300,,N,11229.33,2151.00
Finger Lakes,Monroe,2701005,000413,Strong Memorial Hospital,0 to 17,146,M,Other Race,Spanish/Hispanic,49,Newborn,Home or Self Care,2022,PNL001,Liveborn,RES007,AIRWAY INTUBATION,621,NEONATE BIRTH WEIGHT 2000-2499 GRAMS WITH MAJOR ANOMALY,15,NEWBORNS AND OTHER NEONATES WITH CONDITIONS ORIGINATING IN THE PERINATAL PERIOD,3,Major,Major,Medical,Medicaid,,,02200,,N,369506.77,118016.76
Finger Lakes,Monroe,2701005,000413,Strong Memorial Hospital,0 to 17,146,F,Black/African American,Not Span/Hispanic,28,Newborn,Home or Self Care,2022,PNL001,Liveborn,ADM017,ADMINISTRATION OF NUTRITIONAL AND ELECTROLYTIC SUBSTANCES,621,NEONATE BIRTH WEIGHT 2000-2499 GRAMS WITH MAJOR ANOMALY,15,NEWBORNS AND OTHER NEONATES WITH CONDITIONS ORIGINATING IN THE PERINATAL PERIOD,2,Moderate,Major,Medical,Medicaid,,,02100,,N,195979.62,66479.69
New York City,Manhattan,7002054,001464,New York-Presbyterian Hospital - Columbia Presbyterian Center,0 to 17,105,F,Other Race,Spanish/Hispanic,49,Newborn,Home or Self Care,2022,PNL001,Liveborn,GNR002,ABDOMINAL WALL REPAIR (INCLUDING HERNIA),621,NEONATE BIRTH WEIGHT 2000-2499 GRAMS WITH MAJOR ANOMALY,15,NEWBORNS AND OTHER NEONATES WITH CONDITIONS ORIGINATING IN THE PERINATAL PERIOD,1,Minor,Minor,Medical,Medicaid,Medicaid,,02300,,N,1173477.32,247505.45
New York City,Manhattan,7002053,001463,NYU Langone Hospitals,0 to 17,112,M,Black/African American,Not Span/Hispanic,16,Newborn,Expired,2022,PNL001,Liveborn,CAR024,VENOUS AND ARTERIAL CATHETER PLACEMENT,621,NEONATE BIRTH WEIGHT 2000-2499 GRAMS WITH MAJOR ANOMALY,15,NEWBORNS AND OTHER NEONATES WITH CONDITIONS ORIGINATING IN THE PERINATAL PERIOD,4,Extreme,Extreme,Medical,Medicaid,,,02300,,N,751792.96,112049.79
New York City,Manhattan,7002054,001464,New York-Presbyterian Hospital - Columbia Presbyterian Center,0 to 17,104,M,Multi-racial,Spanish/Hispanic,4,Newborn,Home or Self Care,2022,PNL001,Liveborn,MRS001,CIRCUMCISION,621,NEONATE BIRTH WEIGHT 2000-2499 GRAMS WITH MAJOR ANOMALY,15,NEWBORNS AND OTHER NEONATES WITH CONDITIONS ORIGINATING IN THE PERINATAL PERIOD,2,Moderate,Moderate,Medical,Medicaid,,,02300,,N,35819.35,2677.29
New York City,Manhattan,7002054,001464,New York-Presbyterian Hospital - Columbia Presbyterian Center,0 to 17,104,M,Multi-racial,Spanish/Hispanic,4,Newborn,Home or Self Care,2022,PNL001,Liveborn,ESA004,NON-INVASIVE VENTILATION,621,NEONATE BIRTH WEIGHT 2000-2499 GRAMS WITH MAJOR ANOMALY,15,NEWBORNS AND OTHER NEONATES WITH CONDITIONS ORIGINATING IN THE PERINATAL PERIOD,1,Minor,Minor,Medical,Medicaid,,,02100,,N,39444.68,3771.94
New York City,Manhattan,7002053,001463,NYU Langone Hospitals,0 to 17,112,M,White,Not Span/Hispanic,30,Newborn,Home or Self Care,2022,PNL001,Liveborn,ESA004,NON-INVASIVE VENTILATION,621,NEONATE BIRTH WEIGHT 2000-2499 GRAMS WITH MAJOR ANOMALY,15,NEWBORNS AND OTHER NEONATES WITH CONDITIONS ORIGINATING IN THE PERINATAL PERIOD,2,Moderate,Moderate,Medical,Blue Cross/Blue Shield,,,02200,,N,442755.89,154904.01
New York City,Manhattan,7002053,001463,NYU Langone Hospitals,0 to 17,104,F,Other Race,Not Span/Hispanic,1,Newborn,Expired,2022,PNL001,Liveborn,CAR024,VENOUS AND ARTERIAL CATHETER PLACEMENT,621,NEONATE BIRTH WEIGHT 2000-2499 GRAMS WITH MAJOR ANOMALY,15,NEWBORNS AND OTHER NEONATES WITH CONDITIONS ORIGINATING IN THE PERINATAL PERIOD,4,Extreme,Extreme,Medical,Private Health Insurance,,,02300,,N,50596.39,7477.00
New York City,Manhattan,7002053,001463,NYU Langone Hospitals,0 to 17,112,M,Black/African American,Not Span/Hispanic,19,Newborn,Home or Self Care,2022,PNL001,Liveborn,ESA004,NON-INVASIVE VENTILATION,621,NEONATE BIRTH WEIGHT 2000-2499 GRAMS WITH MAJOR ANOMALY,15,NEWBORNS AND OTHER NEONATES WITH CONDITIONS ORIGINATING IN THE PERINATAL PERIOD,2,Moderate,Moderate,Medical,Blue Cross/Blue Shield,,,02400,,N,283735.78,88827.63
New York City,Manhattan,7002054,001464,New York-Presbyterian Hospital - Columbia Presbyterian Center,0 to 17,100,F,Multi-racial,Spanish/Hispanic,4,Newborn,Home or Self Care,2022,PNL001,Liveborn,ADM010,VACCINATIONS,621,NEONATE BIRTH WEIGHT 2000-2499 GRAMS WITH MAJOR ANOMALY,15,NEWBORNS AND OTHER NEONATES WITH CONDITIONS ORIGINATING IN THE PERINATAL PERIOD,1,Minor,Minor,Medical,Blue Cross/Blue Shield,,,02300,,N,32623.06,2121.91
New York City,Manhattan,7002054,001464,New York-Presbyterian Hospital - Columbia Presbyterian Center,0 to 17,105,F,Black/African American,Not Span/Hispanic,2,Newborn,Home or Self Care,2022,PNL001,Liveborn,ADM010,VACCINATIONS,621,NEONATE BIRTH WEIGHT 2000-2499 GRAMS WITH MAJOR ANOMALY,15,NEWBORNS AND OTHER NEONATES WITH CONDITIONS ORIGINATING IN THE PERINATAL PERIOD,2,Moderate,Minor,Medical,Medicaid,,,02400,,N,18460.38,1373.59
Finger Lakes,Monroe,2701005,000413,Strong Memorial Hospital,0 to 17,145,M,White,Not Span/Hispanic,18,Newborn,Home or Self Care,2022,PNL001,Liveborn,CAR024,VENOUS AND ARTERIAL CATHETER PLACEMENT,621,NEONATE BIRTH WEIGHT 2000-2499 GRAMS WITH MAJOR ANOMALY,15,NEWBORNS AND OTHER NEONATES WITH CONDITIONS ORIGINATING IN THE PERINATAL PERIOD,2,Moderate,Minor,Medical,Private Health Insurance,,,02300,,N,131221.78,42124.76
Long Island,Nassau,2951001,000541,North Shore University Hospital,0 to 17,115,F,Black/African American,Not Span/Hispanic,1,Newborn,Home or Self Care,2022,PNL001,Liveborn,,,621,NEONATE BIRTH WEIGHT 2000-2499 GRAMS WITH MAJOR ANOMALY,15,NEWBORNS AND OTHER NEONATES WITH CONDITIONS ORIGINATING IN THE PERINATAL PERIOD,1,Minor,Minor,Medical,Blue Cross/Blue Shield,,,02300,,N,9348.33,1664.61
New York City,Manhattan,7002054,001464,New York-Presbyterian Hospital - Columbia Presbyterian Center,0 to 17,112,F,Other Race,Not Span/Hispanic,55,Newborn,Home or Self Care,2022,PNL001,Liveborn,GIS017,GASTROSTOMY,621,NEONATE BIRTH WEIGHT 2000-2499 GRAMS WITH MAJOR ANOMALY,15,NEWBORNS AND OTHER NEONATES WITH CONDITIONS ORIGINATING IN THE PERINATAL PERIOD,4,Extreme,Major,Medical,Medicaid,,,02000,,N,1380520.94,288895.22
New York City,Manhattan,7002054,001464,New York-Presbyterian Hospital - Columbia Presbyterian Center,0 to 17,104,F,Other Race,Spanish/Hispanic,42,Newborn,Home or Self Care,2022,PNL001,Liveborn,GIS017,GASTROSTOMY,621,NEONATE BIRTH WEIGHT 2000-2499 GRAMS WITH MAJOR ANOMALY,15,NEWBORNS AND OTHER NEONATES WITH CONDITIONS ORIGINATING IN THE PERINATAL PERIOD,3,Major,Moderate,Medical,Medicaid,,,02400,,N,1067073.68,224961.31
New York City,Manhattan,7002054,001464,New York-Presbyterian Hospital - Columbia Presbyterian Center,0 to 17,104,F,Other Race,Spanish/Hispanic,23,Newborn,Home or Self Care,2022,PNL001,Liveborn,CAR024,VENOUS AND ARTERIAL CATHETER PLACEMENT,621,NEONATE BIRTH WEIGHT 2000-2499 GRAMS WITH MAJOR ANOMALY,15,NEWBORNS AND OTHER NEONATES WITH CONDITIONS ORIGINATING IN THE PERINATAL PERIOD,2,Moderate,Minor,Medical,Medicaid,,,02100,,N,551697.92,117317.04
New York City,Manhattan,7002054,001464,New York-Presbyterian Hospital - Columbia Presbyterian Center,0 to 17,109,M,White,Not Span/Hispanic,33,Newborn,Home or Self Care,2022,PNL001,Liveborn,ESA004,NON-INVASIVE VENTILATION,621,NEONATE BIRTH WEIGHT 2000-2499 GRAMS WITH MAJOR ANOMALY,15,NEWBORNS AND OTHER NEONATES WITH CONDITIONS ORIGINATING IN THE PERINATAL PERIOD,3,Major,Moderate,Medical,Medicaid,,,02300,,N,825646.45,170506.78
New York City,Manhattan,7002054,001464,New York-Presbyterian Hospital - Columbia Presbyterian Center,0 to 17,112,F,White,Not Span/Hispanic,29,Newborn,Home or Self Care,2022,PNL001,Liveborn,GIS017,GASTROSTOMY,621,NEONATE BIRTH WEIGHT 2000-2499 GRAMS WITH MAJOR ANOMALY,15,NEWBORNS AND OTHER NEONATES WITH CONDITIONS ORIGINATING IN THE PERINATAL PERIOD,3,Major,Moderate,Medical,Medicaid,,,02400,,N,750193.78,158112.83
Finger Lakes,Monroe,2701005,000413,Strong Memorial Hospital,0 to 17,145,F,White,Not Span/Hispanic,21,Newborn,Home or Self Care,2022,PNL001,Liveborn,ADM021,"ADMINISTRATION OF THERAPEUTIC SUBSTANCES, NEC",621,NEONATE BIRTH WEIGHT 2000-2499 GRAMS WITH MAJOR ANOMALY,15,NEWBORNS AND OTHER NEONATES WITH CONDITIONS ORIGINATING IN THE PERINATAL PERIOD,3,Major,Minor,Medical,Blue Cross/Blue Shield,,,02000,,N,126340.69,45756.26
New York City,Manhattan,7002054,001464,New York-Presbyterian Hospital - Columbia Presbyterian Center,0 to 17,112,F,Black/African American,Not Span/Hispanic,2,Newborn,Home or Self Care,2022,PNL001,Liveborn,ENT004,DIAGNOSTIC AUDIOLOGY,621,NEONATE BIRTH WEIGHT 2000-2499 GRAMS WITH MAJOR ANOMALY,15,NEWBORNS AND OTHER NEONATES WITH CONDITIONS ORIGINATING IN THE PERINATAL PERIOD,1,Minor,Minor,Medical,Private Health Insurance,,,02400,,N,20121.97,1739.28
Long Island,Nassau,2951001,000541,North Shore University Hospital,0 to 17,112,F,Other Race,Not Span/Hispanic,2,Newborn,Home or Self Care,2022,PNL001,Liveborn,,,621,NEONATE BIRTH WEIGHT 2000-2499 GRAMS WITH MAJOR ANOMALY,15,NEWBORNS AND OTHER NEONATES WITH CONDITIONS ORIGINATING IN THE PERINATAL PERIOD,2,Moderate,Minor,Medical,Private Health Insurance,,,02400,,N,16805.25,3097.26
Hudson Valley,Dutchess,1302001,000181,Vassar Brothers Medical Center,0 to 17,125,M,Other Race,Unknown,4,Newborn,Home or Self Care,2022,PNL001,Liveborn,,,621,NEONATE BIRTH WEIGHT 2000-2499 GRAMS WITH MAJOR ANOMALY,15,NEWBORNS AND OTHER NEONATES WITH CONDITIONS ORIGINATING IN THE PERINATAL PERIOD,1,Minor,Minor,Medical,Blue Cross/Blue Shield,,,02400,,N,10185.24,4081.35
New York City,Manhattan,7002053,001463,NYU Langone Hospitals,0 to 17,114,F,Other Race,Spanish/Hispanic,5,Newborn,Home or Self Care,2022,PNL001,Liveborn,ESA004,NON-INVASIVE VENTILATION,621,NEONATE BIRTH WEIGHT 2000-2499 GRAMS WITH MAJOR ANOMALY,15,NEWBORNS AND OTHER NEONATES WITH CONDITIONS ORIGINATING IN THE PERINATAL PERIOD,2,Moderate,Moderate,Medical,Medicaid,,,02200,,N,85020.65,28338.18
New York City,Manhattan,7002053,001463,NYU Langone Hospitals,0 to 17,104,F,White,Not Span/Hispanic,9,Newborn,Home or Self Care,2022,PNL001,Liveborn,ESA004,NON-INVASIVE VENTILATION,621,NEONATE BIRTH WEIGHT 2000-2499 GRAMS WITH MAJOR ANOMALY,15,NEWBORNS AND OTHER NEONATES WITH CONDITIONS ORIGINATING IN THE PERINATAL PERIOD,3,Major,Major,Medical,Medicaid,,,02300,,N,188819.93,46885.56
New York City,Manhattan,7002053,001463,NYU Langone Hospitals,0 to 17,112,F,Black/African American,Unknown,5,Newborn,Home or Self Care,2022,PNL001,Liveborn,ESA004,NON-INVASIVE VENTILATION,621,NEONATE BIRTH WEIGHT 2000-2499 GRAMS WITH MAJOR ANOMALY,15,NEWBORNS AND OTHER NEONATES WITH CONDITIONS ORIGINATING IN THE PERINATAL PERIOD,2,Moderate,Minor,Medical,Medicaid,,,02300,,N,71563.64,25333.85
New York City,Manhattan,7002054,001464,New York-Presbyterian Hospital - Columbia Presbyterian Center,0 to 17,104,M,White,Spanish/Hispanic,15,Newborn,Home or Self Care,2022,PNL001,Liveborn,MRS001,CIRCUMCISION,621,NEONATE BIRTH WEIGHT 2000-2499 GRAMS WITH MAJOR ANOMALY,15,NEWBORNS AND OTHER NEONATES WITH CONDITIONS ORIGINATING IN THE PERINATAL PERIOD,3,Major,Moderate,Medical,Medicaid,,,02100,,N,360501.23,74559.35
New York City,Manhattan,7002054,001464,New York-Presbyterian Hospital - Columbia Presbyterian Center,0 to 17,104,F,Other Race,Spanish/Hispanic,6,Newborn,Home or Self Care,2022,PNL001,Liveborn,ESA004,NON-INVASIVE VENTILATION,621,NEONATE BIRTH WEIGHT 2000-2499 GRAMS WITH MAJOR ANOMALY,15,NEWBORNS AND OTHER NEONATES WITH CONDITIONS ORIGINATING IN THE PERINATAL PERIOD,3,Major,Moderate,Medical,Medicaid,,,02000,,N,127357.89,23976.62
New York City,Manhattan,7002054,001464,New York-Presbyterian Hospital - Columbia Presbyterian Center,0 to 17,OOS,M,Other Race,Not Span/Hispanic,4,Newborn,Home or Self Care,2022,PNL001,Liveborn,ENT004,DIAGNOSTIC AUDIOLOGY,621,NEONATE BIRTH WEIGHT 2000-2499 GRAMS WITH MAJOR ANOMALY,15,NEWBORNS AND OTHER NEONATES WITH CONDITIONS ORIGINATING IN THE PERINATAL PERIOD,2,Moderate,Minor,Medical,Medicaid,,,02400,,N,52209.32,6922.93
New York City,Manhattan,7002001,001438,Bellevue Hospital Center,0 to 17,112,F,Black/African American,Unknown,2,Newborn,Home or Self Care,2022,PNL001,Liveborn,ADM010,VACCINATIONS,621,NEONATE BIRTH WEIGHT 2000-2499 GRAMS WITH MAJOR ANOMALY,15,NEWBORNS AND OTHER NEONATES WITH CONDITIONS ORIGINATING IN THE PERINATAL PERIOD,2,Moderate,Minor,Medical,Medicaid,,,02400,,N,15473.95,8898.82
Finger Lakes,Monroe,2701005,000413,Strong Memorial Hospital,0 to 17,146,M,Black/African American,Spanish/Hispanic,10,Newborn,Home or Self Care,2022,PNL001,Liveborn,MRS001,CIRCUMCISION,621,NEONATE BIRTH WEIGHT 2000-2499 GRAMS WITH MAJOR ANOMALY,15,NEWBORNS AND OTHER NEONATES WITH CONDITIONS ORIGINATING IN THE PERINATAL PERIOD,2,Moderate,Minor,Medical,Medicaid,,,02100,,N,46615.93,19626.77
Finger Lakes,Monroe,2701005,000413,Strong Memorial Hospital,0 to 17,146,F,Black/African American,Not Span/Hispanic,63,Urgent,Home or Self Care,2022,PNL005,Respiratory distress syndrome,ESA003,MECHANICAL VENTILATION,621,NEONATE BIRTH WEIGHT 2000-2499 GRAMS WITH MAJOR ANOMALY,15,NEWBORNS AND OTHER NEONATES WITH CONDITIONS ORIGINATING IN THE PERINATAL PERIOD,3,Major,Major,Medical,Medicaid,,,02100,,N,508785.44,160725.34
New York City,Manhattan,7002053,001463,NYU Langone Hospitals,0 to 17,112,F,Black/African American,Spanish/Hispanic,2,Newborn,Home or Self Care,2022,PNL001,Liveborn,ADM010,VACCINATIONS,621,NEONATE BIRTH WEIGHT 2000-2499 GRAMS WITH MAJOR ANOMALY,15,NEWBORNS AND OTHER NEONATES WITH CONDITIONS ORIGINATING IN THE PERINATAL PERIOD,1,Minor,Minor,Medical,Blue Cross/Blue Shield,,,02400,,N,34470.88,10970.86
New York City,Manhattan,7002053,001463,NYU Langone Hospitals,0 to 17,OOS,F,Black/African American,Not Span/Hispanic,5,Newborn,Home or Self Care,2022,PNL001,Liveborn,ADM010,VACCINATIONS,621,NEONATE BIRTH WEIGHT 2000-2499 GRAMS WITH MAJOR ANOMALY,15,NEWBORNS AND OTHER NEONATES WITH CONDITIONS ORIGINATING IN THE PERINATAL PERIOD,3,Major,Major,Medical,Private Health Insurance,,,02400,,N,85766.05,28435.19
Finger Lakes,Monroe,2701005,000413,Strong Memorial Hospital,0 to 17,144,F,White,Spanish/Hispanic,77,Newborn,Home or Self Care,2022,PNL001,Liveborn,ESA004,NON-INVASIVE VENTILATION,621,NEONATE BIRTH WEIGHT 2000-2499 GRAMS WITH MAJOR ANOMALY,15,NEWBORNS AND OTHER NEONATES WITH CONDITIONS ORIGINATING IN THE PERINATAL PERIOD,4,Extreme,Major,Medical,Medicaid,,,02200,,Y,579589.41,189228.10
New York City,Manhattan,7002054,001464,New York-Presbyterian Hospital - Columbia Presbyterian Center,0 to 17,105,F,White,Not Span/Hispanic,3,Urgent,Home or Self Care,2022,MAL001,Cardiac and circulatory congenital anomalies,ADM017,ADMINISTRATION OF NUTRITIONAL AND ELECTROLYTIC SUBSTANCES,621,NEONATE BIRTH WEIGHT 2000-2499 GRAMS WITH MAJOR ANOMALY,15,NEWBORNS AND OTHER NEONATES WITH CONDITIONS ORIGINATING IN THE PERINATAL PERIOD,1,Minor,Minor,Medical,Private Health Insurance,,,02100,,N,84795.69,17007.02
Long Island,Nassau,2951001,000541,North Shore University Hospital,0 to 17,110,M,Other Race,Not Span/Hispanic,5,Newborn,Home or Self Care,2022,PNL001,Liveborn,,,621,NEONATE BIRTH WEIGHT 2000-2499 GRAMS WITH MAJOR ANOMALY,15,NEWBORNS AND OTHER NEONATES WITH CONDITIONS ORIGINATING IN THE PERINATAL PERIOD,2,Moderate,Minor,Medical,Medicaid,Medicaid,,02400,,N,40547.25,7887.67
Long Island,Nassau,2951001,000541,North Shore University Hospital,0 to 17,117,M,Other Race,Spanish/Hispanic,36,Newborn,Home or Self Care,2022,PNL001,Liveborn,CAR024,VENOUS AND ARTERIAL CATHETER PLACEMENT,621,NEONATE BIRTH WEIGHT 2000-2499 GRAMS WITH MAJOR ANOMALY,15,NEWBORNS AND OTHER NEONATES WITH CONDITIONS ORIGINATING IN THE PERINATAL PERIOD,3,Major,Minor,Medical,Private Health Insurance,,,02300,,N,713600.58,100419.49
Finger Lakes,Monroe,2701005,000413,Strong Memorial Hospital,0 to 17,146,M,Other Race,Unknown,29,Newborn,Home w/ Home Health Services,2022,PNL001,Liveborn,ESA004,NON-INVASIVE VENTILATION,621,NEONATE BIRTH WEIGHT 2000-2499 GRAMS WITH MAJOR ANOMALY,15,NEWBORNS AND OTHER NEONATES WITH CONDITIONS ORIGINATING IN THE PERINATAL PERIOD,3,Major,Moderate,Medical,Medicaid,,,02100,,N,213918.11,70397.35