Hospital Service Area,Hospital County,Operating Certificate Number,Permanent Facility Id,Facility Name,Age Group,Zip Code - 3 digits,Gender,Race,Ethnicity,Length of Stay,Type of Admission,Patient Disposition,Discharge Year,CCS Diagnosis Code,CCS Diagnosis Description,CCS Procedure Code,CCS Procedure Description,APR DRG Code,APR DRG Description,APR MDC Code,APR MDC Description,APR Severity of Illness Code,APR Severity of Illness Description,APR Risk of Mortality,APR Medical Surgical Description,Payment Typology 1,Payment Typology 2,Payment Typology 3,Birth Weight,Abortion Edit Indicator,Emergency Department Indicator,Total Charges,Total Costs
New York City,Manhattan,7002054,001464,New York-Presbyterian Hospital - Columbia Presbyterian Center,0 to 17,125,F,White,Not Span/Hispanic,17,Newborn,Home w/ Home Health Services,2022,PNL001,Liveborn,ESA004,NON-INVASIVE VENTILATION,622,NEONATE BIRTH WEIGHT 2000-2499 GRAMS WITH RESPIRATORY DISTRESS SYNDROME OR OTHER MAJOR RESPIRATORY CONDITION,15,NEWBORNS AND OTHER NEONATES WITH CONDITIONS ORIGINATING IN THE PERINATAL PERIOD,1,Minor,Moderate,Medical,Private Health Insurance,,,02100,,N,388758.08,79977.75
New York City,Manhattan,7002054,001464,New York-Presbyterian Hospital - Columbia Presbyterian Center,0 to 17,OOS,M,White,Not Span/Hispanic,14,Newborn,Home or Self Care,2022,PNL001,Liveborn,ADM010,VACCINATIONS,622,NEONATE BIRTH WEIGHT 2000-2499 GRAMS WITH RESPIRATORY DISTRESS SYNDROME OR OTHER MAJOR RESPIRATORY CONDITION,15,NEWBORNS AND OTHER NEONATES WITH CONDITIONS ORIGINATING IN THE PERINATAL PERIOD,2,Moderate,Minor,Medical,Private Health Insurance,,,02200,,N,350957.08,73041.13
New York City,Manhattan,7002054,001464,New York-Presbyterian Hospital - Columbia Presbyterian Center,0 to 17,109,M,White,Not Span/Hispanic,9,Newborn,Home or Self Care,2022,PNL001,Liveborn,ADM017,ADMINISTRATION OF NUTRITIONAL AND ELECTROLYTIC SUBSTANCES,622,NEONATE BIRTH WEIGHT 2000-2499 GRAMS WITH RESPIRATORY DISTRESS SYNDROME OR OTHER MAJOR RESPIRATORY CONDITION,15,NEWBORNS AND OTHER NEONATES WITH CONDITIONS ORIGINATING IN THE PERINATAL PERIOD,1,Minor,Minor,Medical,Private Health Insurance,,,02100,,N,229929.88,47867.73
New York City,Manhattan,7002054,001464,New York-Presbyterian Hospital - Columbia Presbyterian Center,0 to 17,109,F,White,Not Span/Hispanic,12,Newborn,Home or Self Care,2022,PNL001,Liveborn,ENT004,DIAGNOSTIC AUDIOLOGY,622,NEONATE BIRTH WEIGHT 2000-2499 GRAMS WITH RESPIRATORY DISTRESS SYNDROME OR OTHER MAJOR RESPIRATORY CONDITION,15,NEWBORNS AND OTHER NEONATES WITH CONDITIONS ORIGINATING IN THE PERINATAL PERIOD,2,Moderate,Minor,Medical,Blue Cross/Blue Shield,,,02300,,N,345574.64,74029.65
New York City,Manhattan,7002054,001464,New York-Presbyterian Hospital - Columbia Presbyterian Center,0 to 17,104,F,Other Race,Spanish/Hispanic,16,Newborn,Home or Self Care,2022,PNL001,Liveborn,ESA004,NON-INVASIVE VENTILATION,622,NEONATE BIRTH WEIGHT 2000-2499 GRAMS WITH RESPIRATORY DISTRESS SYNDROME OR OTHER MAJOR RESPIRATORY CONDITION,15,NEWBORNS AND OTHER NEONATES WITH CONDITIONS ORIGINATING IN THE PERINATAL PERIOD,3,Major,Major,Medical,Medicaid,,,02100,,N,380106.57,78841.92
New York City,Manhattan,7002054,001464,New York-Presbyterian Hospital - Columbia Presbyterian Center,0 to 17,107,M,Other Race,Spanish/Hispanic,9,Newborn,Home or Self Care,2022,PNL001,Liveborn,ADM010,VACCINATIONS,622,NEONATE BIRTH WEIGHT 2000-2499 GRAMS WITH RESPIRATORY DISTRESS SYNDROME OR OTHER MAJOR RESPIRATORY CONDITION,15,NEWBORNS AND OTHER NEONATES WITH CONDITIONS ORIGINATING IN THE PERINATAL PERIOD,2,Moderate,Minor,Medical,Medicaid,,,02200,,N,225160.67,46489.04
Finger Lakes,Monroe,2701005,000413,Strong Memorial Hospital,0 to 17,145,M,Other Race,Unknown,31,Urgent,Home or Self Care,2022,PNL005,Respiratory distress syndrome,ESA003,MECHANICAL VENTILATION,622,NEONATE BIRTH WEIGHT 2000-2499 GRAMS WITH RESPIRATORY DISTRESS SYNDROME OR OTHER MAJOR RESPIRATORY CONDITION,15,NEWBORNS AND OTHER NEONATES WITH CONDITIONS ORIGINATING IN THE PERINATAL PERIOD,3,Major,Moderate,Medical,Medicaid,,,02000,,N,204076.70,68522.84
Finger Lakes,Monroe,2701005,000413,Strong Memorial Hospital,0 to 17,146,F,White,Spanish/Hispanic,2,Newborn,Home or Self Care,2022,PNL001,Liveborn,ESA003,MECHANICAL VENTILATION,622,NEONATE BIRTH WEIGHT 2000-2499 GRAMS WITH RESPIRATORY DISTRESS SYNDROME OR OTHER MAJOR RESPIRATORY CONDITION,15,NEWBORNS AND OTHER NEONATES WITH CONDITIONS ORIGINATING IN THE PERINATAL PERIOD,3,Major,Moderate,Medical,Medicaid,,,02300,,N,23455.78,6788.83
Finger Lakes,Monroe,2701005,000413,Strong Memorial Hospital,0 to 17,146,F,Black/African American,Not Span/Hispanic,19,Newborn,Home or Self Care,2022,PNL001,Liveborn,ESA004,NON-INVASIVE VENTILATION,622,NEONATE BIRTH WEIGHT 2000-2499 GRAMS WITH RESPIRATORY DISTRESS SYNDROME OR OTHER MAJOR RESPIRATORY CONDITION,15,NEWBORNS AND OTHER NEONATES WITH CONDITIONS ORIGINATING IN THE PERINATAL PERIOD,3,Major,Moderate,Medical,Medicaid,,,02000,,N,107863.17,38587.62
Finger Lakes,Monroe,2701005,000413,Strong Memorial Hospital,0 to 17,144,F,White,Not Span/Hispanic,44,Newborn,Home or Self Care,2022,PNL001,Liveborn,RES007,AIRWAY INTUBATION,622,NEONATE BIRTH WEIGHT 2000-2499 GRAMS WITH RESPIRATORY DISTRESS SYNDROME OR OTHER MAJOR RESPIRATORY CONDITION,15,NEWBORNS AND OTHER NEONATES WITH CONDITIONS ORIGINATING IN THE PERINATAL PERIOD,3,Major,Moderate,Medical,Blue Cross/Blue Shield,,,02000,,N,313074.61,100657.10
New York City,Manhattan,7002053,001463,NYU Langone Hospitals,0 to 17,112,F,White,Unknown,23,Newborn,Home or Self Care,2022,PNL001,Liveborn,RES007,AIRWAY INTUBATION,622,NEONATE BIRTH WEIGHT 2000-2499 GRAMS WITH RESPIRATORY DISTRESS SYNDROME OR OTHER MAJOR RESPIRATORY CONDITION,15,NEWBORNS AND OTHER NEONATES WITH CONDITIONS ORIGINATING IN THE PERINATAL PERIOD,2,Moderate,Minor,Medical,Private Health Insurance,,,02000,,N,350971.72,120022.30
Finger Lakes,Monroe,2701005,000413,Strong Memorial Hospital,0 to 17,146,F,White,Not Span/Hispanic,6,Newborn,Home or Self Care,2022,PNL001,Liveborn,ESA004,NON-INVASIVE VENTILATION,622,NEONATE BIRTH WEIGHT 2000-2499 GRAMS WITH RESPIRATORY DISTRESS SYNDROME OR OTHER MAJOR RESPIRATORY CONDITION,15,NEWBORNS AND OTHER NEONATES WITH CONDITIONS ORIGINATING IN THE PERINATAL PERIOD,3,Major,Moderate,Medical,Blue Cross/Blue Shield,,,02200,,N,39217.60,12691.78
New York City,Manhattan,7002053,001463,NYU Langone Hospitals,0 to 17,112,F,Other Race,Not Span/Hispanic,35,Newborn,Home or Self Care,2022,PNL001,Liveborn,ADM021,"ADMINISTRATION OF THERAPEUTIC SUBSTANCES, NEC",622,NEONATE BIRTH WEIGHT 2000-2499 GRAMS WITH RESPIRATORY DISTRESS SYNDROME OR OTHER MAJOR RESPIRATORY CONDITION,15,NEWBORNS AND OTHER NEONATES WITH CONDITIONS ORIGINATING IN THE PERINATAL PERIOD,1,Minor,Minor,Medical,Private Health Insurance,,,02000,,N,514987.61,178646.91
New York City,Manhattan,7002054,001464,New York-Presbyterian Hospital - Columbia Presbyterian Center,0 to 17,100,M,Other Race,Spanish/Hispanic,9,Newborn,Home or Self Care,2022,PNL001,Liveborn,ADM010,VACCINATIONS,622,NEONATE BIRTH WEIGHT 2000-2499 GRAMS WITH RESPIRATORY DISTRESS SYNDROME OR OTHER MAJOR RESPIRATORY CONDITION,15,NEWBORNS AND OTHER NEONATES WITH CONDITIONS ORIGINATING IN THE PERINATAL PERIOD,1,Minor,Minor,Medical,Medicare,,,02200,,N,220286.49,45722.28
New York City,Manhattan,7002053,001463,NYU Langone Hospitals,0 to 17,112,M,White,Not Span/Hispanic,4,Newborn,Home or Self Care,2022,PNL001,Liveborn,ESA004,NON-INVASIVE VENTILATION,622,NEONATE BIRTH WEIGHT 2000-2499 GRAMS WITH RESPIRATORY DISTRESS SYNDROME OR OTHER MAJOR RESPIRATORY CONDITION,15,NEWBORNS AND OTHER NEONATES WITH CONDITIONS ORIGINATING IN THE PERINATAL PERIOD,1,Minor,Minor,Medical,Private Health Insurance,,,02400,,N,66773.54,21091.65
New York City,Manhattan,7002053,001463,NYU Langone Hospitals,0 to 17,112,M,White,Not Span/Hispanic,34,Newborn,Home or Self Care,2022,PNL001,Liveborn,RES007,AIRWAY INTUBATION,622,NEONATE BIRTH WEIGHT 2000-2499 GRAMS WITH RESPIRATORY DISTRESS SYNDROME OR OTHER MAJOR RESPIRATORY CONDITION,15,NEWBORNS AND OTHER NEONATES WITH CONDITIONS ORIGINATING IN THE PERINATAL PERIOD,3,Major,Minor,Medical,Medicaid,,,02200,,N,513783.61,175004.72
New York City,Manhattan,7002001,001438,Bellevue Hospital Center,0 to 17,114,M,Other Race,Unknown,10,Newborn,Home or Self Care,2022,PNL001,Liveborn,ADM017,ADMINISTRATION OF NUTRITIONAL AND ELECTROLYTIC SUBSTANCES,622,NEONATE BIRTH WEIGHT 2000-2499 GRAMS WITH RESPIRATORY DISTRESS SYNDROME OR OTHER MAJOR RESPIRATORY CONDITION,15,NEWBORNS AND OTHER NEONATES WITH CONDITIONS ORIGINATING IN THE PERINATAL PERIOD,1,Minor,Minor,Medical,Medicaid,,,02000,,N,97424.23,56027.12
New York City,Manhattan,7002053,001463,NYU Langone Hospitals,0 to 17,100,M,Other Race,Not Span/Hispanic,14,Newborn,Home or Self Care,2022,PNL001,Liveborn,ESA004,NON-INVASIVE VENTILATION,622,NEONATE BIRTH WEIGHT 2000-2499 GRAMS WITH RESPIRATORY DISTRESS SYNDROME OR OTHER MAJOR RESPIRATORY CONDITION,15,NEWBORNS AND OTHER NEONATES WITH CONDITIONS ORIGINATING IN THE PERINATAL PERIOD,2,Moderate,Minor,Medical,Private Health Insurance,Private Health Insurance,,02100,,N,209688.46,73474.51
New York City,Manhattan,7002053,001463,NYU Langone Hospitals,0 to 17,112,M,White,Not Span/Hispanic,4,Newborn,Home or Self Care,2022,PNL001,Liveborn,ADM010,VACCINATIONS,622,NEONATE BIRTH WEIGHT 2000-2499 GRAMS WITH RESPIRATORY DISTRESS SYNDROME OR OTHER MAJOR RESPIRATORY CONDITION,15,NEWBORNS AND OTHER NEONATES WITH CONDITIONS ORIGINATING IN THE PERINATAL PERIOD,1,Minor,Minor,Medical,Private Health Insurance,,,02200,,N,67620.82,23037.11
Long Island,Nassau,2951001,000541,North Shore University Hospital,0 to 17,118,M,Other Race,Not Span/Hispanic,3,Newborn,Home or Self Care,2022,PNL001,Liveborn,MRS001,CIRCUMCISION,622,NEONATE BIRTH WEIGHT 2000-2499 GRAMS WITH RESPIRATORY DISTRESS SYNDROME OR OTHER MAJOR RESPIRATORY CONDITION,15,NEWBORNS AND OTHER NEONATES WITH CONDITIONS ORIGINATING IN THE PERINATAL PERIOD,2,Moderate,Minor,Medical,Blue Cross/Blue Shield,,,02400,,N,36294.33,5797.48
Long Island,Nassau,2951001,000541,North Shore University Hospital,0 to 17,115,F,Other Race,Spanish/Hispanic,10,Newborn,Home or Self Care,2022,PNL001,Liveborn,ESA004,NON-INVASIVE VENTILATION,622,NEONATE BIRTH WEIGHT 2000-2499 GRAMS WITH RESPIRATORY DISTRESS SYNDROME OR OTHER MAJOR RESPIRATORY CONDITION,15,NEWBORNS AND OTHER NEONATES WITH CONDITIONS ORIGINATING IN THE PERINATAL PERIOD,1,Minor,Minor,Medical,Medicaid,Medicaid,,02300,,N,194919.83,27394.40
New York City,Manhattan,7002054,001464,New York-Presbyterian Hospital - Columbia Presbyterian Center,0 to 17,100,M,Multi-racial,Not Span/Hispanic,12,Newborn,Home or Self Care,2022,PNL001,Liveborn,ENT004,DIAGNOSTIC AUDIOLOGY,622,NEONATE BIRTH WEIGHT 2000-2499 GRAMS WITH RESPIRATORY DISTRESS SYNDROME OR OTHER MAJOR RESPIRATORY CONDITION,15,NEWBORNS AND OTHER NEONATES WITH CONDITIONS ORIGINATING IN THE PERINATAL PERIOD,2,Moderate,Minor,Medical,Blue Cross/Blue Shield,,,02300,,N,291269.73,60498.08
New York City,Manhattan,7002054,001464,New York-Presbyterian Hospital - Columbia Presbyterian Center,0 to 17,104,M,White,Spanish/Hispanic,11,Newborn,Home or Self Care,2022,PNL001,Liveborn,ESA004,NON-INVASIVE VENTILATION,622,NEONATE BIRTH WEIGHT 2000-2499 GRAMS WITH RESPIRATORY DISTRESS SYNDROME OR OTHER MAJOR RESPIRATORY CONDITION,15,NEWBORNS AND OTHER NEONATES WITH CONDITIONS ORIGINATING IN THE PERINATAL PERIOD,2,Moderate,Minor,Medical,Medicaid,,,02000,,N,161662.71,24957.09
Hudson Valley,Dutchess,1302001,000181,Vassar Brothers Medical Center,0 to 17,125,M,White,Unknown,17,Newborn,Home or Self Care,2022,PNL001,Liveborn,CAR024,VENOUS AND ARTERIAL CATHETER PLACEMENT,622,NEONATE BIRTH WEIGHT 2000-2499 GRAMS WITH RESPIRATORY DISTRESS SYNDROME OR OTHER MAJOR RESPIRATORY CONDITION,15,NEWBORNS AND OTHER NEONATES WITH CONDITIONS ORIGINATING IN THE PERINATAL PERIOD,2,Moderate,Minor,Medical,Medicaid,,,02100,,N,83662.98,35572.04
New York City,Manhattan,7002053,001463,NYU Langone Hospitals,0 to 17,OOS,F,White,Not Span/Hispanic,21,Newborn,Home or Self Care,2022,PNL001,Liveborn,ESA004,NON-INVASIVE VENTILATION,622,NEONATE BIRTH WEIGHT 2000-2499 GRAMS WITH RESPIRATORY DISTRESS SYNDROME OR OTHER MAJOR RESPIRATORY CONDITION,15,NEWBORNS AND OTHER NEONATES WITH CONDITIONS ORIGINATING IN THE PERINATAL PERIOD,1,Minor,Minor,Medical,Blue Cross/Blue Shield,,,02000,,N,306558.16,106952.35
New York City,Manhattan,7002053,001463,NYU Langone Hospitals,0 to 17,100,M,Other Race,Unknown,4,Newborn,Home or Self Care,2022,PNL001,Liveborn,ESA004,NON-INVASIVE VENTILATION,622,NEONATE BIRTH WEIGHT 2000-2499 GRAMS WITH RESPIRATORY DISTRESS SYNDROME OR OTHER MAJOR RESPIRATORY CONDITION,15,NEWBORNS AND OTHER NEONATES WITH CONDITIONS ORIGINATING IN THE PERINATAL PERIOD,3,Major,Moderate,Medical,Private Health Insurance,,,02400,,N,67661.90,22926.09
New York City,Manhattan,7002054,001464,New York-Presbyterian Hospital - Columbia Presbyterian Center,0 to 17,100,F,White,Not Span/Hispanic,25,Newborn,Home or Self Care,2022,PNL001,Liveborn,ESA004,NON-INVASIVE VENTILATION,622,NEONATE BIRTH WEIGHT 2000-2499 GRAMS WITH RESPIRATORY DISTRESS SYNDROME OR OTHER MAJOR RESPIRATORY CONDITION,15,NEWBORNS AND OTHER NEONATES WITH CONDITIONS ORIGINATING IN THE PERINATAL PERIOD,1,Minor,Minor,Medical,Private Health Insurance,,,02000,,N,590724.99,122247.91
New York City,Manhattan,7002054,001464,New York-Presbyterian Hospital - Columbia Presbyterian Center,0 to 17,104,F,Black/African American,Not Span/Hispanic,12,Newborn,Home or Self Care,2022,PNL001,Liveborn,ESA004,NON-INVASIVE VENTILATION,622,NEONATE BIRTH WEIGHT 2000-2499 GRAMS WITH RESPIRATORY DISTRESS SYNDROME OR OTHER MAJOR RESPIRATORY CONDITION,15,NEWBORNS AND OTHER NEONATES WITH CONDITIONS ORIGINATING IN THE PERINATAL PERIOD,1,Minor,Minor,Medical,Medicaid,,,02100,,N,309573.94,64744.06
New York City,Manhattan,7002001,001438,Bellevue Hospital Center,0 to 17,112,M,Other Race,Unknown,11,Newborn,Home or Self Care,2022,PNL001,Liveborn,ENT004,DIAGNOSTIC AUDIOLOGY,622,NEONATE BIRTH WEIGHT 2000-2499 GRAMS WITH RESPIRATORY DISTRESS SYNDROME OR OTHER MAJOR RESPIRATORY CONDITION,15,NEWBORNS AND OTHER NEONATES WITH CONDITIONS ORIGINATING IN THE PERINATAL PERIOD,2,Moderate,Minor,Medical,Medicaid,,,02000,,N,103657.56,59611.80
New York City,Manhattan,7002001,001438,Bellevue Hospital Center,0 to 17,100,F,Black/African American,Unknown,7,Newborn,Home or Self Care,2022,PNL001,Liveborn,ESA004,NON-INVASIVE VENTILATION,622,NEONATE BIRTH WEIGHT 2000-2499 GRAMS WITH RESPIRATORY DISTRESS SYNDROME OR OTHER MAJOR RESPIRATORY CONDITION,15,NEWBORNS AND OTHER NEONATES WITH CONDITIONS ORIGINATING IN THE PERINATAL PERIOD,2,Moderate,Minor,Medical,Medicaid,,,02200,,N,65434.86,37630.54
Finger Lakes,Monroe,2701005,000413,Strong Memorial Hospital,0 to 17,145,M,Other Race,Spanish/Hispanic,3,Newborn,Home or Self Care,2022,PNL001,Liveborn,MRS002,PENIS PROCEDURES (EXCLUDING CIRCUMCISION),622,NEONATE BIRTH WEIGHT 2000-2499 GRAMS WITH RESPIRATORY DISTRESS SYNDROME OR OTHER MAJOR RESPIRATORY CONDITION,15,NEWBORNS AND OTHER NEONATES WITH CONDITIONS ORIGINATING IN THE PERINATAL PERIOD,4,Extreme,Extreme,Medical,Medicaid,,,02200,,N,25987.96,7937.66
Finger Lakes,Monroe,2701005,000413,Strong Memorial Hospital,0 to 17,146,M,White,Not Span/Hispanic,22,Newborn,Home or Self Care,2022,PNL001,Liveborn,ESA004,NON-INVASIVE VENTILATION,622,NEONATE BIRTH WEIGHT 2000-2499 GRAMS WITH RESPIRATORY DISTRESS SYNDROME OR OTHER MAJOR RESPIRATORY CONDITION,15,NEWBORNS AND OTHER NEONATES WITH CONDITIONS ORIGINATING IN THE PERINATAL PERIOD,1,Minor,Minor,Medical,Blue Cross/Blue Shield,,,02300,,N,128805.08,46603.34
Finger Lakes,Monroe,2701005,000413,Strong Memorial Hospital,0 to 17,145,M,White,Not Span/Hispanic,3,Newborn,Home or Self Care,2022,PNL001,Liveborn,RES007,AIRWAY INTUBATION,622,NEONATE BIRTH WEIGHT 2000-2499 GRAMS WITH RESPIRATORY DISTRESS SYNDROME OR OTHER MAJOR RESPIRATORY CONDITION,15,NEWBORNS AND OTHER NEONATES WITH CONDITIONS ORIGINATING IN THE PERINATAL PERIOD,3,Major,Moderate,Medical,Medicaid,,,02100,,N,26158.50,10018.57
Finger Lakes,Monroe,2701005,000413,Strong Memorial Hospital,0 to 17,145,M,White,Not Span/Hispanic,16,Newborn,Home or Self Care,2022,PNL001,Liveborn,ESA004,NON-INVASIVE VENTILATION,622,NEONATE BIRTH WEIGHT 2000-2499 GRAMS WITH RESPIRATORY DISTRESS SYNDROME OR OTHER MAJOR RESPIRATORY CONDITION,15,NEWBORNS AND OTHER NEONATES WITH CONDITIONS ORIGINATING IN THE PERINATAL PERIOD,1,Minor,Minor,Medical,Medicaid,,,02200,,N,95363.03,35287.76
Long Island,Nassau,2951001,000541,North Shore University Hospital,0 to 17,113,M,Other Race,Not Span/Hispanic,8,Newborn,Home w/ Home Health Services,2022,PNL001,Liveborn,ESA004,NON-INVASIVE VENTILATION,622,NEONATE BIRTH WEIGHT 2000-2499 GRAMS WITH RESPIRATORY DISTRESS SYNDROME OR OTHER MAJOR RESPIRATORY CONDITION,15,NEWBORNS AND OTHER NEONATES WITH CONDITIONS ORIGINATING IN THE PERINATAL PERIOD,1,Minor,Minor,Medical,Blue Cross/Blue Shield,Blue Cross/Blue Shield,,02400,,N,164823.33,22759.48
Long Island,Nassau,2951001,000541,North Shore University Hospital,0 to 17,117,M,White,Not Span/Hispanic,27,Newborn,Home or Self Care,2022,PNL001,Liveborn,ESA004,NON-INVASIVE VENTILATION,622,NEONATE BIRTH WEIGHT 2000-2499 GRAMS WITH RESPIRATORY DISTRESS SYNDROME OR OTHER MAJOR RESPIRATORY CONDITION,15,NEWBORNS AND OTHER NEONATES WITH CONDITIONS ORIGINATING IN THE PERINATAL PERIOD,3,Major,Moderate,Medical,Blue Cross/Blue Shield,,,02200,,N,540992.91,75698.19
Long Island,Nassau,2951001,000541,North Shore University Hospital,0 to 17,113,F,White,Not Span/Hispanic,13,Newborn,Home or Self Care,2022,PNL001,Liveborn,ADM017,ADMINISTRATION OF NUTRITIONAL AND ELECTROLYTIC SUBSTANCES,622,NEONATE BIRTH WEIGHT 2000-2499 GRAMS WITH RESPIRATORY DISTRESS SYNDROME OR OTHER MAJOR RESPIRATORY CONDITION,15,NEWBORNS AND OTHER NEONATES WITH CONDITIONS ORIGINATING IN THE PERINATAL PERIOD,1,Minor,Minor,Medical,Private Health Insurance,,,02000,,N,260310.17,36857.93
Long Island,Nassau,2951001,000541,North Shore University Hospital,0 to 17,115,F,White,Not Span/Hispanic,14,Newborn,Home w/ Home Health Services,2022,PNL001,Liveborn,ESA004,NON-INVASIVE VENTILATION,622,NEONATE BIRTH WEIGHT 2000-2499 GRAMS WITH RESPIRATORY DISTRESS SYNDROME OR OTHER MAJOR RESPIRATORY CONDITION,15,NEWBORNS AND OTHER NEONATES WITH CONDITIONS ORIGINATING IN THE PERINATAL PERIOD,1,Minor,Minor,Medical,Blue Cross/Blue Shield,,,02400,,N,283055.43,39235.30
Finger Lakes,Monroe,2701005,000413,Strong Memorial Hospital,0 to 17,131,M,Other Race,Unknown,9,Urgent,Home or Self Care,2022,PNL006,Respiratory perinatal condition,ESA003,MECHANICAL VENTILATION,622,NEONATE BIRTH WEIGHT 2000-2499 GRAMS WITH RESPIRATORY DISTRESS SYNDROME OR OTHER MAJOR RESPIRATORY CONDITION,15,NEWBORNS AND OTHER NEONATES WITH CONDITIONS ORIGINATING IN THE PERINATAL PERIOD,3,Major,Moderate,Medical,Blue Cross/Blue Shield,,,02300,,N,84373.62,26523.74
New York City,Manhattan,7002054,001464,New York-Presbyterian Hospital - Columbia Presbyterian Center,0 to 17,104,M,Other Race,Not Span/Hispanic,3,Newborn,Home or Self Care,2022,PNL001,Liveborn,ESA004,NON-INVASIVE VENTILATION,622,NEONATE BIRTH WEIGHT 2000-2499 GRAMS WITH RESPIRATORY DISTRESS SYNDROME OR OTHER MAJOR RESPIRATORY CONDITION,15,NEWBORNS AND OTHER NEONATES WITH CONDITIONS ORIGINATING IN THE PERINATAL PERIOD,2,Moderate,Minor,Medical,Blue Cross/Blue Shield,,,02200,,N,29617.67,3058.53
New York City,Manhattan,7002054,001464,New York-Presbyterian Hospital - Columbia Presbyterian Center,0 to 17,112,M,White,Not Span/Hispanic,10,Newborn,Home or Self Care,2022,PNL001,Liveborn,ESA004,NON-INVASIVE VENTILATION,622,NEONATE BIRTH WEIGHT 2000-2499 GRAMS WITH RESPIRATORY DISTRESS SYNDROME OR OTHER MAJOR RESPIRATORY CONDITION,15,NEWBORNS AND OTHER NEONATES WITH CONDITIONS ORIGINATING IN THE PERINATAL PERIOD,2,Moderate,Minor,Medical,Medicaid,,,02400,,N,257950.08,53587.79
New York City,Manhattan,7002054,001464,New York-Presbyterian Hospital - Columbia Presbyterian Center,0 to 17,OOS,M,Other Race,Not Span/Hispanic,17,Newborn,Home or Self Care,2022,PNL001,Liveborn,ESA004,NON-INVASIVE VENTILATION,622,NEONATE BIRTH WEIGHT 2000-2499 GRAMS WITH RESPIRATORY DISTRESS SYNDROME OR OTHER MAJOR RESPIRATORY CONDITION,15,NEWBORNS AND OTHER NEONATES WITH CONDITIONS ORIGINATING IN THE PERINATAL PERIOD,1,Minor,Minor,Medical,Medicaid,,,02400,,N,416355.42,87524.92
New York City,Manhattan,7002054,001464,New York-Presbyterian Hospital - Columbia Presbyterian Center,0 to 17,109,M,White,Not Span/Hispanic,13,Newborn,Home or Self Care,2022,PNL001,Liveborn,ESA004,NON-INVASIVE VENTILATION,622,NEONATE BIRTH WEIGHT 2000-2499 GRAMS WITH RESPIRATORY DISTRESS SYNDROME OR OTHER MAJOR RESPIRATORY CONDITION,15,NEWBORNS AND OTHER NEONATES WITH CONDITIONS ORIGINATING IN THE PERINATAL PERIOD,2,Moderate,Minor,Medical,Medicaid,,,02000,,N,329526.70,68480.99
New York City,Manhattan,7002054,001464,New York-Presbyterian Hospital - Columbia Presbyterian Center,0 to 17,109,M,White,Not Span/Hispanic,13,Newborn,Home or Self Care,2022,PNL001,Liveborn,ESA004,NON-INVASIVE VENTILATION,622,NEONATE BIRTH WEIGHT 2000-2499 GRAMS WITH RESPIRATORY DISTRESS SYNDROME OR OTHER MAJOR RESPIRATORY CONDITION,15,NEWBORNS AND OTHER NEONATES WITH CONDITIONS ORIGINATING IN THE PERINATAL PERIOD,3,Major,Major,Medical,Medicaid,,,02200,,N,310870.45,64458.13
New York City,Manhattan,7002054,001464,New York-Presbyterian Hospital - Columbia Presbyterian Center,0 to 17,,M,Multi-racial,Spanish/Hispanic,11,Newborn,Home or Self Care,2022,PNL001,Liveborn,ADM010,VACCINATIONS,622,NEONATE BIRTH WEIGHT 2000-2499 GRAMS WITH RESPIRATORY DISTRESS SYNDROME OR OTHER MAJOR RESPIRATORY CONDITION,15,NEWBORNS AND OTHER NEONATES WITH CONDITIONS ORIGINATING IN THE PERINATAL PERIOD,1,Minor,Minor,Medical,Private Health Insurance,,,02200,,N,269527.70,55847.31
New York City,Manhattan,7002054,001464,New York-Presbyterian Hospital - Columbia Presbyterian Center,0 to 17,,F,Multi-racial,Spanish/Hispanic,11,Newborn,Home or Self Care,2022,PNL001,Liveborn,ADM017,ADMINISTRATION OF NUTRITIONAL AND ELECTROLYTIC SUBSTANCES,622,NEONATE BIRTH WEIGHT 2000-2499 GRAMS WITH RESPIRATORY DISTRESS SYNDROME OR OTHER MAJOR RESPIRATORY CONDITION,15,NEWBORNS AND OTHER NEONATES WITH CONDITIONS ORIGINATING IN THE PERINATAL PERIOD,1,Minor,Minor,Medical,Private Health Insurance,,,02000,,N,259887.21,53551.69
New York City,Manhattan,7002001,001438,Bellevue Hospital Center,0 to 17,100,F,Other Race,Unknown,15,Newborn,Home or Self Care,2022,PNL001,Liveborn,RES007,AIRWAY INTUBATION,622,NEONATE BIRTH WEIGHT 2000-2499 GRAMS WITH RESPIRATORY DISTRESS SYNDROME OR OTHER MAJOR RESPIRATORY CONDITION,15,NEWBORNS AND OTHER NEONATES WITH CONDITIONS ORIGINATING IN THE PERINATAL PERIOD,3,Major,Moderate,Medical,Medicaid,,,02100,,N,148346.15,85311.50
Finger Lakes,Monroe,2701005,000413,Strong Memorial Hospital,0 to 17,144,F,White,Not Span/Hispanic,9,Newborn,Home or Self Care,2022,PNL001,Liveborn,ADM017,ADMINISTRATION OF NUTRITIONAL AND ELECTROLYTIC SUBSTANCES,622,NEONATE BIRTH WEIGHT 2000-2499 GRAMS WITH RESPIRATORY DISTRESS SYNDROME OR OTHER MAJOR RESPIRATORY CONDITION,15,NEWBORNS AND OTHER NEONATES WITH CONDITIONS ORIGINATING IN THE PERINATAL PERIOD,2,Moderate,Minor,Medical,Medicaid,,,02200,,N,68839.33,21881.55
Finger Lakes,Monroe,2701005,000413,Strong Memorial Hospital,0 to 17,145,M,White,Unknown,23,Newborn,Home or Self Care,2022,PNL001,Liveborn,ADM021,"ADMINISTRATION OF THERAPEUTIC SUBSTANCES, NEC",622,NEONATE BIRTH WEIGHT 2000-2499 GRAMS WITH RESPIRATORY DISTRESS SYNDROME OR OTHER MAJOR RESPIRATORY CONDITION,15,NEWBORNS AND OTHER NEONATES WITH CONDITIONS ORIGINATING IN THE PERINATAL PERIOD,2,Moderate,Minor,Medical,Medicaid,,,02200,,N,180892.86,59022.44