Hospital Service Area,Hospital County,Operating Certificate Number,Permanent Facility Id,Facility Name,Age Group,Zip Code - 3 digits,Gender,Race,Ethnicity,Length of Stay,Type of Admission,Patient Disposition,Discharge Year,CCS Diagnosis Code,CCS Diagnosis Description,CCS Procedure Code,CCS Procedure Description,APR DRG Code,APR DRG Description,APR MDC Code,APR MDC Description,APR Severity of Illness Code,APR Severity of Illness Description,APR Risk of Mortality,APR Medical Surgical Description,Payment Typology 1,Payment Typology 2,Payment Typology 3,Birth Weight,Abortion Edit Indicator,Emergency Department Indicator,Total Charges,Total Costs
New York City,Manhattan,7002054,001464,New York-Presbyterian Hospital - Columbia Presbyterian Center,0 to 17,OOS,F,Other Race,Spanish/Hispanic,2,Newborn,Home or Self Care,2022,PNL001,Liveborn,ADM010,VACCINATIONS,626,"NEONATE BIRTH WEIGHT 2000-2499 GRAMS, NORMAL NEWBORN OR NEONATE WITH OTHER PROBLEM",15,NEWBORNS AND OTHER NEONATES WITH CONDITIONS ORIGINATING IN THE PERINATAL PERIOD,1,Minor,Minor,Medical,Medicaid,,,02000,,N,16991.58,1260.32
New York City,Manhattan,7002054,001464,New York-Presbyterian Hospital - Columbia Presbyterian Center,0 to 17,OOS,M,White,Not Span/Hispanic,4,Newborn,Home or Self Care,2022,PNL001,Liveborn,ADM010,VACCINATIONS,626,"NEONATE BIRTH WEIGHT 2000-2499 GRAMS, NORMAL NEWBORN OR NEONATE WITH OTHER PROBLEM",15,NEWBORNS AND OTHER NEONATES WITH CONDITIONS ORIGINATING IN THE PERINATAL PERIOD,2,Moderate,Minor,Medical,Private Health Insurance,,,02200,,N,32696.49,2132.54
New York City,Manhattan,7002054,001464,New York-Presbyterian Hospital - Columbia Presbyterian Center,0 to 17,100,F,Other Race,Spanish/Hispanic,1,Newborn,Home or Self Care,2022,PNL001,Liveborn,OTR004,ISOLATION PROCEDURES,626,"NEONATE BIRTH WEIGHT 2000-2499 GRAMS, NORMAL NEWBORN OR NEONATE WITH OTHER PROBLEM",15,NEWBORNS AND OTHER NEONATES WITH CONDITIONS ORIGINATING IN THE PERINATAL PERIOD,2,Moderate,Minor,Medical,Private Health Insurance,,,02200,,N,9321.29,756.81
New York City,Manhattan,7002054,001464,New York-Presbyterian Hospital - Columbia Presbyterian Center,0 to 17,OOS,F,White,Not Span/Hispanic,3,Newborn,Home or Self Care,2022,PNL001,Liveborn,ADM010,VACCINATIONS,626,"NEONATE BIRTH WEIGHT 2000-2499 GRAMS, NORMAL NEWBORN OR NEONATE WITH OTHER PROBLEM",15,NEWBORNS AND OTHER NEONATES WITH CONDITIONS ORIGINATING IN THE PERINATAL PERIOD,2,Moderate,Minor,Medical,Blue Cross/Blue Shield,,,02300,,N,24769.89,1589.12
New York City,Manhattan,7002054,001464,New York-Presbyterian Hospital - Columbia Presbyterian Center,0 to 17,OOS,F,Other Race,Not Span/Hispanic,2,Newborn,Home or Self Care,2022,PNL001,Liveborn,ADM010,VACCINATIONS,626,"NEONATE BIRTH WEIGHT 2000-2499 GRAMS, NORMAL NEWBORN OR NEONATE WITH OTHER PROBLEM",15,NEWBORNS AND OTHER NEONATES WITH CONDITIONS ORIGINATING IN THE PERINATAL PERIOD,3,Major,Minor,Medical,Private Health Insurance,,,02300,,N,16695.25,1409.65
New York City,Manhattan,7002054,001464,New York-Presbyterian Hospital - Columbia Presbyterian Center,0 to 17,107,M,Other Race,Spanish/Hispanic,3,Newborn,Home or Self Care,2022,PNL001,Liveborn,ADM010,VACCINATIONS,626,"NEONATE BIRTH WEIGHT 2000-2499 GRAMS, NORMAL NEWBORN OR NEONATE WITH OTHER PROBLEM",15,NEWBORNS AND OTHER NEONATES WITH CONDITIONS ORIGINATING IN THE PERINATAL PERIOD,2,Moderate,Minor,Medical,Private Health Insurance,,,02100,,N,54006.01,9986.64
New York City,Manhattan,7002054,001464,New York-Presbyterian Hospital - Columbia Presbyterian Center,0 to 17,113,F,Other Race,Not Span/Hispanic,17,Newborn,Home or Self Care,2022,PNL001,Liveborn,ESA004,NON-INVASIVE VENTILATION,626,"NEONATE BIRTH WEIGHT 2000-2499 GRAMS, NORMAL NEWBORN OR NEONATE WITH OTHER PROBLEM",15,NEWBORNS AND OTHER NEONATES WITH CONDITIONS ORIGINATING IN THE PERINATAL PERIOD,3,Major,Minor,Medical,Blue Cross/Blue Shield,,,02100,,N,388071.44,80528.99
New York City,Manhattan,7002054,001464,New York-Presbyterian Hospital - Columbia Presbyterian Center,0 to 17,105,M,Multi-racial,Spanish/Hispanic,5,Newborn,Home or Self Care,2022,PNL001,Liveborn,ADM010,VACCINATIONS,626,"NEONATE BIRTH WEIGHT 2000-2499 GRAMS, NORMAL NEWBORN OR NEONATE WITH OTHER PROBLEM",15,NEWBORNS AND OTHER NEONATES WITH CONDITIONS ORIGINATING IN THE PERINATAL PERIOD,1,Minor,Minor,Medical,Private Health Insurance,,,02400,,N,38739.04,1835.64
New York City,Manhattan,7002001,001438,Bellevue Hospital Center,0 to 17,113,F,Other Race,Unknown,2,Newborn,Home or Self Care,2022,PNL001,Liveborn,ENT004,DIAGNOSTIC AUDIOLOGY,626,"NEONATE BIRTH WEIGHT 2000-2499 GRAMS, NORMAL NEWBORN OR NEONATE WITH OTHER PROBLEM",15,NEWBORNS AND OTHER NEONATES WITH CONDITIONS ORIGINATING IN THE PERINATAL PERIOD,3,Major,Minor,Medical,Medicaid,,,02400,,N,14969.80,8608.89
New York City,Manhattan,7002054,001464,New York-Presbyterian Hospital - Columbia Presbyterian Center,0 to 17,OOS,F,White,Not Span/Hispanic,4,Newborn,Home or Self Care,2022,PNL001,Liveborn,ADM010,VACCINATIONS,626,"NEONATE BIRTH WEIGHT 2000-2499 GRAMS, NORMAL NEWBORN OR NEONATE WITH OTHER PROBLEM",15,NEWBORNS AND OTHER NEONATES WITH CONDITIONS ORIGINATING IN THE PERINATAL PERIOD,2,Moderate,Minor,Medical,Private Health Insurance,Private Health Insurance,,02300,,N,31693.71,1588.36
New York City,Manhattan,7002054,001464,New York-Presbyterian Hospital - Columbia Presbyterian Center,0 to 17,OOS,M,White,Not Span/Hispanic,4,Newborn,Home or Self Care,2022,PNL001,Liveborn,ADM010,VACCINATIONS,626,"NEONATE BIRTH WEIGHT 2000-2499 GRAMS, NORMAL NEWBORN OR NEONATE WITH OTHER PROBLEM",15,NEWBORNS AND OTHER NEONATES WITH CONDITIONS ORIGINATING IN THE PERINATAL PERIOD,1,Minor,Minor,Medical,Private Health Insurance,Private Health Insurance,,02300,,N,31740.01,1971.32
New York City,Manhattan,7002054,001464,New York-Presbyterian Hospital - Columbia Presbyterian Center,0 to 17,100,F,Other Race,Not Span/Hispanic,2,Newborn,Home or Self Care,2022,PNL001,Liveborn,ADM010,VACCINATIONS,626,"NEONATE BIRTH WEIGHT 2000-2499 GRAMS, NORMAL NEWBORN OR NEONATE WITH OTHER PROBLEM",15,NEWBORNS AND OTHER NEONATES WITH CONDITIONS ORIGINATING IN THE PERINATAL PERIOD,3,Major,Minor,Medical,Self-Pay,,,02200,,N,16986.97,1049.25
New York City,Manhattan,7002001,001438,Bellevue Hospital Center,0 to 17,111,F,Other Race,Unknown,3,Newborn,Home or Self Care,2022,PNL001,Liveborn,ENT004,DIAGNOSTIC AUDIOLOGY,626,"NEONATE BIRTH WEIGHT 2000-2499 GRAMS, NORMAL NEWBORN OR NEONATE WITH OTHER PROBLEM",15,NEWBORNS AND OTHER NEONATES WITH CONDITIONS ORIGINATING IN THE PERINATAL PERIOD,2,Moderate,Minor,Medical,Medicaid,,,02300,,N,21211.26,12198.26
New York City,Manhattan,7002001,001438,Bellevue Hospital Center,0 to 17,112,F,Other Race,Unknown,2,Newborn,Home or Self Care,2022,PNL001,Liveborn,ENT004,DIAGNOSTIC AUDIOLOGY,626,"NEONATE BIRTH WEIGHT 2000-2499 GRAMS, NORMAL NEWBORN OR NEONATE WITH OTHER PROBLEM",15,NEWBORNS AND OTHER NEONATES WITH CONDITIONS ORIGINATING IN THE PERINATAL PERIOD,3,Major,Minor,Medical,Medicaid,,,02100,,N,14798.89,8510.60
New York City,Manhattan,7002001,001438,Bellevue Hospital Center,0 to 17,112,M,White,Spanish/Hispanic,2,Newborn,Home or Self Care,2022,PNL001,Liveborn,ENT004,DIAGNOSTIC AUDIOLOGY,626,"NEONATE BIRTH WEIGHT 2000-2499 GRAMS, NORMAL NEWBORN OR NEONATE WITH OTHER PROBLEM",15,NEWBORNS AND OTHER NEONATES WITH CONDITIONS ORIGINATING IN THE PERINATAL PERIOD,1,Minor,Minor,Medical,Medicaid,,,02400,,N,14489.13,8332.47
New York City,Manhattan,7002001,001438,Bellevue Hospital Center,0 to 17,112,F,Black/African American,Spanish/Hispanic,3,Newborn,Home or Self Care,2022,PNL001,Liveborn,ADM010,VACCINATIONS,626,"NEONATE BIRTH WEIGHT 2000-2499 GRAMS, NORMAL NEWBORN OR NEONATE WITH OTHER PROBLEM",15,NEWBORNS AND OTHER NEONATES WITH CONDITIONS ORIGINATING IN THE PERINATAL PERIOD,3,Major,Minor,Medical,Medicaid,,,02300,,N,22902.97,13171.13
New York City,Manhattan,7002053,001463,NYU Langone Hospitals,0 to 17,112,M,White,Not Span/Hispanic,2,Newborn,Home or Self Care,2022,PNL001,Liveborn,ADM010,VACCINATIONS,626,"NEONATE BIRTH WEIGHT 2000-2499 GRAMS, NORMAL NEWBORN OR NEONATE WITH OTHER PROBLEM",15,NEWBORNS AND OTHER NEONATES WITH CONDITIONS ORIGINATING IN THE PERINATAL PERIOD,2,Moderate,Minor,Medical,Private Health Insurance,,,02300,,N,27933.23,10093.95
New York City,Manhattan,7002053,001463,NYU Langone Hospitals,0 to 17,111,F,White,Spanish/Hispanic,3,Newborn,Home or Self Care,2022,PNL001,Liveborn,ADM010,VACCINATIONS,626,"NEONATE BIRTH WEIGHT 2000-2499 GRAMS, NORMAL NEWBORN OR NEONATE WITH OTHER PROBLEM",15,NEWBORNS AND OTHER NEONATES WITH CONDITIONS ORIGINATING IN THE PERINATAL PERIOD,2,Moderate,Minor,Medical,Private Health Insurance,,,02300,,N,39511.76,13027.49
New York City,Manhattan,7002053,001463,NYU Langone Hospitals,0 to 17,100,F,White,Not Span/Hispanic,2,Newborn,Home or Self Care,2022,PNL001,Liveborn,ADM010,VACCINATIONS,626,"NEONATE BIRTH WEIGHT 2000-2499 GRAMS, NORMAL NEWBORN OR NEONATE WITH OTHER PROBLEM",15,NEWBORNS AND OTHER NEONATES WITH CONDITIONS ORIGINATING IN THE PERINATAL PERIOD,2,Moderate,Minor,Medical,Blue Cross/Blue Shield,,,02200,,N,27188.56,10016.04
New York City,Manhattan,7002054,001464,New York-Presbyterian Hospital - Columbia Presbyterian Center,0 to 17,100,M,White,Not Span/Hispanic,2,Newborn,Home or Self Care,2022,PNL001,Liveborn,ADM010,VACCINATIONS,626,"NEONATE BIRTH WEIGHT 2000-2499 GRAMS, NORMAL NEWBORN OR NEONATE WITH OTHER PROBLEM",15,NEWBORNS AND OTHER NEONATES WITH CONDITIONS ORIGINATING IN THE PERINATAL PERIOD,2,Moderate,Minor,Medical,Private Health Insurance,,,02000,,N,18599.20,1716.60
New York City,Manhattan,7002054,001464,New York-Presbyterian Hospital - Columbia Presbyterian Center,0 to 17,113,M,White,Not Span/Hispanic,3,Newborn,Home or Self Care,2022,PNL001,Liveborn,ADM010,VACCINATIONS,626,"NEONATE BIRTH WEIGHT 2000-2499 GRAMS, NORMAL NEWBORN OR NEONATE WITH OTHER PROBLEM",15,NEWBORNS AND OTHER NEONATES WITH CONDITIONS ORIGINATING IN THE PERINATAL PERIOD,1,Minor,Minor,Medical,Private Health Insurance,,,02200,,N,25397.64,1682.09
New York City,Manhattan,7002054,001464,New York-Presbyterian Hospital - Columbia Presbyterian Center,0 to 17,100,M,Other Race,Spanish/Hispanic,4,Newborn,Home or Self Care,2022,PNL001,Liveborn,ADM010,VACCINATIONS,626,"NEONATE BIRTH WEIGHT 2000-2499 GRAMS, NORMAL NEWBORN OR NEONATE WITH OTHER PROBLEM",15,NEWBORNS AND OTHER NEONATES WITH CONDITIONS ORIGINATING IN THE PERINATAL PERIOD,1,Minor,Minor,Medical,Medicaid,,,02400,,N,31889.47,1804.80
New York City,Manhattan,7002001,001438,Bellevue Hospital Center,0 to 17,113,F,Other Race,Spanish/Hispanic,4,Newborn,Home or Self Care,2022,PNL001,Liveborn,EST002,PHOTOTHERAPY,626,"NEONATE BIRTH WEIGHT 2000-2499 GRAMS, NORMAL NEWBORN OR NEONATE WITH OTHER PROBLEM",15,NEWBORNS AND OTHER NEONATES WITH CONDITIONS ORIGINATING IN THE PERINATAL PERIOD,3,Major,Minor,Medical,Medicaid,,,02400,,N,35361.21,20335.67
New York City,Manhattan,7002001,001438,Bellevue Hospital Center,0 to 17,112,M,Other Race,Spanish/Hispanic,3,Newborn,Home or Self Care,2022,PNL001,Liveborn,ENT004,DIAGNOSTIC AUDIOLOGY,626,"NEONATE BIRTH WEIGHT 2000-2499 GRAMS, NORMAL NEWBORN OR NEONATE WITH OTHER PROBLEM",15,NEWBORNS AND OTHER NEONATES WITH CONDITIONS ORIGINATING IN THE PERINATAL PERIOD,1,Minor,Minor,Medical,Medicaid,,,02000,,N,22053.22,12682.45
New York City,Manhattan,7002054,001464,New York-Presbyterian Hospital - Columbia Presbyterian Center,0 to 17,104,M,Other Race,Spanish/Hispanic,5,Newborn,Home or Self Care,2022,PNL001,Liveborn,ESA004,NON-INVASIVE VENTILATION,626,"NEONATE BIRTH WEIGHT 2000-2499 GRAMS, NORMAL NEWBORN OR NEONATE WITH OTHER PROBLEM",15,NEWBORNS AND OTHER NEONATES WITH CONDITIONS ORIGINATING IN THE PERINATAL PERIOD,3,Major,Minor,Medical,Private Health Insurance,Blue Cross/Blue Shield,,02200,,N,111980.18,22068.51
New York City,Manhattan,7002054,001464,New York-Presbyterian Hospital - Columbia Presbyterian Center,0 to 17,105,F,Other Race,Not Span/Hispanic,20,Newborn,Home or Self Care,2022,PNL001,Liveborn,ADM017,ADMINISTRATION OF NUTRITIONAL AND ELECTROLYTIC SUBSTANCES,626,"NEONATE BIRTH WEIGHT 2000-2499 GRAMS, NORMAL NEWBORN OR NEONATE WITH OTHER PROBLEM",15,NEWBORNS AND OTHER NEONATES WITH CONDITIONS ORIGINATING IN THE PERINATAL PERIOD,3,Major,Minor,Medical,Medicaid,,,02000,,N,472828.46,97757.38
New York City,Manhattan,7002054,001464,New York-Presbyterian Hospital - Columbia Presbyterian Center,0 to 17,101,M,White,Not Span/Hispanic,4,Newborn,Home or Self Care,2022,PNL001,Liveborn,ADM010,VACCINATIONS,626,"NEONATE BIRTH WEIGHT 2000-2499 GRAMS, NORMAL NEWBORN OR NEONATE WITH OTHER PROBLEM",15,NEWBORNS AND OTHER NEONATES WITH CONDITIONS ORIGINATING IN THE PERINATAL PERIOD,1,Minor,Minor,Medical,Blue Cross/Blue Shield,,,02400,,N,31828.69,1698.62
New York City,Manhattan,7002054,001464,New York-Presbyterian Hospital - Columbia Presbyterian Center,0 to 17,101,M,White,Not Span/Hispanic,4,Newborn,Home or Self Care,2022,PNL001,Liveborn,MRS001,CIRCUMCISION,626,"NEONATE BIRTH WEIGHT 2000-2499 GRAMS, NORMAL NEWBORN OR NEONATE WITH OTHER PROBLEM",15,NEWBORNS AND OTHER NEONATES WITH CONDITIONS ORIGINATING IN THE PERINATAL PERIOD,3,Major,Minor,Medical,Blue Cross/Blue Shield,,,02200,,N,31930.56,1725.94
New York City,Manhattan,7002053,001463,NYU Langone Hospitals,0 to 17,112,M,Other Race,Spanish/Hispanic,2,Newborn,Home or Self Care,2022,PNL001,Liveborn,MRS001,CIRCUMCISION,626,"NEONATE BIRTH WEIGHT 2000-2499 GRAMS, NORMAL NEWBORN OR NEONATE WITH OTHER PROBLEM",15,NEWBORNS AND OTHER NEONATES WITH CONDITIONS ORIGINATING IN THE PERINATAL PERIOD,2,Moderate,Minor,Medical,Private Health Insurance,,,02300,,N,25197.77,8355.85
New York City,Manhattan,7002053,001463,NYU Langone Hospitals,0 to 17,117,F,White,Not Span/Hispanic,2,Newborn,Home or Self Care,2022,PNL001,Liveborn,,,626,"NEONATE BIRTH WEIGHT 2000-2499 GRAMS, NORMAL NEWBORN OR NEONATE WITH OTHER PROBLEM",15,NEWBORNS AND OTHER NEONATES WITH CONDITIONS ORIGINATING IN THE PERINATAL PERIOD,1,Minor,Minor,Medical,Blue Cross/Blue Shield,,,02400,,N,25057.70,8159.05
New York City,Manhattan,7002053,001463,NYU Langone Hospitals,0 to 17,,F,Other Race,Spanish/Hispanic,2,Newborn,Home or Self Care,2022,PNL001,Liveborn,ADM010,VACCINATIONS,626,"NEONATE BIRTH WEIGHT 2000-2499 GRAMS, NORMAL NEWBORN OR NEONATE WITH OTHER PROBLEM",15,NEWBORNS AND OTHER NEONATES WITH CONDITIONS ORIGINATING IN THE PERINATAL PERIOD,1,Minor,Minor,Medical,Private Health Insurance,,,02400,,N,31030.83,11140.05
Finger Lakes,Monroe,2701005,000413,Strong Memorial Hospital,0 to 17,147,F,White,Not Span/Hispanic,1,Newborn,Home or Self Care,2022,PNL001,Liveborn,,,626,"NEONATE BIRTH WEIGHT 2000-2499 GRAMS, NORMAL NEWBORN OR NEONATE WITH OTHER PROBLEM",15,NEWBORNS AND OTHER NEONATES WITH CONDITIONS ORIGINATING IN THE PERINATAL PERIOD,2,Moderate,Minor,Medical,Private Health Insurance,,,02400,,N,2404.47,1183.17
Finger Lakes,Monroe,2701005,000413,Strong Memorial Hospital,0 to 17,146,F,White,Spanish/Hispanic,2,Newborn,Home or Self Care,2022,PNL001,Liveborn,,,626,"NEONATE BIRTH WEIGHT 2000-2499 GRAMS, NORMAL NEWBORN OR NEONATE WITH OTHER PROBLEM",15,NEWBORNS AND OTHER NEONATES WITH CONDITIONS ORIGINATING IN THE PERINATAL PERIOD,3,Major,Minor,Medical,Medicaid,,,02400,,N,5800.47,2464.54
Finger Lakes,Monroe,2701005,000413,Strong Memorial Hospital,0 to 17,146,F,Black/African American,Not Span/Hispanic,2,Newborn,Home w/ Home Health Services,2022,PNL001,Liveborn,,,626,"NEONATE BIRTH WEIGHT 2000-2499 GRAMS, NORMAL NEWBORN OR NEONATE WITH OTHER PROBLEM",15,NEWBORNS AND OTHER NEONATES WITH CONDITIONS ORIGINATING IN THE PERINATAL PERIOD,3,Major,Minor,Medical,Medicaid,,,02300,,N,3564.09,1968.67
Finger Lakes,Monroe,2701005,000413,Strong Memorial Hospital,0 to 17,146,F,Other Race,Not Span/Hispanic,2,Newborn,Home w/ Home Health Services,2022,PNL001,Liveborn,,,626,"NEONATE BIRTH WEIGHT 2000-2499 GRAMS, NORMAL NEWBORN OR NEONATE WITH OTHER PROBLEM",15,NEWBORNS AND OTHER NEONATES WITH CONDITIONS ORIGINATING IN THE PERINATAL PERIOD,1,Minor,Minor,Medical,Private Health Insurance,,,02400,,N,4995.90,2292.94
Finger Lakes,Monroe,2701005,000413,Strong Memorial Hospital,0 to 17,146,M,Other Race,Not Span/Hispanic,1,Newborn,Home or Self Care,2022,PNL001,Liveborn,,,626,"NEONATE BIRTH WEIGHT 2000-2499 GRAMS, NORMAL NEWBORN OR NEONATE WITH OTHER PROBLEM",15,NEWBORNS AND OTHER NEONATES WITH CONDITIONS ORIGINATING IN THE PERINATAL PERIOD,2,Moderate,Minor,Medical,Medicaid,,,02300,,N,1880.47,1034.96
Finger Lakes,Monroe,2701005,000413,Strong Memorial Hospital,0 to 17,144,F,White,Not Span/Hispanic,23,Newborn,Home or Self Care,2022,PNL001,Liveborn,CNS002,LUMBAR PUNCTURE,626,"NEONATE BIRTH WEIGHT 2000-2499 GRAMS, NORMAL NEWBORN OR NEONATE WITH OTHER PROBLEM",15,NEWBORNS AND OTHER NEONATES WITH CONDITIONS ORIGINATING IN THE PERINATAL PERIOD,3,Major,Minor,Medical,Medicaid,,,02000,,N,130756.30,47432.90
Finger Lakes,Monroe,2701005,000413,Strong Memorial Hospital,0 to 17,144,M,Other Race,Not Span/Hispanic,14,Newborn,Home or Self Care,2022,PNL001,Liveborn,ADM017,ADMINISTRATION OF NUTRITIONAL AND ELECTROLYTIC SUBSTANCES,626,"NEONATE BIRTH WEIGHT 2000-2499 GRAMS, NORMAL NEWBORN OR NEONATE WITH OTHER PROBLEM",15,NEWBORNS AND OTHER NEONATES WITH CONDITIONS ORIGINATING IN THE PERINATAL PERIOD,1,Minor,Minor,Medical,Medicaid,,,02100,,N,79986.73,29729.11
Finger Lakes,Monroe,2701005,000413,Strong Memorial Hospital,0 to 17,,M,Other Race,Spanish/Hispanic,7,Newborn,Home or Self Care,2022,PNL001,Liveborn,MRS001,CIRCUMCISION,626,"NEONATE BIRTH WEIGHT 2000-2499 GRAMS, NORMAL NEWBORN OR NEONATE WITH OTHER PROBLEM",15,NEWBORNS AND OTHER NEONATES WITH CONDITIONS ORIGINATING IN THE PERINATAL PERIOD,3,Major,Minor,Medical,Medicaid,,,02400,,N,52685.85,16637.94
Finger Lakes,Monroe,2701005,000413,Strong Memorial Hospital,0 to 17,146,M,Black/African American,Not Span/Hispanic,9,Newborn,Home or Self Care,2022,PNL001,Liveborn,MRS001,CIRCUMCISION,626,"NEONATE BIRTH WEIGHT 2000-2499 GRAMS, NORMAL NEWBORN OR NEONATE WITH OTHER PROBLEM",15,NEWBORNS AND OTHER NEONATES WITH CONDITIONS ORIGINATING IN THE PERINATAL PERIOD,2,Moderate,Minor,Medical,Medicaid,,,02200,,N,13613.05,7903.70
Finger Lakes,Monroe,2701005,000413,Strong Memorial Hospital,0 to 17,146,F,Black/African American,Not Span/Hispanic,2,Newborn,Home w/ Home Health Services,2022,PNL001,Liveborn,EST002,PHOTOTHERAPY,626,"NEONATE BIRTH WEIGHT 2000-2499 GRAMS, NORMAL NEWBORN OR NEONATE WITH OTHER PROBLEM",15,NEWBORNS AND OTHER NEONATES WITH CONDITIONS ORIGINATING IN THE PERINATAL PERIOD,2,Moderate,Minor,Medical,Medicaid,,,02200,,N,5062.78,2272.57
Finger Lakes,Monroe,2701005,000413,Strong Memorial Hospital,0 to 17,146,F,Black/African American,Not Span/Hispanic,2,Urgent,Home or Self Care,2022,PNL007,Hemolytic jaundice and perinatal jaundice,,,626,"NEONATE BIRTH WEIGHT 2000-2499 GRAMS, NORMAL NEWBORN OR NEONATE WITH OTHER PROBLEM",15,NEWBORNS AND OTHER NEONATES WITH CONDITIONS ORIGINATING IN THE PERINATAL PERIOD,1,Minor,Minor,Medical,Medicaid,,,02200,,N,10630.48,3369.84
New York City,Manhattan,7002053,001463,NYU Langone Hospitals,0 to 17,100,F,White,Not Span/Hispanic,2,Newborn,Home or Self Care,2022,PNL001,Liveborn,,,626,"NEONATE BIRTH WEIGHT 2000-2499 GRAMS, NORMAL NEWBORN OR NEONATE WITH OTHER PROBLEM",15,NEWBORNS AND OTHER NEONATES WITH CONDITIONS ORIGINATING IN THE PERINATAL PERIOD,2,Moderate,Minor,Medical,Private Health Insurance,,,02100,,N,25632.08,8219.15
New York City,Manhattan,7002053,001463,NYU Langone Hospitals,0 to 17,109,M,Other Race,Unknown,2,Newborn,Home or Self Care,2022,PNL001,Liveborn,,,626,"NEONATE BIRTH WEIGHT 2000-2499 GRAMS, NORMAL NEWBORN OR NEONATE WITH OTHER PROBLEM",15,NEWBORNS AND OTHER NEONATES WITH CONDITIONS ORIGINATING IN THE PERINATAL PERIOD,2,Moderate,Minor,Medical,Medicaid,,,02300,,N,25058.35,8159.12
New York City,Manhattan,7002001,001438,Bellevue Hospital Center,0 to 17,100,M,Black/African American,Unknown,2,Newborn,Home or Self Care,2022,PNL001,Liveborn,MRS001,CIRCUMCISION,626,"NEONATE BIRTH WEIGHT 2000-2499 GRAMS, NORMAL NEWBORN OR NEONATE WITH OTHER PROBLEM",15,NEWBORNS AND OTHER NEONATES WITH CONDITIONS ORIGINATING IN THE PERINATAL PERIOD,2,Moderate,Minor,Medical,Medicaid,,,02200,,N,14911.41,8575.31
Finger Lakes,Monroe,2701005,000413,Strong Memorial Hospital,0 to 17,146,F,Black/African American,Not Span/Hispanic,3,Newborn,Home or Self Care,2022,PNL001,Liveborn,,,626,"NEONATE BIRTH WEIGHT 2000-2499 GRAMS, NORMAL NEWBORN OR NEONATE WITH OTHER PROBLEM",15,NEWBORNS AND OTHER NEONATES WITH CONDITIONS ORIGINATING IN THE PERINATAL PERIOD,2,Moderate,Minor,Medical,Medicaid,,,02100,,N,5619.47,2902.33
Finger Lakes,Monroe,2701005,000413,Strong Memorial Hospital,0 to 17,146,F,Black/African American,Not Span/Hispanic,7,Newborn,Home or Self Care,2022,PNL001,Liveborn,,,626,"NEONATE BIRTH WEIGHT 2000-2499 GRAMS, NORMAL NEWBORN OR NEONATE WITH OTHER PROBLEM",15,NEWBORNS AND OTHER NEONATES WITH CONDITIONS ORIGINATING IN THE PERINATAL PERIOD,2,Moderate,Minor,Medical,Medicaid,,,02000,,N,52313.71,16530.43
New York City,Manhattan,7002001,001438,Bellevue Hospital Center,0 to 17,100,F,Black/African American,Unknown,3,Newborn,Home or Self Care,2022,PNL001,Liveborn,ADM010,VACCINATIONS,626,"NEONATE BIRTH WEIGHT 2000-2499 GRAMS, NORMAL NEWBORN OR NEONATE WITH OTHER PROBLEM",15,NEWBORNS AND OTHER NEONATES WITH CONDITIONS ORIGINATING IN THE PERINATAL PERIOD,3,Major,Minor,Medical,Medicaid,,,02200,,N,21320.17,12260.89
New York City,Manhattan,7002001,001438,Bellevue Hospital Center,0 to 17,114,F,Black/African American,Unknown,2,Newborn,Home or Self Care,2022,PNL001,Liveborn,ADM010,VACCINATIONS,626,"NEONATE BIRTH WEIGHT 2000-2499 GRAMS, NORMAL NEWBORN OR NEONATE WITH OTHER PROBLEM",15,NEWBORNS AND OTHER NEONATES WITH CONDITIONS ORIGINATING IN THE PERINATAL PERIOD,3,Major,Minor,Medical,Medicaid,,,02300,,N,14647.26,8423.40
New York City,Manhattan,7002053,001463,NYU Langone Hospitals,0 to 17,112,M,White,Not Span/Hispanic,2,Newborn,Home or Self Care,2022,PNL001,Liveborn,ADM010,VACCINATIONS,626,"NEONATE BIRTH WEIGHT 2000-2499 GRAMS, NORMAL NEWBORN OR NEONATE WITH OTHER PROBLEM",15,NEWBORNS AND OTHER NEONATES WITH CONDITIONS ORIGINATING IN THE PERINATAL PERIOD,2,Moderate,Minor,Medical,Private Health Insurance,,,02400,,N,28317.78,10316.33
New York City,Manhattan,7002054,001464,New York-Presbyterian Hospital - Columbia Presbyterian Center,0 to 17,105,M,White,Not Span/Hispanic,2,Newborn,Home or Self Care,2022,PNL001,Liveborn,MRS001,CIRCUMCISION,626,"NEONATE BIRTH WEIGHT 2000-2499 GRAMS, NORMAL NEWBORN OR NEONATE WITH OTHER PROBLEM",15,NEWBORNS AND OTHER NEONATES WITH CONDITIONS ORIGINATING IN THE PERINATAL PERIOD,3,Major,Minor,Medical,Blue Cross/Blue Shield,,,02400,,N,18490.63,1642.39
New York City,Manhattan,7002054,001464,New York-Presbyterian Hospital - Columbia Presbyterian Center,0 to 17,114,M,Other Race,Not Span/Hispanic,2,Newborn,Home or Self Care,2022,PNL001,Liveborn,ADM010,VACCINATIONS,626,"NEONATE BIRTH WEIGHT 2000-2499 GRAMS, NORMAL NEWBORN OR NEONATE WITH OTHER PROBLEM",15,NEWBORNS AND OTHER NEONATES WITH CONDITIONS ORIGINATING IN THE PERINATAL PERIOD,2,Moderate,Minor,Medical,Blue Cross/Blue Shield,,,02200,,N,16831.07,1068.49
New York City,Manhattan,7002054,001464,New York-Presbyterian Hospital - Columbia Presbyterian Center,0 to 17,100,F,White,Not Span/Hispanic,14,Newborn,Home or Self Care,2022,PNL001,Liveborn,EST002,PHOTOTHERAPY,626,"NEONATE BIRTH WEIGHT 2000-2499 GRAMS, NORMAL NEWBORN OR NEONATE WITH OTHER PROBLEM",15,NEWBORNS AND OTHER NEONATES WITH CONDITIONS ORIGINATING IN THE PERINATAL PERIOD,3,Major,Minor,Medical,Medicaid,,,02200,,N,327741.85,67600.92
New York City,Manhattan,7002054,001464,New York-Presbyterian Hospital - Columbia Presbyterian Center,0 to 17,100,F,Other Race,Spanish/Hispanic,4,Newborn,Home or Self Care,2022,PNL001,Liveborn,ENT004,DIAGNOSTIC AUDIOLOGY,626,"NEONATE BIRTH WEIGHT 2000-2499 GRAMS, NORMAL NEWBORN OR NEONATE WITH OTHER PROBLEM",15,NEWBORNS AND OTHER NEONATES WITH CONDITIONS ORIGINATING IN THE PERINATAL PERIOD,1,Minor,Minor,Medical,Private Health Insurance,,,02200,,N,31764.34,1598.57