Hospital Service Area,Hospital County,Operating Certificate Number,Permanent Facility Id,Facility Name,Age Group,Zip Code - 3 digits,Gender,Race,Ethnicity,Length of Stay,Type of Admission,Patient Disposition,Discharge Year,CCS Diagnosis Code,CCS Diagnosis Description,CCS Procedure Code,CCS Procedure Description,APR DRG Code,APR DRG Description,APR MDC Code,APR MDC Description,APR Severity of Illness Code,APR Severity of Illness Description,APR Risk of Mortality,APR Medical Surgical Description,Payment Typology 1,Payment Typology 2,Payment Typology 3,Birth Weight,Abortion Edit Indicator,Emergency Department Indicator,Total Charges,Total Costs
New York City,Manhattan,7002054,001464,New York-Presbyterian Hospital - Columbia Presbyterian Center,50 to 69,100,M,Other Race,Spanish/Hispanic,29,Elective,Skilled Nursing Home,2022,BLD008,Immunity disorders,HEP005,PANCREATECTOMY,651,OTHER PROCEDURES OF BLOOD AND BLOOD-FORMING ORGANS,16,DISEASES AND DISORDERS OF THE BLOOD AND BLOOD FORMING ORGANS AND IMMUNOLOGICAL DISORDERS,4,Extreme,Extreme,Surgical,Medicare,Medicaid,Medicaid,,,N,747122.18,288906.52
New York City,Manhattan,7002001,001438,Bellevue Hospital Center,50 to 69,100,M,White,Not Span/Hispanic,1,Elective,Home or Self Care,2022,SYM016,Other general signs and symptoms,LYM001,LYMPH NODE BIOPSY,651,OTHER PROCEDURES OF BLOOD AND BLOOD-FORMING ORGANS,16,DISEASES AND DISORDERS OF THE BLOOD AND BLOOD FORMING ORGANS AND IMMUNOLOGICAL DISORDERS,1,Minor,Minor,Surgical,Medicare,,,,,N,51337.22,29523.21
Finger Lakes,Monroe,2701005,000413,Strong Memorial Hospital,70 or Older,145,M,Other Race,Unknown,10,Emergency,Home w/ Home Health Services,2022,SYM016,Other general signs and symptoms,LYM001,LYMPH NODE BIOPSY,651,OTHER PROCEDURES OF BLOOD AND BLOOD-FORMING ORGANS,16,DISEASES AND DISORDERS OF THE BLOOD AND BLOOD FORMING ORGANS AND IMMUNOLOGICAL DISORDERS,3,Major,Major,Surgical,Federal/State/Local/VA,,,,,Y,72028.71,31702.28
Finger Lakes,Monroe,2701005,000413,Strong Memorial Hospital,18 to 29,144,M,White,Not Span/Hispanic,4,Emergency,Home or Self Care,2022,SYM016,Other general signs and symptoms,LYM001,LYMPH NODE BIOPSY,651,OTHER PROCEDURES OF BLOOD AND BLOOD-FORMING ORGANS,16,DISEASES AND DISORDERS OF THE BLOOD AND BLOOD FORMING ORGANS AND IMMUNOLOGICAL DISORDERS,1,Minor,Moderate,Surgical,Blue Cross/Blue Shield,,,,,Y,54277.23,19680.72
New York City,Manhattan,7002053,001463,NYU Langone Hospitals,50 to 69,105,M,White,Not Span/Hispanic,1,Elective,Home or Self Care,2022,END015,Other specified and unspecified endocrine disorders,LYM004,THYMECTOMY,651,OTHER PROCEDURES OF BLOOD AND BLOOD-FORMING ORGANS,16,DISEASES AND DISORDERS OF THE BLOOD AND BLOOD FORMING ORGANS AND IMMUNOLOGICAL DISORDERS,2,Moderate,Minor,Surgical,Medicare,Blue Cross/Blue Shield,Private Health Insurance,,,N,105890.39,17521.32
New York City,Manhattan,7002053,001463,NYU Langone Hospitals,70 or Older,113,M,White,Not Span/Hispanic,1,Elective,Home or Self Care,2022,END015,Other specified and unspecified endocrine disorders,LYM004,THYMECTOMY,651,OTHER PROCEDURES OF BLOOD AND BLOOD-FORMING ORGANS,16,DISEASES AND DISORDERS OF THE BLOOD AND BLOOD FORMING ORGANS AND IMMUNOLOGICAL DISORDERS,2,Moderate,Minor,Surgical,Medicare,Medicare,,,,N,106582.14,17859.04
New York City,Manhattan,7002054,001464,New York-Presbyterian Hospital - Columbia Presbyterian Center,70 or Older,112,M,White,Not Span/Hispanic,1,Elective,Home or Self Care,2022,NEO073,Benign neoplasms,LYM004,THYMECTOMY,651,OTHER PROCEDURES OF BLOOD AND BLOOD-FORMING ORGANS,16,DISEASES AND DISORDERS OF THE BLOOD AND BLOOD FORMING ORGANS AND IMMUNOLOGICAL DISORDERS,2,Moderate,Minor,Surgical,Medicare,Private Health Insurance,Blue Cross/Blue Shield,,,N,72334.80,16394.09
New York City,Manhattan,7002053,001463,NYU Langone Hospitals,30 to 49,105,M,White,Not Span/Hispanic,1,Elective,Home or Self Care,2022,END015,Other specified and unspecified endocrine disorders,LYM004,THYMECTOMY,651,OTHER PROCEDURES OF BLOOD AND BLOOD-FORMING ORGANS,16,DISEASES AND DISORDERS OF THE BLOOD AND BLOOD FORMING ORGANS AND IMMUNOLOGICAL DISORDERS,1,Minor,Minor,Surgical,Private Health Insurance,,,,,N,101560.50,17172.62
Hudson Valley,Dutchess,1302001,000181,Vassar Brothers Medical Center,50 to 69,125,F,White,Spanish/Hispanic,5,Elective,Home or Self Care,2022,SYM016,Other general signs and symptoms,LYM003,LYMPH NODE DISSECTION,651,OTHER PROCEDURES OF BLOOD AND BLOOD-FORMING ORGANS,16,DISEASES AND DISORDERS OF THE BLOOD AND BLOOD FORMING ORGANS AND IMMUNOLOGICAL DISORDERS,1,Minor,Moderate,Surgical,Medicare,,,,,N,43394.87,14696.89
New York City,Manhattan,7002053,001463,NYU Langone Hospitals,50 to 69,115,M,White,Not Span/Hispanic,1,Emergency,Home or Self Care,2022,END015,Other specified and unspecified endocrine disorders,LYM004,THYMECTOMY,651,OTHER PROCEDURES OF BLOOD AND BLOOD-FORMING ORGANS,16,DISEASES AND DISORDERS OF THE BLOOD AND BLOOD FORMING ORGANS AND IMMUNOLOGICAL DISORDERS,2,Moderate,Minor,Surgical,Medicare,,,,,N,102033.86,17195.76
New York City,Manhattan,7002053,001463,NYU Langone Hospitals,50 to 69,100,M,White,Not Span/Hispanic,3,Emergency,Home or Self Care,2022,BLD001,Nutritional anemia,LYM001,LYMPH NODE BIOPSY,651,OTHER PROCEDURES OF BLOOD AND BLOOD-FORMING ORGANS,16,DISEASES AND DISORDERS OF THE BLOOD AND BLOOD FORMING ORGANS AND IMMUNOLOGICAL DISORDERS,3,Major,Moderate,Surgical,Medicare,Blue Cross/Blue Shield,,,,Y,74883.11,19142.61
New York City,Manhattan,7002053,001463,NYU Langone Hospitals,30 to 49,113,F,Other Race,Spanish/Hispanic,1,Elective,Home or Self Care,2022,END015,Other specified and unspecified endocrine disorders,LYM004,THYMECTOMY,651,OTHER PROCEDURES OF BLOOD AND BLOOD-FORMING ORGANS,16,DISEASES AND DISORDERS OF THE BLOOD AND BLOOD FORMING ORGANS AND IMMUNOLOGICAL DISORDERS,2,Moderate,Minor,Surgical,Private Health Insurance,,,,,N,110414.12,18238.66
New York City,Manhattan,7002053,001463,NYU Langone Hospitals,30 to 49,100,M,White,Not Span/Hispanic,1,Elective,Home or Self Care,2022,SYM016,Other general signs and symptoms,LYM002,LYMPH NODE EXCISION (THERAPEUTIC),651,OTHER PROCEDURES OF BLOOD AND BLOOD-FORMING ORGANS,16,DISEASES AND DISORDERS OF THE BLOOD AND BLOOD FORMING ORGANS AND IMMUNOLOGICAL DISORDERS,1,Minor,Minor,Surgical,Blue Cross/Blue Shield,,,,,N,192607.41,28615.43
New York City,Manhattan,7002054,001464,New York-Presbyterian Hospital - Columbia Presbyterian Center,30 to 49,109,F,Other Race,Unknown,5,Elective,Home w/ Home Health Services,2022,END015,Other specified and unspecified endocrine disorders,LYM004,THYMECTOMY,651,OTHER PROCEDURES OF BLOOD AND BLOOD-FORMING ORGANS,16,DISEASES AND DISORDERS OF THE BLOOD AND BLOOD FORMING ORGANS AND IMMUNOLOGICAL DISORDERS,2,Moderate,Minor,Surgical,Private Health Insurance,,,,,N,150968.61,63424.42
New York City,Manhattan,7002053,001463,NYU Langone Hospitals,50 to 69,104,M,Other Race,Not Span/Hispanic,1,Elective,Home or Self Care,2022,END015,Other specified and unspecified endocrine disorders,LYM004,THYMECTOMY,651,OTHER PROCEDURES OF BLOOD AND BLOOD-FORMING ORGANS,16,DISEASES AND DISORDERS OF THE BLOOD AND BLOOD FORMING ORGANS AND IMMUNOLOGICAL DISORDERS,2,Moderate,Moderate,Surgical,Medicaid,,,,,N,101384.36,16770.31
New York City,Manhattan,7002053,001463,NYU Langone Hospitals,50 to 69,117,M,White,Not Span/Hispanic,2,Elective,Home or Self Care,2022,NEO073,Benign neoplasms,LYM004,THYMECTOMY,651,OTHER PROCEDURES OF BLOOD AND BLOOD-FORMING ORGANS,16,DISEASES AND DISORDERS OF THE BLOOD AND BLOOD FORMING ORGANS AND IMMUNOLOGICAL DISORDERS,2,Moderate,Minor,Surgical,Miscellaneous/Other,,,,,N,184268.75,31143.57
New York City,Manhattan,7002053,001463,NYU Langone Hospitals,50 to 69,125,M,White,Not Span/Hispanic,1,Elective,Home or Self Care,2022,CIR039,Other specified diseases of veins and lymphatics,LYM011,"LYMPHATIC PROCEDURES, NEC",651,OTHER PROCEDURES OF BLOOD AND BLOOD-FORMING ORGANS,16,DISEASES AND DISORDERS OF THE BLOOD AND BLOOD FORMING ORGANS AND IMMUNOLOGICAL DISORDERS,2,Moderate,Minor,Surgical,Medicare,Blue Cross/Blue Shield,,,,N,48973.74,9890.34
Long Island,Nassau,2951001,000541,North Shore University Hospital,50 to 69,114,F,Black/African American,Not Span/Hispanic,7,Emergency,Home or Self Care,2022,SYM016,Other general signs and symptoms,LYM001,LYMPH NODE BIOPSY,651,OTHER PROCEDURES OF BLOOD AND BLOOD-FORMING ORGANS,16,DISEASES AND DISORDERS OF THE BLOOD AND BLOOD FORMING ORGANS AND IMMUNOLOGICAL DISORDERS,2,Moderate,Major,Surgical,Blue Cross/Blue Shield,,,,,Y,136675.12,20224.20
Long Island,Nassau,2951001,000541,North Shore University Hospital,30 to 49,113,M,White,Not Span/Hispanic,1,Emergency,Home or Self Care,2022,SYM016,Other general signs and symptoms,LYM001,LYMPH NODE BIOPSY,651,OTHER PROCEDURES OF BLOOD AND BLOOD-FORMING ORGANS,16,DISEASES AND DISORDERS OF THE BLOOD AND BLOOD FORMING ORGANS AND IMMUNOLOGICAL DISORDERS,3,Major,Major,Surgical,Medicaid,Medicaid,,,,Y,68613.23,12880.97
New York City,Manhattan,7002053,001463,NYU Langone Hospitals,50 to 69,OOS,M,White,Not Span/Hispanic,1,Elective,Home or Self Care,2022,NEO073,Benign neoplasms,LYM004,THYMECTOMY,651,OTHER PROCEDURES OF BLOOD AND BLOOD-FORMING ORGANS,16,DISEASES AND DISORDERS OF THE BLOOD AND BLOOD FORMING ORGANS AND IMMUNOLOGICAL DISORDERS,2,Moderate,Minor,Surgical,Private Health Insurance,,,,,N,105678.97,17699.04
New York City,Manhattan,7002053,001463,NYU Langone Hospitals,50 to 69,113,M,White,Not Span/Hispanic,1,Elective,Home or Self Care,2022,SYM016,Other general signs and symptoms,LYM003,LYMPH NODE DISSECTION,651,OTHER PROCEDURES OF BLOOD AND BLOOD-FORMING ORGANS,16,DISEASES AND DISORDERS OF THE BLOOD AND BLOOD FORMING ORGANS AND IMMUNOLOGICAL DISORDERS,1,Minor,Moderate,Surgical,Medicaid,,,,,N,134418.71,21290.90
Long Island,Nassau,2951001,000541,North Shore University Hospital,50 to 69,115,F,White,Not Span/Hispanic,3,Emergency,Home or Self Care,2022,SYM016,Other general signs and symptoms,LYM001,LYMPH NODE BIOPSY,651,OTHER PROCEDURES OF BLOOD AND BLOOD-FORMING ORGANS,16,DISEASES AND DISORDERS OF THE BLOOD AND BLOOD FORMING ORGANS AND IMMUNOLOGICAL DISORDERS,2,Moderate,Minor,Surgical,Blue Cross/Blue Shield,Medicare,Private Health Insurance,,,Y,118743.13,17766.40
Hudson Valley,Dutchess,1302001,000181,Vassar Brothers Medical Center,70 or Older,125,M,White,Not Span/Hispanic,5,Emergency,Home or Self Care,2022,SYM016,Other general signs and symptoms,LYM001,LYMPH NODE BIOPSY,651,OTHER PROCEDURES OF BLOOD AND BLOOD-FORMING ORGANS,16,DISEASES AND DISORDERS OF THE BLOOD AND BLOOD FORMING ORGANS AND IMMUNOLOGICAL DISORDERS,3,Major,Major,Surgical,Medicare,Blue Cross/Blue Shield,,,,Y,47582.15,16330.82
Hudson Valley,Dutchess,1302001,000181,Vassar Brothers Medical Center,70 or Older,125,M,White,Unknown,6,Emergency,Home or Self Care,2022,SYM016,Other general signs and symptoms,LYM001,LYMPH NODE BIOPSY,651,OTHER PROCEDURES OF BLOOD AND BLOOD-FORMING ORGANS,16,DISEASES AND DISORDERS OF THE BLOOD AND BLOOD FORMING ORGANS AND IMMUNOLOGICAL DISORDERS,3,Major,Major,Surgical,Medicare,"Managed Care, Unspecified",,,,Y,49373.55,14722.46
New York City,Manhattan,7002053,001463,NYU Langone Hospitals,30 to 49,100,M,Other Race,Not Span/Hispanic,1,Elective,Home or Self Care,2022,END015,Other specified and unspecified endocrine disorders,LYM004,THYMECTOMY,651,OTHER PROCEDURES OF BLOOD AND BLOOD-FORMING ORGANS,16,DISEASES AND DISORDERS OF THE BLOOD AND BLOOD FORMING ORGANS AND IMMUNOLOGICAL DISORDERS,2,Moderate,Minor,Surgical,Medicaid,,,,,N,116116.23,19388.57
New York City,Manhattan,7002001,001438,Bellevue Hospital Center,30 to 49,112,M,Black/African American,Spanish/Hispanic,6,Emergency,Home or Self Care,2022,SYM016,Other general signs and symptoms,LYM001,LYMPH NODE BIOPSY,651,OTHER PROCEDURES OF BLOOD AND BLOOD-FORMING ORGANS,16,DISEASES AND DISORDERS OF THE BLOOD AND BLOOD FORMING ORGANS AND IMMUNOLOGICAL DISORDERS,1,Minor,Minor,Surgical,Self-Pay,,,,,Y,55731.11,32050.07
Finger Lakes,Monroe,2701005,000413,Strong Memorial Hospital,30 to 49,146,F,White,Not Span/Hispanic,1,Emergency,Home or Self Care,2022,SKN001,Skin and subcutaneous tissue infections,LYM001,LYMPH NODE BIOPSY,651,OTHER PROCEDURES OF BLOOD AND BLOOD-FORMING ORGANS,16,DISEASES AND DISORDERS OF THE BLOOD AND BLOOD FORMING ORGANS AND IMMUNOLOGICAL DISORDERS,1,Minor,Minor,Surgical,Medicaid,,,,,Y,22331.06,6750.31
New York City,Manhattan,7002053,001463,NYU Langone Hospitals,30 to 49,112,M,White,Not Span/Hispanic,3,Emergency,Home or Self Care,2022,END015,Other specified and unspecified endocrine disorders,LYM004,THYMECTOMY,651,OTHER PROCEDURES OF BLOOD AND BLOOD-FORMING ORGANS,16,DISEASES AND DISORDERS OF THE BLOOD AND BLOOD FORMING ORGANS AND IMMUNOLOGICAL DISORDERS,2,Moderate,Minor,Surgical,Medicaid,,,,,Y,159054.28,30169.80
New York City,Manhattan,7002053,001463,NYU Langone Hospitals,30 to 49,112,F,Black/African American,Not Span/Hispanic,1,Elective,Home or Self Care,2022,END015,Other specified and unspecified endocrine disorders,LYM004,THYMECTOMY,651,OTHER PROCEDURES OF BLOOD AND BLOOD-FORMING ORGANS,16,DISEASES AND DISORDERS OF THE BLOOD AND BLOOD FORMING ORGANS AND IMMUNOLOGICAL DISORDERS,2,Moderate,Moderate,Surgical,Blue Cross/Blue Shield,,,,,N,128886.02,20886.09
Hudson Valley,Dutchess,1302001,000181,Vassar Brothers Medical Center,50 to 69,124,F,White,Not Span/Hispanic,1,Elective,Home or Self Care,2022,END015,Other specified and unspecified endocrine disorders,LYM004,THYMECTOMY,651,OTHER PROCEDURES OF BLOOD AND BLOOD-FORMING ORGANS,16,DISEASES AND DISORDERS OF THE BLOOD AND BLOOD FORMING ORGANS AND IMMUNOLOGICAL DISORDERS,2,Moderate,Minor,Surgical,Medicaid,,,,,N,28760.24,11203.67
Hudson Valley,Dutchess,1302001,000181,Vassar Brothers Medical Center,70 or Older,126,M,White,Not Span/Hispanic,4,Elective,Home or Self Care,2022,SYM016,Other general signs and symptoms,LYM001,LYMPH NODE BIOPSY,651,OTHER PROCEDURES OF BLOOD AND BLOOD-FORMING ORGANS,16,DISEASES AND DISORDERS OF THE BLOOD AND BLOOD FORMING ORGANS AND IMMUNOLOGICAL DISORDERS,1,Minor,Minor,Surgical,Medicare,Federal/State/Local/VA,,,,N,33895.63,12028.83
New York City,Manhattan,7002053,001463,NYU Langone Hospitals,50 to 69,112,F,White,Not Span/Hispanic,1,Elective,Home or Self Care,2022,END015,Other specified and unspecified endocrine disorders,LYM004,THYMECTOMY,651,OTHER PROCEDURES OF BLOOD AND BLOOD-FORMING ORGANS,16,DISEASES AND DISORDERS OF THE BLOOD AND BLOOD FORMING ORGANS AND IMMUNOLOGICAL DISORDERS,2,Moderate,Minor,Surgical,Private Health Insurance,,,,,N,102955.14,17373.34
Finger Lakes,Monroe,2701005,000413,Strong Memorial Hospital,50 to 69,146,F,White,Not Span/Hispanic,2,Elective,Home or Self Care,2022,NEO073,Benign neoplasms,LYM004,THYMECTOMY,651,OTHER PROCEDURES OF BLOOD AND BLOOD-FORMING ORGANS,16,DISEASES AND DISORDERS OF THE BLOOD AND BLOOD FORMING ORGANS AND IMMUNOLOGICAL DISORDERS,1,Minor,Minor,Surgical,Medicare,Medicaid,,,,N,38522.84,18012.63
New York City,Manhattan,7002053,001463,NYU Langone Hospitals,30 to 49,113,M,White,Not Span/Hispanic,1,Elective,Home or Self Care,2022,SYM016,Other general signs and symptoms,LYM001,LYMPH NODE BIOPSY,651,OTHER PROCEDURES OF BLOOD AND BLOOD-FORMING ORGANS,16,DISEASES AND DISORDERS OF THE BLOOD AND BLOOD FORMING ORGANS AND IMMUNOLOGICAL DISORDERS,1,Minor,Minor,Surgical,Medicaid,,,,,N,116470.10,18543.07
New York City,Manhattan,7002053,001463,NYU Langone Hospitals,70 or Older,112,M,Other Race,Not Span/Hispanic,1,Elective,Home or Self Care,2022,NEO073,Benign neoplasms,LYM004,THYMECTOMY,651,OTHER PROCEDURES OF BLOOD AND BLOOD-FORMING ORGANS,16,DISEASES AND DISORDERS OF THE BLOOD AND BLOOD FORMING ORGANS AND IMMUNOLOGICAL DISORDERS,2,Moderate,Minor,Surgical,Medicare,Private Health Insurance,,,,N,109311.31,18032.19
Hudson Valley,Dutchess,1302001,000181,Vassar Brothers Medical Center,18 to 29,126,F,Other Race,Not Span/Hispanic,7,Emergency,Home or Self Care,2022,SYM017,Abnormal findings without diagnosis,LYM001,LYMPH NODE BIOPSY,651,OTHER PROCEDURES OF BLOOD AND BLOOD-FORMING ORGANS,16,DISEASES AND DISORDERS OF THE BLOOD AND BLOOD FORMING ORGANS AND IMMUNOLOGICAL DISORDERS,4,Extreme,Moderate,Surgical,Private Health Insurance,,,,,Y,49669.17,13425.99
New York City,Manhattan,7002053,001463,NYU Langone Hospitals,70 or Older,OOS,F,White,Not Span/Hispanic,1,Elective,Home or Self Care,2022,END015,Other specified and unspecified endocrine disorders,LYM004,THYMECTOMY,651,OTHER PROCEDURES OF BLOOD AND BLOOD-FORMING ORGANS,16,DISEASES AND DISORDERS OF THE BLOOD AND BLOOD FORMING ORGANS AND IMMUNOLOGICAL DISORDERS,2,Moderate,Moderate,Surgical,Medicare,Medicare,,,,N,116831.01,18696.18
New York City,Manhattan,7002054,001464,New York-Presbyterian Hospital - Columbia Presbyterian Center,50 to 69,109,M,White,Not Span/Hispanic,1,Elective,Home or Self Care,2022,END015,Other specified and unspecified endocrine disorders,LYM004,THYMECTOMY,651,OTHER PROCEDURES OF BLOOD AND BLOOD-FORMING ORGANS,16,DISEASES AND DISORDERS OF THE BLOOD AND BLOOD FORMING ORGANS AND IMMUNOLOGICAL DISORDERS,1,Minor,Minor,Surgical,Blue Cross/Blue Shield,,,,,N,61116.84,23140.63
New York City,Manhattan,7002053,001463,NYU Langone Hospitals,50 to 69,OOS,F,Other Race,Not Span/Hispanic,1,Elective,Home or Self Care,2022,BLD007,Diseases of white blood cells,CAR021,"ARTERY, VEIN, AND GREAT VESSEL PROCEDURES, NEC",651,OTHER PROCEDURES OF BLOOD AND BLOOD-FORMING ORGANS,16,DISEASES AND DISORDERS OF THE BLOOD AND BLOOD FORMING ORGANS AND IMMUNOLOGICAL DISORDERS,2,Moderate,Moderate,Surgical,Blue Cross/Blue Shield,,,,,N,146388.51,22869.64
Long Island,Nassau,2951001,000541,North Shore University Hospital,70 or Older,110,M,White,Not Span/Hispanic,5,Emergency,Home or Self Care,2022,SKN001,Skin and subcutaneous tissue infections,LYM001,LYMPH NODE BIOPSY,651,OTHER PROCEDURES OF BLOOD AND BLOOD-FORMING ORGANS,16,DISEASES AND DISORDERS OF THE BLOOD AND BLOOD FORMING ORGANS AND IMMUNOLOGICAL DISORDERS,4,Extreme,Moderate,Surgical,Private Health Insurance,,,,,Y,108905.76,17131.02
New York City,Manhattan,7002053,001463,NYU Langone Hospitals,50 to 69,OOS,M,White,Not Span/Hispanic,1,Elective,Home or Self Care,2022,END015,Other specified and unspecified endocrine disorders,LYM004,THYMECTOMY,651,OTHER PROCEDURES OF BLOOD AND BLOOD-FORMING ORGANS,16,DISEASES AND DISORDERS OF THE BLOOD AND BLOOD FORMING ORGANS AND IMMUNOLOGICAL DISORDERS,2,Moderate,Minor,Surgical,Private Health Insurance,,,,,N,112343.98,18395.62
New York City,Manhattan,7002054,001464,New York-Presbyterian Hospital - Columbia Presbyterian Center,30 to 49,114,M,Black/African American,Not Span/Hispanic,38,Emergency,Home w/ Home Health Services,2022,CIR039,Other specified diseases of veins and lymphatics,LYM002,LYMPH NODE EXCISION (THERAPEUTIC),651,OTHER PROCEDURES OF BLOOD AND BLOOD-FORMING ORGANS,16,DISEASES AND DISORDERS OF THE BLOOD AND BLOOD FORMING ORGANS AND IMMUNOLOGICAL DISORDERS,4,Extreme,Extreme,Surgical,Blue Cross/Blue Shield,,,,,Y,950473.46,427084.24
New York City,Manhattan,7002053,001463,NYU Langone Hospitals,0 to 17,103,M,Other Race,Not Span/Hispanic,6,Emergency,Home or Self Care,2022,BLD002,Hemolytic anemia,ADM001,TRANSFUSION OF BLOOD AND BLOOD PRODUCTS,651,OTHER PROCEDURES OF BLOOD AND BLOOD-FORMING ORGANS,16,DISEASES AND DISORDERS OF THE BLOOD AND BLOOD FORMING ORGANS AND IMMUNOLOGICAL DISORDERS,4,Extreme,Major,Surgical,Medicaid,,,,,Y,206130.23,43494.69
New York City,Manhattan,7002053,001463,NYU Langone Hospitals,50 to 69,111,F,White,Not Span/Hispanic,1,Elective,Home or Self Care,2022,END015,Other specified and unspecified endocrine disorders,LYM004,THYMECTOMY,651,OTHER PROCEDURES OF BLOOD AND BLOOD-FORMING ORGANS,16,DISEASES AND DISORDERS OF THE BLOOD AND BLOOD FORMING ORGANS AND IMMUNOLOGICAL DISORDERS,2,Moderate,Minor,Surgical,Blue Cross/Blue Shield,,,,,N,133864.66,21428.97
New York City,Manhattan,7002054,001464,New York-Presbyterian Hospital - Columbia Presbyterian Center,30 to 49,OOS,M,White,Spanish/Hispanic,17,Elective,Home or Self Care,2022,SKN001,Skin and subcutaneous tissue infections,LYM001,LYMPH NODE BIOPSY,651,OTHER PROCEDURES OF BLOOD AND BLOOD-FORMING ORGANS,16,DISEASES AND DISORDERS OF THE BLOOD AND BLOOD FORMING ORGANS AND IMMUNOLOGICAL DISORDERS,3,Major,Major,Surgical,Medicare,,,,,N,351683.55,78754.70
Hudson Valley,Dutchess,1302001,000181,Vassar Brothers Medical Center,50 to 69,125,M,White,Not Span/Hispanic,60,Emergency,Short-term Hospital,2022,BLD007,Diseases of white blood cells,LYM001,LYMPH NODE BIOPSY,651,OTHER PROCEDURES OF BLOOD AND BLOOD-FORMING ORGANS,16,DISEASES AND DISORDERS OF THE BLOOD AND BLOOD FORMING ORGANS AND IMMUNOLOGICAL DISORDERS,4,Extreme,Major,Surgical,Medicare,Blue Cross/Blue Shield,,,,Y,434557.59,135113.79
Long Island,Nassau,2951001,000541,North Shore University Hospital,30 to 49,115,F,White,Not Span/Hispanic,4,Emergency,Home or Self Care,2022,SKN001,Skin and subcutaneous tissue infections,LYM001,LYMPH NODE BIOPSY,651,OTHER PROCEDURES OF BLOOD AND BLOOD-FORMING ORGANS,16,DISEASES AND DISORDERS OF THE BLOOD AND BLOOD FORMING ORGANS AND IMMUNOLOGICAL DISORDERS,1,Minor,Minor,Surgical,Private Health Insurance,,,,,Y,72931.11,11651.13
Long Island,Nassau,2951001,000541,North Shore University Hospital,30 to 49,117,F,Other Race,Not Span/Hispanic,17,Emergency,Home or Self Care,2022,BLD007,Diseases of white blood cells,ESA001,HEMODIALYSIS,651,OTHER PROCEDURES OF BLOOD AND BLOOD-FORMING ORGANS,16,DISEASES AND DISORDERS OF THE BLOOD AND BLOOD FORMING ORGANS AND IMMUNOLOGICAL DISORDERS,3,Major,Major,Surgical,Medicaid,Medicaid,,,,Y,301227.53,65357.45
New York City,Manhattan,7002001,001438,Bellevue Hospital Center,30 to 49,113,M,Black/African American,Unknown,1,Elective,Home or Self Care,2022,SYM016,Other general signs and symptoms,LYM001,LYMPH NODE BIOPSY,651,OTHER PROCEDURES OF BLOOD AND BLOOD-FORMING ORGANS,16,DISEASES AND DISORDERS OF THE BLOOD AND BLOOD FORMING ORGANS AND IMMUNOLOGICAL DISORDERS,2,Moderate,Moderate,Surgical,Medicaid,,,,,N,11702.31,6729.81
